db-derby-dev mailing list archives: April 2013

Site index · List index
Message list« Previous · 1 · 2 · 3 · 4 · 5 · 6 · 7 · 8 · 9 · 10 · 11 · 12 · Next »Thread · Author · Date
Mike Matrigali (JIRA) [jira] [Updated] (DERBY-3861) 'testAutoNetworkServerBoot' fails with 'Network Server state incorrect expected:<false> but was:<true>' Wed, 03 Apr, 00:41
Mike Matrigali (JIRA) [jira] [Created] (DERBY-6143) nightly regression test failure: cs_FailedStreamInsertCharBufferBoundaries(org.apache.derbyTesting.functionTests.tests.jdbcapi.Derby2017LayerATest)java.io.IOException Wed, 03 Apr, 00:49
Mike Matrigali (JIRA) [jira] [Commented] (DERBY-6092) testPositionAgressive(org.apache.derbyTesting.functionTests.tests.jdbcapi.BlobClob4BlobTest)j fails with : 'The handle is invalid.: java.io.IOException'. Wed, 03 Apr, 00:53
Mike Matrigali (JIRA) [jira] [Updated] (DERBY-6092) testPositionAgressive(org.apache.derbyTesting.functionTests.tests.jdbcapi.BlobClob4BlobTest)j fails with : 'The handle is invalid.: java.io.IOException'. Wed, 03 Apr, 00:55
Mike Matrigali (JIRA) [jira] [Updated] (DERBY-6122) InterruptResilienceTest fails with: junit.framework.ComparisonFailure: Database shutdown expected:<[08006]> but was:<[XBDA0]> Wed, 03 Apr, 00:59
Mike Matrigali (JIRA) [jira] [Commented] (DERBY-6122) InterruptResilienceTest fails with: junit.framework.ComparisonFailure: Database shutdown expected:<[08006]> but was:<[XBDA0]> Wed, 03 Apr, 00:59
Mike Matrigali (JIRA) [jira] [Commented] (DERBY-6092) testPositionAgressive(org.apache.derbyTesting.functionTests.tests.jdbcapi.BlobClob4BlobTest)j fails with : 'The handle is invalid.: java.io.IOException'. Wed, 03 Apr, 01:02
Mike Matrigali (JIRA) [jira] [Commented] (DERBY-5866) testFiringConstraintOrder(org.apache.derbyTesting.functionTests.tests.lang.TriggerTest)junit.framework.AssertionFailedError: matching triggers need to be fired in order creation:1,NO CASCADE BEFORE,DELETE,ROW Wed, 03 Apr, 01:04
Mike Matrigali (JIRA) [jira] [Updated] (DERBY-5866) testFiringConstraintOrder(org.apache.derbyTesting.functionTests.tests.lang.TriggerTest)junit.framework.AssertionFailedError: matching triggers need to be fired in order creation:1,NO CASCADE BEFORE,DELETE,ROW Wed, 03 Apr, 01:04
Mike Matrigali (JIRA) [jira] [Commented] (DERBY-6092) testPositionAgressive(org.apache.derbyTesting.functionTests.tests.jdbcapi.BlobClob4BlobTest)j fails with : 'The handle is invalid.: java.io.IOException'. Wed, 03 Apr, 01:08
Mike Matrigali (JIRA) [jira] [Commented] (DERBY-6143) nightly regression test failure: cs_FailedStreamInsertCharBufferBoundaries(org.apache.derbyTesting.functionTests.tests.jdbcapi.Derby2017LayerATest)java.io.IOException Wed, 03 Apr, 01:10
Mike Matrigali (JIRA) [jira] [Created] (DERBY-6144) nightly regression test failure, intermittent error : testStatisticsCorrectness(org.apache.derbyTesting.functionTests.tests.store.AutomaticIndexStatisticsTest)junit.framework.AssertionFailedError Wed, 03 Apr, 01:20
Mike Matrigali (JIRA) [jira] [Commented] (DERBY-5866) testFiringConstraintOrder(org.apache.derbyTesting.functionTests.tests.lang.TriggerTest)junit.framework.AssertionFailedError: matching triggers need to be fired in order creation:1,NO CASCADE BEFORE,DELETE,ROW Wed, 03 Apr, 01:55
Mike Matrigali (JIRA) [jira] [Commented] (DERBY-5800) test failure in AutoloadTest; AssertionFailedError: Test process failed:Spawned caused by SQLNonTransientConnectionException - Software caused connection abort: recv failed. Wed, 03 Apr, 01:59
Mike Matrigali (JIRA) [jira] [Updated] (DERBY-5800) test failure in AutoloadTest; AssertionFailedError: Test process failed:Spawned caused by SQLNonTransientConnectionException - Software caused connection abort: recv failed. Wed, 03 Apr, 01:59
Mike Matrigali (JIRA) [jira] [Created] (DERBY-6145) intermittent nightly regression test failures: Wed, 03 Apr, 02:05
Mike Matrigali (JIRA) [jira] [Updated] (DERBY-6145) intermittent nightly regression test failures: testDERBY5289TriggerUpgradeFormat(org.apache.derbyTesting.functionTests.tests.upgradeTests.BasicSetup)junit.framework.AssertionFailedError: Unexpected row count: expected:<1> but was:<2> Wed, 03 Apr, 02:07
Mike Matrigali (JIRA) [jira] [Commented] (DERBY-5689) Test failure: testTriggerNegative(org.apache.derbyTesting.functionTests.tests.lang.ProcedureInTriggerTest)java.sql.SQLException: Operation 'CREATE TRIGGER' cannot be performed on object 'T1' because there is an open ResultSet dependent on that object Wed, 03 Apr, 02:11
Mike Matrigali (JIRA) [jira] [Created] (DERBY-6146) nightly regression test failure: testMultipleLastKeyWaitsInMaxScan(org.apache.derbyTesting.functionTests.tests.store.IndexSplitDeadlockTest)junit.framework.AssertionFailedError: Column value mismatch @ column '1', Wed, 03 Apr, 02:35
Mike Matrigali (JIRA) [jira] [Updated] (DERBY-6131) select from view with "upper" and "in" list throws a ClassCastException Wed, 03 Apr, 18:35
Mike Matrigali (JIRA) [jira] [Commented] (DERBY-6131) select from view with "upper" and "in" list throws a ClassCastException Wed, 03 Apr, 18:41
Mike Matrigali (JIRA) [jira] [Commented] (DERBY-6131) select from view with "upper" and "in" list throws a ClassCastException Wed, 03 Apr, 18:51
Mike Matrigali (JIRA) [jira] [Updated] (DERBY-6142) nightly regression test failure: testCorrectClobDataWithMultiCall(org.apache.derbyTesting.functionTests.tests.jdbcapi.LobRsGetterTest)java.sql.SQLException: Java exception: 'The handle is invalid.: java.io.IOException'. Wed, 03 Apr, 20:57
Mike Matrigali (JIRA) [jira] [Updated] (DERBY-6141) testReplication_Local_3_p5_DERBY_3878 failed in nightly regression test run with AssertionFailedError: Server did not start in time Wed, 03 Apr, 21:01
Mike Matrigali (JIRA) [jira] [Commented] (DERBY-6131) select from view with "upper" and "in" list throws a ClassCastException Thu, 04 Apr, 15:29
Mike Matrigali (JIRA) [jira] [Commented] (DERBY-6131) select from view with "upper" and "in" list throws a ClassCastException Thu, 04 Apr, 15:31
Mike Matrigali (JIRA) [jira] [Updated] (DERBY-6131) select from view with "upper" and "in" list throws a ClassCastException Thu, 04 Apr, 15:31
Mike Matrigali (JIRA) [jira] [Commented] (DERBY-6092) testPositionAgressive(org.apache.derbyTesting.functionTests.tests.jdbcapi.BlobClob4BlobTest)j fails with : 'The handle is invalid.: java.io.IOException'. Fri, 05 Apr, 17:45
Mike Matrigali (JIRA) [jira] [Commented] (DERBY-6092) testPositionAgressive(org.apache.derbyTesting.functionTests.tests.jdbcapi.BlobClob4BlobTest)j fails with : 'The handle is invalid.: java.io.IOException'. Fri, 05 Apr, 17:47
Mike Matrigali (JIRA) [jira] [Commented] (DERBY-6092) testPositionAgressive(org.apache.derbyTesting.functionTests.tests.jdbcapi.BlobClob4BlobTest)j fails with : 'The handle is invalid.: java.io.IOException'. Fri, 05 Apr, 17:51
Mike Matrigali (JIRA) [jira] [Updated] (DERBY-6144) nightly regression test failure, intermittent error : testStatisticsCorrectness(org.apache.derbyTesting.functionTests.tests.store.AutomaticIndexStatisticsTest)junit.framework.AssertionFailedError Fri, 05 Apr, 18:43
Mike Matrigali (JIRA) [jira] [Updated] (DERBY-6142) nightly regression test failure: testCorrectClobDataWithMultiCall(org.apache.derbyTesting.functionTests.tests.jdbcapi.LobRsGetterTest)java.sql.SQLException: Java exception: 'The handle is invalid.: java.io.IOException'. Fri, 05 Apr, 18:45
Mike Matrigali (JIRA) [jira] [Updated] (DERBY-6143) nightly regression test failure: cs_FailedStreamInsertCharBufferBoundaries(org.apache.derbyTesting.functionTests.tests.jdbcapi.Derby2017LayerATest)java.io.IOException Fri, 05 Apr, 18:45
Mike Matrigali (JIRA) [jira] [Commented] (DERBY-6141) testReplication_Local_3_p5_DERBY_3878 failed in nightly regression test run with AssertionFailedError: Server did not start in time Fri, 05 Apr, 18:49
Mike Matrigali (JIRA) [jira] [Commented] (DERBY-6126) compatibility._Suite fails if derbyTesting.jar lives in different directory than product jars Fri, 05 Apr, 18:51
Mike Matrigali (JIRA) [jira] [Commented] (DERBY-6140) nightly regression test failure in derbyall/CompatibilityTest - connection failed Fri, 05 Apr, 18:51
Mike Matrigali (JIRA) [jira] [Updated] (DERBY-6124) Marshalling error in JDBCDriverTest as part of CompatibilityTest Fri, 05 Apr, 18:53
Mike Matrigali (JIRA) [jira] [Updated] (DERBY-6122) InterruptResilienceTest fails with: junit.framework.ComparisonFailure: Database shutdown expected:<[08006]> but was:<[XBDA0]> Fri, 05 Apr, 18:57
Mike Matrigali (JIRA) [jira] [Updated] (DERBY-6113) Create optional tool for compressing all tables Fri, 05 Apr, 18:59
Mike Matrigali (JIRA) [jira] [Updated] (DERBY-6114) OOME in XAMemTest.testDerby4137_TransactionTimeoutSpecifiedNotExceeded Fri, 05 Apr, 18:59
Mike Matrigali (JIRA) [jira] [Commented] (DERBY-6101) NetworkServerTestSetup.getTimeoutErrorMsg may reflect wrong port number Fri, 05 Apr, 19:01
Mike Matrigali (JIRA) [jira] [Updated] (DERBY-6092) testPositionAgressive(org.apache.derbyTesting.functionTests.tests.jdbcapi.BlobClob4BlobTest)j fails with : 'The handle is invalid.: java.io.IOException'. Fri, 05 Apr, 19:05
Mike Matrigali (JIRA) [jira] [Commented] (DERBY-6067) JaCoCo fails with missing permissions when writing results Fri, 05 Apr, 19:07
Mike Matrigali (JIRA) [jira] [Commented] (DERBY-6019) hang after connect reset error in (emb)replicationTests.ReplicationRun_Local_3_p5.testReplication_Local_3_p5_DERBY_3878 Fri, 05 Apr, 19:51
Mike Matrigali (JIRA) [jira] [Commented] (DERBY-5970) Check that connection attributes have legal values. Fri, 05 Apr, 19:53
Mike Matrigali (JIRA) [jira] [Commented] (DERBY-5965) TimeHandlingTest.testCurrentTimestamp() failed: CURRENT TIME after end of statement Fri, 05 Apr, 19:57
Mike Matrigali (JIRA) [jira] [Commented] (DERBY-5875) Derby returns wrong results when you set the ESCAPE character to NULL in a LIKE clause. Fri, 05 Apr, 20:09
Mike Matrigali (JIRA) [jira] [Updated] (DERBY-5875) Derby returns wrong results when you set the ESCAPE character to NULL in a LIKE clause. Fri, 05 Apr, 20:09
Mike Matrigali (JIRA) [jira] [Commented] (DERBY-6092) testPositionAgressive(org.apache.derbyTesting.functionTests.tests.jdbcapi.BlobClob4BlobTest)j fails with : 'The handle is invalid.: java.io.IOException'. Fri, 05 Apr, 22:17
Mike Matrigali (JIRA) [jira] [Updated] (DERBY-6092) testPositionAgressive(org.apache.derbyTesting.functionTests.tests.jdbcapi.BlobClob4BlobTest)j fails with : 'The handle is invalid.: java.io.IOException'. Fri, 05 Apr, 22:23
Mike Matrigali (JIRA) [jira] [Commented] (DERBY-6092) testPositionAgressive(org.apache.derbyTesting.functionTests.tests.jdbcapi.BlobClob4BlobTest)j fails with : 'The handle is invalid.: java.io.IOException'. Sat, 06 Apr, 15:49
Mike Matrigali (JIRA) [jira] [Commented] (DERBY-6092) testPositionAgressive(org.apache.derbyTesting.functionTests.tests.jdbcapi.BlobClob4BlobTest)j fails with : 'The handle is invalid.: java.io.IOException'. Sat, 06 Apr, 15:51
Mike Matrigali (JIRA) [jira] [Updated] (DERBY-6131) select from view with "upper" and "in" list throws a ClassCastException Sat, 06 Apr, 15:59
Mike Matrigali (JIRA) [jira] [Updated] (DERBY-6131) select from view with "upper" and "in" list throws a ClassCastException Sat, 06 Apr, 16:05
Mike Matrigali (JIRA) [jira] [Commented] (DERBY-6092) testPositionAgressive(org.apache.derbyTesting.functionTests.tests.jdbcapi.BlobClob4BlobTest)j fails with : 'The handle is invalid.: java.io.IOException'. Sun, 07 Apr, 22:37
Mike Matrigali (JIRA) [jira] [Updated] (DERBY-6131) select from view with "upper" and "in" list throws a ClassCastException Mon, 08 Apr, 00:59
Mike Matrigali (JIRA) [jira] [Commented] (DERBY-6092) testPositionAgressive(org.apache.derbyTesting.functionTests.tests.jdbcapi.BlobClob4BlobTest)j fails with : 'The handle is invalid.: java.io.IOException'. Mon, 08 Apr, 17:01
Mike Matrigali (JIRA) [jira] [Updated] (DERBY-6092) testPositionAgressive(org.apache.derbyTesting.functionTests.tests.jdbcapi.BlobClob4BlobTest)j fails with : 'The handle is invalid.: java.io.IOException'. Mon, 08 Apr, 17:07
Mike Matrigali (JIRA) [jira] [Created] (DERBY-6154) add non-order by cases to the BlobClob4BlobTest Mon, 08 Apr, 17:11
Mike Matrigali (JIRA) [jira] [Commented] (DERBY-6092) testPositionAgressive(org.apache.derbyTesting.functionTests.tests.jdbcapi.BlobClob4BlobTest)j fails with : 'The handle is invalid.: java.io.IOException'. Mon, 08 Apr, 18:27
Mike Matrigali (JIRA) [jira] [Commented] (DERBY-6092) testPositionAgressive(org.apache.derbyTesting.functionTests.tests.jdbcapi.BlobClob4BlobTest)j fails with : 'The handle is invalid.: java.io.IOException'. Mon, 08 Apr, 19:27
Mike Matrigali (JIRA) [jira] [Comment Edited] (DERBY-6092) testPositionAgressive(org.apache.derbyTesting.functionTests.tests.jdbcapi.BlobClob4BlobTest)j fails with : 'The handle is invalid.: java.io.IOException'. Mon, 08 Apr, 19:29
Mike Matrigali (JIRA) [jira] [Commented] (DERBY-6092) testPositionAgressive(org.apache.derbyTesting.functionTests.tests.jdbcapi.BlobClob4BlobTest)j fails with : 'The handle is invalid.: java.io.IOException'. Mon, 08 Apr, 19:41
Mike Matrigali (JIRA) [jira] [Updated] (DERBY-6092) testPositionAgressive(org.apache.derbyTesting.functionTests.tests.jdbcapi.BlobClob4BlobTest)j fails with : 'The handle is invalid.: java.io.IOException'. Mon, 08 Apr, 19:43
Mike Matrigali (JIRA) [jira] [Commented] (DERBY-6122) InterruptResilienceTest fails with: junit.framework.ComparisonFailure: Database shutdown expected:<[08006]> but was:<[XBDA0]> Mon, 08 Apr, 19:55
Mike Matrigali (JIRA) [jira] [Commented] (DERBY-6092) testPositionAgressive(org.apache.derbyTesting.functionTests.tests.jdbcapi.BlobClob4BlobTest)j fails with : 'The handle is invalid.: java.io.IOException'. Mon, 08 Apr, 21:23
Mike Matrigali (JIRA) [jira] [Commented] (DERBY-6122) InterruptResilienceTest fails with: junit.framework.ComparisonFailure: Database shutdown expected:<[08006]> but was:<[XBDA0]> Mon, 08 Apr, 21:27
Mike Matrigali (JIRA) [jira] [Commented] (DERBY-6122) InterruptResilienceTest fails with: junit.framework.ComparisonFailure: Database shutdown expected:<[08006]> but was:<[XBDA0]> Mon, 08 Apr, 21:44
Mike Matrigali (JIRA) [jira] [Comment Edited] (DERBY-6122) InterruptResilienceTest fails with: junit.framework.ComparisonFailure: Database shutdown expected:<[08006]> but was:<[XBDA0]> Mon, 08 Apr, 22:08
Mike Matrigali (JIRA) [jira] [Created] (DERBY-6155) testRAFWriteInterrupted(org.apache.derbyTesting.functionTests.tests.store.InterruptResilienceTest)java.sql.SQLException: The exception 'junit.fram ework.AssertionFailedError: interrupt flag lost' was thrown while evaluating an expression. Mon, 08 Apr, 22:48
Mike Matrigali (JIRA) [jira] [Updated] (DERBY-6155) testRAFWriteInterrupted(org.apache.derbyTesting.functionTests.tests.store.InterruptResilienceTest)java.sql.SQLException: The exception 'junit.fram ework.AssertionFailedError: interrupt flag lost' was thrown while evaluating an expression. Mon, 08 Apr, 22:50
Mike Matrigali (JIRA) [jira] [Commented] (DERBY-6155) testRAFWriteInterrupted(org.apache.derbyTesting.functionTests.tests.store.InterruptResilienceTest)java.sql.SQLException: The exception 'junit.fram ework.AssertionFailedError: interrupt flag lost' was thrown while evaluating an expression. Mon, 08 Apr, 22:52
Mike Matrigali (JIRA) [jira] [Updated] (DERBY-6155) testRAFWriteInterrupted(org.apache.derbyTesting.functionTests.tests.store.InterruptResilienceTest)java.sql.SQLException: The exception 'junit.fram ework.AssertionFailedError: interrupt flag lost' was thrown while evaluating an expression. Mon, 08 Apr, 22:58
Mike Matrigali (JIRA) [jira] [Updated] (DERBY-6155) testRAFWriteInterrupted(org.apache.derbyTesting.functionTests.tests.store.InterruptResilienceTest)java.sql.SQLException: The exception 'junit.fram ework.AssertionFailedError: interrupt flag lost' was thrown while evaluating an expression. Mon, 08 Apr, 22:58
Mike Matrigali (JIRA) [jira] [Comment Edited] (DERBY-6155) testRAFWriteInterrupted(org.apache.derbyTesting.functionTests.tests.store.InterruptResilienceTest)java.sql.SQLException: The exception 'junit.fram ework.AssertionFailedError: interrupt flag lost' was thrown while evaluating an expression. Mon, 08 Apr, 23:00
Mike Matrigali (JIRA) [jira] [Updated] (DERBY-6155) testRAFWriteInterrupted(org.apache.derbyTesting.functionTests.tests.store.InterruptResilienceTest)java.sql.SQLException: The exception 'junit.fram ework.AssertionFailedError: interrupt flag lost' was thrown while evaluating an expression. Mon, 08 Apr, 23:10
Mike Matrigali (JIRA) [jira] [Updated] (DERBY-6155) testRAFWriteInterrupted(org.apache.derbyTesting.functionTests.tests.store.InterruptResilienceTest)java.sql.SQLException: The exception 'junit.fram ework.AssertionFailedError: interrupt flag lost' was thrown while evaluating an expression. Mon, 08 Apr, 23:12
Mike Matrigali (JIRA) [jira] [Updated] (DERBY-6155) testRAFWriteInterrupted(org.apache.derbyTesting.functionTests.tests.store.InterruptResilienceTest)java.sql.SQLException: The exception 'junit.fram ework.AssertionFailedError: interrupt flag lost' was thrown while evaluating an expression. Mon, 08 Apr, 23:16
Mike Matrigali (JIRA) [jira] [Updated] (DERBY-6155) testRAFWriteInterrupted(org.apache.derbyTesting.functionTests.tests.store.InterruptResilienceTest)java.sql.SQLException: The exception 'junit.framework.AssertionFailedError: interrupt flag lost' was thrown while evaluating an expression. Tue, 09 Apr, 00:06
Mike Matrigali (JIRA) [jira] [Updated] (DERBY-6155) testRAFWriteInterrupted(org.apache.derbyTesting.functionTests.tests.store.InterruptResilienceTest)java.sql.SQLException: The exception 'junit.framework.AssertionFailedError: interrupt flag lost' was thrown while evaluating an expression. Tue, 09 Apr, 00:06
Mike Matrigali (JIRA) [jira] [Commented] (DERBY-6122) InterruptResilienceTest fails with: junit.framework.ComparisonFailure: Database shutdown expected:<[08006]> but was:<[XBDA0]> Tue, 09 Apr, 01:41
Mike Matrigali (JIRA) [jira] [Commented] (DERBY-5866) testFiringConstraintOrder(org.apache.derbyTesting.functionTests.tests.lang.TriggerTest)junit.framework.AssertionFailedError: matching triggers need to be fired in order creation:1,NO CASCADE BEFORE,DELETE,ROW Tue, 09 Apr, 17:14
Mike Matrigali (JIRA) [jira] [Assigned] (DERBY-6122) InterruptResilienceTest fails with: junit.framework.ComparisonFailure: Database shutdown expected:<[08006]> but was:<[XBDA0]> Tue, 09 Apr, 17:40
Mike Matrigali (JIRA) [jira] [Commented] (DERBY-6092) testPositionAgressive(org.apache.derbyTesting.functionTests.tests.jdbcapi.BlobClob4BlobTest)j fails with : 'The handle is invalid.: java.io.IOException'. Tue, 09 Apr, 18:06
Mike Matrigali (JIRA) [jira] [Updated] (DERBY-6122) InterruptResilienceTest fails with: junit.framework.ComparisonFailure: Database shutdown expected:<[08006]> but was:<[XBDA0]> Tue, 09 Apr, 20:54
Mike Matrigali (JIRA) [jira] [Commented] (DERBY-6155) testRAFWriteInterrupted(org.apache.derbyTesting.functionTests.tests.store.InterruptResilienceTest)java.sql.SQLException: The exception 'junit.framework.AssertionFailedError: interrupt flag lost' was thrown while evaluating an expression. Tue, 09 Apr, 21:04
Mike Matrigali (JIRA) [jira] [Commented] (DERBY-6155) testRAFWriteInterrupted(org.apache.derbyTesting.functionTests.tests.store.InterruptResilienceTest)java.sql.SQLException: The exception 'junit.framework.AssertionFailedError: interrupt flag lost' was thrown while evaluating an expression. Tue, 09 Apr, 21:08
Mike Matrigali (JIRA) [jira] [Comment Edited] (DERBY-6155) testRAFWriteInterrupted(org.apache.derbyTesting.functionTests.tests.store.InterruptResilienceTest)java.sql.SQLException: The exception 'junit.framework.AssertionFailedError: interrupt flag lost' was thrown while evaluating an expression. Tue, 09 Apr, 21:18
Mike Matrigali (JIRA) [jira] [Resolved] (DERBY-6131) select from view with "upper" and "in" list throws a ClassCastException Wed, 10 Apr, 19:13
Mike Matrigali (JIRA) [jira] [Updated] (DERBY-6122) InterruptResilienceTest fails with: junit.framework.ComparisonFailure: Database shutdown expected:<[08006]> but was:<[XBDA0]> Wed, 10 Apr, 19:27
Mike Matrigali (JIRA) [jira] [Resolved] (DERBY-6122) InterruptResilienceTest fails with: junit.framework.ComparisonFailure: Database shutdown expected:<[08006]> but was:<[XBDA0]> Wed, 10 Apr, 19:29
Mike Matrigali (JIRA) [jira] [Commented] (DERBY-6144) nightly regression test failure, intermittent error : testStatisticsCorrectness(org.apache.derbyTesting.functionTests.tests.store.AutomaticIndexStatisticsTest)junit.framework.AssertionFailedError Wed, 10 Apr, 23:27
Mike Matrigali (JIRA) [jira] [Assigned] (DERBY-6144) nightly regression test failure, intermittent error : testStatisticsCorrectness(org.apache.derbyTesting.functionTests.tests.store.AutomaticIndexStatisticsTest)junit.framework.AssertionFailedError Thu, 11 Apr, 00:01
Mike Matrigali (JIRA) [jira] [Commented] (DERBY-6144) nightly regression test failure, intermittent error : testStatisticsCorrectness(org.apache.derbyTesting.functionTests.tests.store.AutomaticIndexStatisticsTest)junit.framework.AssertionFailedError Thu, 11 Apr, 00:11
Mike Matrigali (JIRA) [jira] [Updated] (DERBY-6144) nightly regression test failure, intermittent error : testStatisticsCorrectness(org.apache.derbyTesting.functionTests.tests.store.AutomaticIndexStatisticsTest)junit.framework.AssertionFailedError Thu, 11 Apr, 18:13
Mike Matrigali (JIRA) [jira] [Updated] (DERBY-6144) nightly regression test failure, intermittent error : testStatisticsCorrectness(org.apache.derbyTesting.functionTests.tests.store.AutomaticIndexStatisticsTest)junit.framework.AssertionFailedError Thu, 11 Apr, 23:05
Mike Matrigali (JIRA) [jira] [Updated] (DERBY-6144) nightly regression test failure, intermittent error : testStatisticsCorrectness(org.apache.derbyTesting.functionTests.tests.store.AutomaticIndexStatisticsTest)junit.framework.AssertionFailedError Thu, 11 Apr, 23:09
Mike Matrigali (JIRA) [jira] [Updated] (DERBY-6144) nightly regression test failure, intermittent error : testStatisticsCorrectness(org.apache.derbyTesting.functionTests.tests.store.AutomaticIndexStatisticsTest)junit.framework.AssertionFailedError Thu, 11 Apr, 23:21
Mike Matrigali (JIRA) [jira] [Resolved] (DERBY-6144) nightly regression test failure, intermittent error : testStatisticsCorrectness(org.apache.derbyTesting.functionTests.tests.store.AutomaticIndexStatisticsTest)junit.framework.AssertionFailedError Thu, 11 Apr, 23:21
Mike Matrigali (JIRA) [jira] [Updated] (DERBY-6176) Couple failures in SequenceGeneratorTest suite on trunk(1466748) with weme 6.2 Fri, 12 Apr, 14:48
Message list« Previous · 1 · 2 · 3 · 4 · 5 · 6 · 7 · 8 · 9 · 10 · 11 · 12 · Next »Thread · Author · Date
Box list
Sep 2014240
Aug 2014659
Jul 2014570
Jun 2014712
May 2014698
Apr 2014464
Mar 2014895
Feb 2014630
Jan 2014475
Dec 2013329
Nov 2013524
Oct 2013875
Sep 2013562
Aug 2013618
Jul 2013657
Jun 20131166
May 2013788
Apr 20131185
Mar 2013588
Feb 2013664
Jan 2013538
Dec 2012331
Nov 2012446
Oct 2012636
Sep 2012663
Aug 2012384
Jul 2012481
Jun 2012586
May 2012900
Apr 2012709
Mar 2012767
Feb 2012897
Jan 2012391
Dec 2011478
Nov 2011444
Oct 2011576
Sep 2011744
Aug 2011684
Jul 2011722
Jun 2011804
May 2011605
Apr 2011574
Mar 20111193
Feb 20111393
Jan 2011834
Dec 2010535
Nov 2010595
Oct 2010703
Sep 2010673
Aug 2010657
Jul 2010848
Jun 2010929
May 2010709
Apr 2010885
Mar 2010673
Feb 2010646
Jan 2010638
Dec 2009566
Nov 2009660
Oct 2009604
Sep 2009505
Aug 2009921
Jul 20091312
Jun 20091035
May 2009835
Apr 20091088
Mar 2009884
Feb 2009541
Jan 2009692
Dec 2008522
Nov 2008616
Oct 2008723
Sep 2008455
Aug 2008754
Jul 2008988
Jun 2008871
May 2008842
Apr 20081384
Mar 20081904
Feb 20082074
Jan 20081539
Dec 2007852
Nov 20071273
Oct 20071391
Sep 2007911
Aug 2007908
Jul 20071492
Jun 20072222
May 20072295
Apr 20071394
Mar 20072200
Feb 20071383
Jan 20071360
Dec 20061026
Nov 20061413
Oct 20061324
Sep 20062319
Aug 20063287
Jul 20062434
Jun 20061712
May 20061602
Apr 20061694
Mar 20061985
Feb 20062535
Jan 20061640
Dec 2005741
Nov 20051157
Oct 20051185
Sep 2005783
Aug 2005896
Jul 2005652
Jun 20051494
May 20051323
Apr 2005684
Mar 2005612
Feb 2005351
Jan 2005438
Dec 2004435
Nov 2004274
Oct 2004281
Sep 2004388
Aug 2004160