db-derby-dev mailing list archives: April 2013

Site index · List index
Message list« Previous · 1 · 2 · 3 · 4 · 5 · 6 · 7 · 8 · 9 · 10 · 11 · 12 · Next »Thread · Author · Date
Mamta A. Satoor (JIRA) [jira] [Commented] (DERBY-5866) testFiringConstraintOrder(org.apache.derbyTesting.functionTests.tests.lang.TriggerTest)junit.framework.AssertionFailedError: matching triggers need to be fired in order creation:1,NO CASCADE BEFORE,DELETE,ROW Thu, 11 Apr, 15:59
Mamta A. Satoor (JIRA) [jira] [Created] (DERBY-6170) testSuccessfulConnect failure on trunk(revision 1465166) with ibm 16 Thu, 11 Apr, 19:08
Mamta A. Satoor (JIRA) [jira] [Commented] (DERBY-6170) testSuccessfulConnect failure on trunk(revision 1465166) with ibm 16 Thu, 11 Apr, 19:10
Mamta A. Satoor (JIRA) [jira] [Created] (DERBY-6171) SecureServerTest failure on 10.8(revision 1465166) with ibm 142 Thu, 11 Apr, 19:18
Mamta A. Satoor (JIRA) [jira] [Commented] (DERBY-5866) testFiringConstraintOrder(org.apache.derbyTesting.functionTests.tests.lang.TriggerTest)junit.framework.AssertionFailedError: matching triggers need to be fired in order creation:1,NO CASCADE BEFORE,DELETE,ROW Thu, 11 Apr, 19:24
Mamta A. Satoor (JIRA) [jira] [Commented] (DERBY-6144) nightly regression test failure, intermittent error : testStatisticsCorrectness(org.apache.derbyTesting.functionTests.tests.store.AutomaticIndexStatisticsTest)junit.framework.AssertionFailedError Thu, 11 Apr, 19:26
Mamta A. Satoor (JIRA) [jira] [Commented] (DERBY-6171) SecureServerTest failure on 10.8(revision 1465166) with ibm 142 Thu, 11 Apr, 19:28
Mamta A. Satoor (JIRA) [jira] [Commented] (DERBY-6092) testPositionAgressive(org.apache.derbyTesting.functionTests.tests.jdbcapi.BlobClob4BlobTest)j fails with : 'The handle is invalid.: java.io.IOException'. Thu, 11 Apr, 19:36
Mamta A. Satoor (JIRA) [jira] [Comment Edited] (DERBY-6092) testPositionAgressive(org.apache.derbyTesting.functionTests.tests.jdbcapi.BlobClob4BlobTest)j fails with : 'The handle is invalid.: java.io.IOException'. Thu, 11 Apr, 19:36
Mamta A. Satoor (JIRA) [jira] [Updated] (DERBY-6170) testSuccessfulConnect failure on trunk(revision 1465166) with ibm 16 Thu, 11 Apr, 19:38
Mamta A. Satoor (JIRA) [jira] [Commented] (DERBY-6170) testSuccessfulConnect failure on trunk(revision 1465166) with ibm 16 Thu, 11 Apr, 19:40
Mamta A. Satoor (JIRA) [jira] [Comment Edited] (DERBY-6170) testSuccessfulConnect failure on trunk(revision 1465166) with ibm 16 Thu, 11 Apr, 19:42
Mamta A. Satoor (JIRA) [jira] [Commented] (DERBY-3861) 'testAutoNetworkServerBoot' fails with 'Network Server state incorrect expected:<false> but was:<true>' Thu, 11 Apr, 19:50
Mamta A. Satoor (JIRA) [jira] [Created] (DERBY-6172) testBlobInTriggerTable failed with Input stream did not have exact amount of data as the requested length.: org.apache.derby.iapi.services.io.DerbyIOException' Thu, 11 Apr, 20:01
Mamta A. Satoor (JIRA) [jira] [Comment Edited] (DERBY-5866) testFiringConstraintOrder(org.apache.derbyTesting.functionTests.tests.lang.TriggerTest)junit.framework.AssertionFailedError: matching triggers need to be fired in order creation:1,NO CASCADE BEFORE,DELETE,ROW Thu, 11 Apr, 20:03
Mamta A. Satoor (JIRA) [jira] [Created] (DERBY-6173) testSetClob failure on 10.10.1.2(1465864) with ibm17 - A communications error has been detected: Connection reset. Thu, 11 Apr, 20:07
Mamta A. Satoor (JIRA) [jira] [Commented] (DERBY-6170) testSuccessfulConnect failure on trunk(revision 1465166) with ibm 16 Thu, 11 Apr, 20:17
Mamta A. Satoor (JIRA) [jira] [Created] (DERBY-6174) testGetTablesModify failure - A communications error has been detected: Connection reset. Thu, 11 Apr, 20:19
Mamta A. Satoor (JIRA) [jira] [Commented] (DERBY-6172) testBlobInTriggerTable failed with Input stream did not have exact amount of data as the requested length.: org.apache.derby.iapi.services.io.DerbyIOException' Thu, 11 Apr, 20:21
Mamta A. Satoor (JIRA) [jira] [Created] (DERBY-6175) testComparisonAcrossPages failure - java.sql.SQLNonTransientConnectionException: No current connection. Thu, 11 Apr, 20:23
Mamta A. Satoor (JIRA) [jira] [Commented] (DERBY-6174) testGetTablesModify failure - A communications error has been detected: Connection reset. Thu, 11 Apr, 20:25
Mamta A. Satoor (JIRA) [jira] [Commented] (DERBY-6175) testComparisonAcrossPages failure - java.sql.SQLNonTransientConnectionException: No current connection. Thu, 11 Apr, 20:27
Mamta A. Satoor (JIRA) [jira] [Created] (DERBY-6176) Couple failures in SequenceGeneratorTest suite on trunk(1466748) with weme 6.2 Thu, 11 Apr, 20:43
Mamta A. Satoor (JIRA) [jira] [Comment Edited] (DERBY-6144) nightly regression test failure, intermittent error : testStatisticsCorrectness(org.apache.derbyTesting.functionTests.tests.store.AutomaticIndexStatisticsTest)junit.framework.AssertionFailedError Thu, 11 Apr, 20:45
Mamta A. Satoor (JIRA) [jira] [Commented] (DERBY-5866) testFiringConstraintOrder(org.apache.derbyTesting.functionTests.tests.lang.TriggerTest)junit.framework.AssertionFailedError: matching triggers need to be fired in order creation:1,NO CASCADE BEFORE,DELETE,ROW Fri, 12 Apr, 04:53
Mamta A. Satoor (JIRA) [jira] [Updated] (DERBY-6175) testComparisonAcrossPages failure - java.sql.SQLNonTransientConnectionException: No current connection. Fri, 12 Apr, 15:14
Mamta A. Satoor (JIRA) [jira] [Updated] (DERBY-6170) testSuccessfulConnect failure on trunk(revision 1465166) with ibm 16 Fri, 12 Apr, 15:16
Mamta A. Satoor (JIRA) [jira] [Updated] (DERBY-6172) testBlobInTriggerTable failed with Input stream did not have exact amount of data as the requested length.: org.apache.derby.iapi.services.io.DerbyIOException' Fri, 12 Apr, 15:16
Mamta A. Satoor (JIRA) [jira] [Updated] (DERBY-6174) testGetTablesModify failure - A communications error has been detected: Connection reset. Fri, 12 Apr, 15:16
Mamta A. Satoor (JIRA) [jira] [Updated] (DERBY-5866) testFiringConstraintOrder(org.apache.derbyTesting.functionTests.tests.lang.TriggerTest)junit.framework.AssertionFailedError: matching triggers need to be fired in order creation:1,NO CASCADE BEFORE,DELETE,ROW Fri, 12 Apr, 17:12
Mamta A. Satoor (JIRA) [jira] [Commented] (DERBY-5866) testFiringConstraintOrder(org.apache.derbyTesting.functionTests.tests.lang.TriggerTest)junit.framework.AssertionFailedError: matching triggers need to be fired in order creation:1,NO CASCADE BEFORE,DELETE,ROW Fri, 12 Apr, 17:12
Mamta A. Satoor (JIRA) [jira] [Commented] (DERBY-6176) Couple failures in SequenceGeneratorTest suite on trunk(1466748) with weme 6.2 Sat, 13 Apr, 13:54
Mamta A. Satoor (JIRA) [jira] [Commented] (DERBY-6176) Couple failures in SequenceGeneratorTest suite on trunk(1466748) with weme 6.2 Sat, 13 Apr, 14:00
Mamta A. Satoor (JIRA) [jira] [Issue Comment Deleted] (DERBY-6171) SecureServerTest failure on 10.8(revision 1465166) with ibm 142 Mon, 15 Apr, 18:16
Mamta A. Satoor (JIRA) [jira] [Created] (DERBY-6183) rlliso2multi and rlliso3multi failing with [WARNING 01004: Data truncation] Mon, 15 Apr, 18:28
Mamta A. Satoor (JIRA) [jira] [Updated] (DERBY-6183) rlliso2multi and rlliso3multi failing with [WARNING 01004: Data truncation] Mon, 15 Apr, 18:44
Mamta A. Satoor (JIRA) [jira] [Commented] (DERBY-6183) rlliso2multi and rlliso3multi failing with [WARNING 01004: Data truncation] Mon, 15 Apr, 21:12
Mamta A. Satoor (JIRA) [jira] [Commented] (DERBY-6183) rlliso2multi and rlliso3multi failing with [WARNING 01004: Data truncation] Mon, 15 Apr, 22:14
Mamta A. Satoor (JIRA) [jira] [Commented] (DERBY-5866) testFiringConstraintOrder(org.apache.derbyTesting.functionTests.tests.lang.TriggerTest)junit.framework.AssertionFailedError: matching triggers need to be fired in order creation:1,NO CASCADE BEFORE,DELETE,ROW Tue, 16 Apr, 05:27
Mamta A. Satoor (JIRA) [jira] [Commented] (DERBY-5866) testFiringConstraintOrder(org.apache.derbyTesting.functionTests.tests.lang.TriggerTest)junit.framework.AssertionFailedError: matching triggers need to be fired in order creation:1,NO CASCADE BEFORE,DELETE,ROW Tue, 16 Apr, 15:59
Mamta A. Satoor (JIRA) [jira] [Updated] (DERBY-5866) testFiringConstraintOrder(org.apache.derbyTesting.functionTests.tests.lang.TriggerTest)junit.framework.AssertionFailedError: matching triggers need to be fired in order creation:1,NO CASCADE BEFORE,DELETE,ROW Tue, 16 Apr, 16:01
Mamta A. Satoor (JIRA) [jira] [Commented] (DERBY-6185) Query against view with "where name LIKE 'Col1' ESCAPE '\' " failed Tue, 16 Apr, 21:41
Mamta A. Satoor (JIRA) [jira] [Commented] (DERBY-6185) Query against view with "where name LIKE 'Col1' ESCAPE '\' " failed Tue, 16 Apr, 21:53
Mamta A. Satoor (JIRA) [jira] [Commented] (DERBY-6185) Query against view with "where name LIKE 'Col1' ESCAPE '\' " failed Tue, 16 Apr, 22:41
Mamta A. Satoor (JIRA) [jira] [Commented] (DERBY-6185) Query against view with "where name LIKE 'Col1' ESCAPE '\' " failed Wed, 17 Apr, 15:51
Mamta A. Satoor (JIRA) [jira] [Assigned] (DERBY-6185) Query against view with "where name LIKE 'Col1' ESCAPE '\' " failed Wed, 17 Apr, 16:49
Mamta A. Satoor (JIRA) [jira] [Commented] (DERBY-6185) Query against view with "where name LIKE 'Col1' ESCAPE '\' " failed Wed, 17 Apr, 17:07
Mamta A. Satoor (JIRA) [jira] [Assigned] (DERBY-3037) Language ResultSet.finish() is called even when the ResultSet is going to be re-used. Wed, 17 Apr, 19:11
Mamta A. Satoor (JIRA) [jira] [Commented] (DERBY-6185) Query against view with "where name LIKE 'Col1' ESCAPE '\' " failed Thu, 18 Apr, 00:19
Mamta A. Satoor (JIRA) [jira] [Updated] (DERBY-6185) Query against view with "where name LIKE 'Col1' ESCAPE '\' " failed Thu, 18 Apr, 15:25
Mamta A. Satoor (JIRA) [jira] [Commented] (DERBY-6185) Query against view with "where name LIKE 'Col1' ESCAPE '\' " failed Thu, 18 Apr, 18:02
Mamta A. Satoor (JIRA) [jira] [Commented] (DERBY-6185) Query against view with "where name LIKE 'Col1' ESCAPE '\' " failed Fri, 19 Apr, 18:17
Mamta A. Satoor (JIRA) [jira] [Updated] (DERBY-6185) Query against view with "where name LIKE 'Col1' ESCAPE '\' " failed Sat, 20 Apr, 16:39
Mamta A. Satoor (JIRA) [jira] [Commented] (DERBY-6185) Query against view with "where name LIKE 'Col1' ESCAPE '\' " failed Sat, 20 Apr, 17:05
Mamta A. Satoor (JIRA) [jira] [Updated] (DERBY-6185) Query against view with "where name LIKE 'Col1' ESCAPE '\' " failed Mon, 22 Apr, 18:45
Mamta A. Satoor (JIRA) [jira] [Updated] (DERBY-6185) Query against view with "where name LIKE 'Col1' ESCAPE '\' " failed Mon, 22 Apr, 18:49
Mamta A. Satoor (JIRA) [jira] [Commented] (DERBY-6185) Query against view with "where name LIKE 'Col1' ESCAPE '\' " failed Mon, 22 Apr, 21:39
Mamta A. Satoor (JIRA) [jira] [Updated] (DERBY-5866) testFiringConstraintOrder(org.apache.derbyTesting.functionTests.tests.lang.TriggerTest)junit.framework.AssertionFailedError: matching triggers need to be fired in order creation:1,NO CASCADE BEFORE,DELETE,ROW Tue, 23 Apr, 01:49
Mamta A. Satoor (JIRA) [jira] [Commented] (DERBY-5866) testFiringConstraintOrder(org.apache.derbyTesting.functionTests.tests.lang.TriggerTest)junit.framework.AssertionFailedError: matching triggers need to be fired in order creation:1,NO CASCADE BEFORE,DELETE,ROW Tue, 23 Apr, 01:49
Mamta A. Satoor (JIRA) [jira] [Commented] (DERBY-6185) Query against view with "where name LIKE 'Col1' ESCAPE '\' " failed Tue, 23 Apr, 15:35
Mamta A. Satoor (JIRA) [jira] [Commented] (DERBY-6185) Query against view with "where name LIKE 'Col1' ESCAPE '\' " failed Tue, 23 Apr, 16:03
Mamta A. Satoor (JIRA) [jira] [Updated] (DERBY-6185) Query against view with "where name LIKE 'Col1' ESCAPE '\' " failed Tue, 23 Apr, 16:05
Mamta A. Satoor (JIRA) [jira] [Commented] (DERBY-5866) testFiringConstraintOrder(org.apache.derbyTesting.functionTests.tests.lang.TriggerTest)junit.framework.AssertionFailedError: matching triggers need to be fired in order creation:1,NO CASCADE BEFORE,DELETE,ROW Wed, 24 Apr, 17:03
Mamta A. Satoor (JIRA) [jira] [Commented] (DERBY-5866) testFiringConstraintOrder(org.apache.derbyTesting.functionTests.tests.lang.TriggerTest)junit.framework.AssertionFailedError: matching triggers need to be fired in order creation:1,NO CASCADE BEFORE,DELETE,ROW Wed, 24 Apr, 20:53
Mamta A. Satoor (JIRA) [jira] [Commented] (DERBY-5866) testFiringConstraintOrder(org.apache.derbyTesting.functionTests.tests.lang.TriggerTest)junit.framework.AssertionFailedError: matching triggers need to be fired in order creation:1,NO CASCADE BEFORE,DELETE,ROW Wed, 24 Apr, 22:05
Mamta A. Satoor (JIRA) [jira] [Comment Edited] (DERBY-6185) Query against view with "where name LIKE 'Col1' ESCAPE '\' " failed Wed, 24 Apr, 22:17
Mamta A. Satoor (JIRA) [jira] [Commented] (DERBY-5866) testFiringConstraintOrder(org.apache.derbyTesting.functionTests.tests.lang.TriggerTest)junit.framework.AssertionFailedError: matching triggers need to be fired in order creation:1,NO CASCADE BEFORE,DELETE,ROW Thu, 25 Apr, 05:00
Mamta A. Satoor (JIRA) [jira] [Updated] (DERBY-6185) Query against view with "where name LIKE 'Col1' ESCAPE '\' " failed Thu, 25 Apr, 05:26
Mamta A. Satoor (JIRA) [jira] [Commented] (DERBY-6185) Query against view with "where name LIKE 'Col1' ESCAPE '\' " failed Thu, 25 Apr, 05:26
Mamta A. Satoor (JIRA) [jira] [Commented] (DERBY-6185) Query against view with "where name LIKE 'Col1' ESCAPE '\' " failed Thu, 25 Apr, 15:58
Mamta A. Satoor (JIRA) [jira] [Updated] (DERBY-6185) Query against view with "where name LIKE 'Col1' ESCAPE '\' " failed Thu, 25 Apr, 15:58
Mamta A. Satoor (JIRA) [jira] [Commented] (DERBY-6185) Query against view with "where name LIKE 'Col1' ESCAPE '\' " failed Fri, 26 Apr, 02:05
Mamta A. Satoor (JIRA) [jira] [Updated] (DERBY-6185) Query against view with "where name LIKE 'Col1' ESCAPE '\' " failed Fri, 26 Apr, 02:05
Mamta A. Satoor (JIRA) [jira] [Resolved] (DERBY-6185) Query against view with "where name LIKE 'Col1' ESCAPE '\' " failed Fri, 26 Apr, 02:05
Mamta A. Satoor (JIRA) [jira] [Commented] (DERBY-5866) testFiringConstraintOrder(org.apache.derbyTesting.functionTests.tests.lang.TriggerTest)junit.framework.AssertionFailedError: matching triggers need to be fired in order creation:1,NO CASCADE BEFORE,DELETE,ROW Fri, 26 Apr, 19:40
Mamta A. Satoor (JIRA) [jira] [Commented] (DERBY-5866) testFiringConstraintOrder(org.apache.derbyTesting.functionTests.tests.lang.TriggerTest)junit.framework.AssertionFailedError: matching triggers need to be fired in order creation:1,NO CASCADE BEFORE,DELETE,ROW Fri, 26 Apr, 21:44
Mamta A. Satoor (JIRA) [jira] [Commented] (DERBY-5866) testFiringConstraintOrder(org.apache.derbyTesting.functionTests.tests.lang.TriggerTest)junit.framework.AssertionFailedError: matching triggers need to be fired in order creation:1,NO CASCADE BEFORE,DELETE,ROW Fri, 26 Apr, 22:08
Mamta Satoor Re: Why is the optimizer choosing such a bad path Mon, 01 Apr, 18:55
Mamta Satoor Re: Why is the optimizer choosing such a bad path Mon, 01 Apr, 19:21
Mamta Satoor Re: [VOTE] 10.10.1.1 release Mon, 15 Apr, 23:22
Mike Matrigali concern about nightly test failures on 10.10 branch prior to release. Fri, 05 Apr, 17:43
Mike Matrigali Re: 10.10.1 polls closing in a few hours Mon, 08 Apr, 21:09
Mike Matrigali should attempts to shut down the database timeout if they exceed DriverManager.setLoginTimeout( N )? Tue, 09 Apr, 20:46
Mike Matrigali Re: should attempts to shut down the database timeout if they exceed DriverManager.setLoginTimeout( N )? Wed, 10 Apr, 16:32
Mike Matrigali Re: should attempts to shut down the database timeout if they exceed DriverManager.setLoginTimeout( N )? Wed, 10 Apr, 18:50
Mike Matrigali question about AutoloadTest and network server port numbers Fri, 12 Apr, 16:25
Mike Matrigali Re: [VOTE] 10.10.1.1 release Mon, 15 Apr, 21:07
Mike Matrigali Re: Dropping some old platforms in 10.11? Tue, 23 Apr, 15:37
Mike Matrigali could those doing cleanup work add some extra comments about performance implications? Fri, 26 Apr, 15:46
Mike Matrigali Re: Dropping some old platforms in 10.11? Fri, 26 Apr, 18:25
Mike Matrigali (JIRA) [jira] [Updated] (DERBY-6131) select from view with "upper" and "in" does not work Mon, 01 Apr, 16:33
Mike Matrigali (JIRA) [jira] [Commented] (DERBY-6096) OutOfMemoryError with Clob or Blob hash join: DataTypeDescriptor.estimatedMemoryUsage() has no case for BLOB or CLOB so would underestimate memory usage for those types at zero Tue, 02 Apr, 19:25
Mike Matrigali (JIRA) [jira] [Updated] (DERBY-6131) select from view with "upper" and "in" list throws a ClassCastException Tue, 02 Apr, 22:03
Mike Matrigali (JIRA) [jira] [Created] (DERBY-6140) nightly regression test failure in derbyall/CompatibilityTest - connection failed Wed, 03 Apr, 00:07
Mike Matrigali (JIRA) [jira] [Commented] (DERBY-6122) InterruptResilienceTest fails with: junit.framework.ComparisonFailure: Database shutdown expected:<[08006]> but was:<[XBDA0]> Wed, 03 Apr, 00:21
Mike Matrigali (JIRA) [jira] [Created] (DERBY-6141) testReplication_Local_3_p5_DERBY_3878 failed in nightly regression test run with AssertionFailedError: Server did not start in time Wed, 03 Apr, 00:25
Mike Matrigali (JIRA) [jira] [Updated] (DERBY-5754) nightly regresstession test failure:RAFReadWriteMultipleThreads(org.apache.derbyTesting.functionTests.tests.store.InterruptResilienceTest)java.sql.SQLException: Wed, 03 Apr, 00:29
Mike Matrigali (JIRA) [jira] [Commented] (DERBY-5754) nightly regresstession test failure:RAFReadWriteMultipleThreads(org.apache.derbyTesting.functionTests.tests.store.InterruptResilienceTest)java.sql.SQLException: Wed, 03 Apr, 00:29
Mike Matrigali (JIRA) [jira] [Created] (DERBY-6142) nightly regression test failure: testCorrectClobDataWithMultiCall(org.apache.derbyTesting.functionTests.tests.jdbcapi.LobRsGetterTest)java.sql.SQLException: Java exception: 'The handle is invalid.: java.io.IOException'. Wed, 03 Apr, 00:35
Mike Matrigali (JIRA) [jira] [Commented] (DERBY-3861) 'testAutoNetworkServerBoot' fails with 'Network Server state incorrect expected:<false> but was:<true>' Wed, 03 Apr, 00:41
Message list« Previous · 1 · 2 · 3 · 4 · 5 · 6 · 7 · 8 · 9 · 10 · 11 · 12 · Next »Thread · Author · Date
Box list
Dec 2014181
Nov 2014175
Oct 2014424
Sep 2014531
Aug 2014659
Jul 2014570
Jun 2014712
May 2014698
Apr 2014464
Mar 2014895
Feb 2014630
Jan 2014475
Dec 2013329
Nov 2013524
Oct 2013875
Sep 2013562
Aug 2013618
Jul 2013657
Jun 20131166
May 2013788
Apr 20131185
Mar 2013588
Feb 2013664
Jan 2013538
Dec 2012331
Nov 2012446
Oct 2012636
Sep 2012663
Aug 2012384
Jul 2012481
Jun 2012586
May 2012900
Apr 2012709
Mar 2012767
Feb 2012897
Jan 2012391
Dec 2011478
Nov 2011444
Oct 2011576
Sep 2011744
Aug 2011684
Jul 2011722
Jun 2011804
May 2011605
Apr 2011574
Mar 20111193
Feb 20111393
Jan 2011834
Dec 2010535
Nov 2010595
Oct 2010703
Sep 2010673
Aug 2010657
Jul 2010848
Jun 2010929
May 2010709
Apr 2010885
Mar 2010673
Feb 2010646
Jan 2010638
Dec 2009566
Nov 2009660
Oct 2009604
Sep 2009505
Aug 2009921
Jul 20091312
Jun 20091035
May 2009835
Apr 20091088
Mar 2009884
Feb 2009541
Jan 2009692
Dec 2008522
Nov 2008616
Oct 2008723
Sep 2008455
Aug 2008754
Jul 2008988
Jun 2008871
May 2008842
Apr 20081384
Mar 20081904
Feb 20082074
Jan 20081539
Dec 2007852
Nov 20071273
Oct 20071391
Sep 2007911
Aug 2007908
Jul 20071492
Jun 20072222
May 20072295
Apr 20071394
Mar 20072200
Feb 20071383
Jan 20071360
Dec 20061026
Nov 20061413
Oct 20061324
Sep 20062319
Aug 20063287
Jul 20062434
Jun 20061712
May 20061602
Apr 20061694
Mar 20061985
Feb 20062535
Jan 20061640
Dec 2005741
Nov 20051157
Oct 20051185
Sep 2005783
Aug 2005896
Jul 2005652
Jun 20051494
May 20051323
Apr 2005684
Mar 2005612
Feb 2005351
Jan 2005438
Dec 2004435
Nov 2004274
Oct 2004281
Sep 2004388
Aug 2004160