db-derby-dev mailing list archives

Site index · List index
Message view « Date » · « Thread »
Top « Date » · « Thread »
From "Mike Matrigali (JIRA)" <j...@apache.org>
Subject [jira] [Updated] (DERBY-6155) testRAFWriteInterrupted(org.apache.derbyTesting.functionTests.tests.store.InterruptResilienceTest)java.sql.SQLException: The exception 'junit.fram ework.AssertionFailedError: interrupt flag lost' was thrown while evaluating an expression.
Date Mon, 08 Apr 2013 23:16:19 GMT

     [ https://issues.apache.org/jira/browse/DERBY-6155?page=com.atlassian.jira.plugin.system.issuetabpanels:all-tabpanel
]

Mike Matrigali updated DERBY-6155:
----------------------------------

    Affects Version/s: 10.8.2.2

failed 5 out 24 times, windows 7, sane classes, top of 10.8 branch, ibm16
                
> testRAFWriteInterrupted(org.apache.derbyTesting.functionTests.tests.store.InterruptResilienceTest)java.sql.SQLException:
The exception 'junit.fram ework.AssertionFailedError: interrupt flag lost' was thrown while
evaluating an expression.
> ----------------------------------------------------------------------------------------------------------------------------------------------------------------------------------------------------------------------------------------------
>
>                 Key: DERBY-6155
>                 URL: https://issues.apache.org/jira/browse/DERBY-6155
>             Project: Derby
>          Issue Type: Bug
>          Components: Test
>    Affects Versions: 10.8.2.2, 10.9.2.2, 10.11.0.0
>         Environment: windows 7, sane classes
> s1_ibm16:87>java -version
> java version "1.6.0"
> Java(TM) SE Runtime Environment (build pwi3260sr10-20111208_01(SR10))
> IBM J9 VM (build 2.4, JRE 1.6.0 IBM J9 2.4 Windows 7 x86-32 jvmwi3260sr10-20111207_96808
(JIT enabled, AOT enabled)
> J9VM - 20111207_096808
> JIT  - r9_20111107_21307ifx1
> GC   - 20110519_AA)
> JCL  - 20111104_02
>            Reporter: Mike Matrigali
>
> Ran the InterruptResilienceTest 64 times and got 12 failures on windows 7, ibm16, sane
classes
> 1) testRAFWriteInterrupted(org.apache.derbyTesting.functionTests.tests.store.InterruptResilienceTest)java.sql.SQLException:
The exception 'junit.fram
> ework.AssertionFailedError: interrupt flag lost' was thrown while evaluating an expression.
>     at org.apache.derby.impl.jdbc.SQLExceptionFactory40.getSQLException(SQLExceptionFactory40.java:101)
>     at org.apache.derby.impl.jdbc.Util.newEmbedSQLException(Util.java:148)
>     at org.apache.derby.impl.jdbc.Util.seeNextException(Util.java:349)
>     at org.apache.derby.impl.jdbc.TransactionResourceImpl.wrapInSQLException(TransactionResourceImpl.java:431)
>     at org.apache.derby.impl.jdbc.TransactionResourceImpl.handleException(TransactionResourceImpl.java:353)
>     at org.apache.derby.impl.jdbc.EmbedConnection.handleException(EmbedConnection.java:2400)
>     at org.apache.derby.impl.jdbc.ConnectionChild.handleException(ConnectionChild.java:85)
>     at org.apache.derby.impl.jdbc.EmbedStatement.executeStatement(EmbedStatement.java:1436)
>     at org.apache.derby.impl.jdbc.EmbedStatement.execute(EmbedStatement.java:711)
>     at org.apache.derby.impl.jdbc.EmbedStatement.executeLargeUpdate(EmbedStatement.java:190)
>     at org.apache.derby.impl.jdbc.EmbedStatement.executeUpdate(EmbedStatement.java:179)
>     at org.apache.derbyTesting.functionTests.tests.store.InterruptResilienceTest.testRAFWriteInterrupted(InterruptResilienceTest.java:215)
>     at sun.reflect.NativeMethodAccessorImpl.invoke0(Native Method)
>     at sun.reflect.NativeMethodAccessorImpl.invoke(NativeMethodAccessorImpl.java:60)
>     at sun.reflect.DelegatingMethodAccessorImpl.invoke(DelegatingMethodAccessorImpl.java:37)
>     at org.apache.derbyTesting.junit.BaseTestCase.runBare(BaseTestCase.java:117)
>     at org.apache.derbyTesting.junit.BaseJDBCTestCase.runBareOverridable(BaseJDBCTestCase.java:442)
>     at org.apache.derbyTesting.junit.BaseJDBCTestCase.runBare(BaseJDBCTestCase.java:459)
>     at junit.extensions.TestDecorator.basicRun(TestDecorator.java:24)
>     at junit.extensions.TestSetup$1.protect(TestSetup.java:21)
>     at junit.extensions.TestSetup.run(TestSetup.java:25)
>     at org.apache.derbyTesting.junit.BaseTestSetup.run(BaseTestSetup.java:57)
>     at junit.extensions.TestDecorator.basicRun(TestDecorator.java:24)
>     at junit.extensions.TestSetup$1.protect(TestSetup.java:21)
>     at junit.extensions.TestSetup.run(TestSetup.java:25)
>     at junit.extensions.TestDecorator.basicRun(TestDecorator.java:24)
>     at junit.extensions.TestSetup$1.protect(TestSetup.java:21)
>     at junit.extensions.TestSetup.run(TestSetup.java:25)
> Caused by: java.sql.SQLException: The exception 'junit.framework.AssertionFailedError:
interrupt flag lost' was thrown while evaluating an expression
> .
>     at org.apache.derby.impl.jdbc.SQLExceptionFactory.getSQLException(SQLExceptionFactory.java:42)
>     at org.apache.derby.impl.jdbc.SQLExceptionFactory40.wrapArgsForTransportAcrossDRDA(SQLExceptionFactory40.java:125)
>     at org.apache.derby.impl.jdbc.SQLExceptionFactory40.getSQLException(SQLExceptionFactory40.java:71)
>     ... 44 more
> Caused by: java.sql.SQLException: Java exception: 'interrupt flag lost: junit.framework.AssertionFailedError'.
>     at org.apache.derby.impl.jdbc.SQLExceptionFactory.getSQLException(SQLExceptionFactory.java:42)
>     at org.apache.derby.impl.jdbc.SQLExceptionFactory40.wrapArgsForTransportAcrossDRDA(SQLExceptionFactory40.java:125)
>     at org.apache.derby.impl.jdbc.SQLExceptionFactory40.getSQLException(SQLExceptionFactory40.java:71)
>     at org.apache.derby.impl.jdbc.Util.newEmbedSQLException(Util.java:148)
>     at org.apache.derby.impl.jdbc.Util.javaException(Util.java:370)
>     at org.apache.derby.impl.jdbc.TransactionResourceImpl.wrapInSQLException(TransactionResourceImpl.java:436)
>     ... 42 more
> Caused by: junit.framework.AssertionFailedError: interrupt flag lost
>     at org.apache.derbyTesting.functionTests.tests.store.InterruptResilienceTest.tstRAFwriteInterrupted(InterruptResilienceTest.java:190)
>     at org.apache.derby.exe.ac4d3680a5x013dxeb8exd721xffffa49f59380.g0(Unknown Source)
>     at sun.reflect.NativeMethodAccessorImpl.invoke0(Native Method)
>     at sun.reflect.NativeMethodAccessorImpl.invoke(NativeMethodAccessorImpl.java:60)
>     at sun.reflect.DelegatingMethodAccessorImpl.invoke(DelegatingMethodAccessorImpl.java:37)
>     at org.apache.derby.impl.services.reflect.ReflectMethod.invoke(ReflectMethod.java:46)
>     at org.apache.derby.impl.sql.execute.CallStatementResultSet.open(CallStatementResultSet.java:75)
>     at org.apache.derby.impl.sql.GenericPreparedStatement.executeStmt(GenericPreparedStatement.java:452)
>     at org.apache.derby.impl.sql.GenericPreparedStatement.execute(GenericPreparedStatement.java:333)
>     at org.apache.derby.impl.jdbc.EmbedStatement.executeStatement(EmbedStatement.java:1344)
>     ... 37 more
> FAILURES!!!
> Tests run: 12,  Failures: 0,  Errors: 1

--
This message is automatically generated by JIRA.
If you think it was sent incorrectly, please contact your JIRA administrators
For more information on JIRA, see: http://www.atlassian.com/software/jira

Mime
View raw message