db-derby-dev mailing list archives

Site index · List index
Message view « Date » · « Thread »
Top « Date » · « Thread »
From "Mike Matrigali (JIRA)" <j...@apache.org>
Subject [jira] [Commented] (DERBY-6141) testReplication_Local_3_p5_DERBY_3878 failed in nightly regression test run with AssertionFailedError: Server did not start in time
Date Fri, 05 Apr 2013 18:49:16 GMT

    [ https://issues.apache.org/jira/browse/DERBY-6141?page=com.atlassian.jira.plugin.system.issuetabpanels:comment-tabpanel&focusedCommentId=13623936#comment-13623936
] 

Mike Matrigali commented on DERBY-6141:
---------------------------------------

not marking this a regression, even though it did not show up reported in previous release.
  Seems similar to the known
intermittent issue with the replication tests.  If anyone else wants to mark it a regression
i would not argue.
                
> testReplication_Local_3_p5_DERBY_3878 failed in nightly regression test run with AssertionFailedError:
Server did not start in time  
> -------------------------------------------------------------------------------------------------------------------------------------
>
>                 Key: DERBY-6141
>                 URL: https://issues.apache.org/jira/browse/DERBY-6141
>             Project: Derby
>          Issue Type: Bug
>          Components: Test
>    Affects Versions: 10.11.0.0
>         Environment: trunk, windows, ibm15
>            Reporter: Mike Matrigali
>
> failure in nightly regression test run, ibm15, windows, trunk:
> http://people.apache.org/~myrnavl/derby_test_results/main/windows/testlog/ibm15/1463072-suites.All_diff.txt
> (emb)replicationTests.ReplicationRun_Local_3_p5.testReplication_Local_3_p5_DERBY_3878
java.net.SocketException: Connection reset
> 	at java.net.SocketInputStream.read(SocketInputStream.java:197)
> 	at java.net.SocketInputStream.read(SocketInputStream.java:116)
> 	at org.apache.derby.impl.drda.NetworkServerControlImpl.fillReplyBuffer(Unknown Source)
> 	at org.apache.derby.impl.drda.NetworkServerControlImpl.readResult(Unknown Source)
> 	at org.apache.derby.impl.drda.NetworkServerControlImpl.pingWithNoOpen(Unknown Source)
> 	at org.apache.derby.impl.drda.NetworkServerControlImpl.ping(Unknown Source)
> 	at org.apache.derby.drda.NetworkServerControl.ping(Unknown Source)
> 	at org.apache.derbyTesting.junit.NetworkServerTestSetup.pingForServerUp(NetworkServerTestSetup.java:613)
> 	at org.apache.derbyTesting.junit.NetworkServerTestSetup.pingForServerStart(NetworkServerTestSetup.java:684)
> 	at org.apache.derbyTesting.functionTests.tests.replicationTests.ReplicationRun.pingServer(ReplicationRun.java:2173)
> 	at org.apache.derbyTesting.functionTests.tests.replicationTests.ReplicationRun.startServer(ReplicationRun.java:1962)
> 	at org.apache.derbyTesting.functionTests.tests.replicationTests.ReplicationRun_Local_3_p5.testReplication_Local_3_p5_DERBY_3878(ReplicationRun_Local_3_p5.java:100)
> 	at sun.reflect.NativeMethodAccessorImpl.invoke0(Native Method)
> 	at sun.reflect.NativeMethodAccessorImpl.invoke(NativeMethodAccessorImpl.java:79)
> 	at sun.reflect.DelegatingMethodAccessorImpl.invoke(DelegatingMethodAccessorImpl.java:43)
> 	at java.lang.reflect.Method.invoke(Method.java:619)
> 	at junit.framework.TestCase.runTest(TestCase.java:164)
> 	at junit.framework.TestCase.runBare(TestCase.java:130)
> 	at org.apache.derbyTesting.junit.BaseTestCase.runBare(BaseTestCase.java:117)
> 	at org.apache.derbyTesting.functionTests.tests.replicationTests.ReplicationRun.runBare(ReplicationRun.java:247)
> 	at junit.framework.TestResult$1.protect(TestResult.java:106)
> 	at junit.framework.TestResult.runProtected(TestResult.java:124)
> 	at junit.framework.TestResult.run(TestResult.java:109)
> 	at junit.framework.TestCase.run(TestCase.java:120)
> 	at junit.framework.TestSuite.runTest(TestSuite.java:230)
> 	at junit.framework.TestSuite.run(TestSuite.java:225)
> 	at junit.framework.TestSuite.runTest(TestSuite.java:230)
> 	at junit.framework.TestSuite.run(TestSuite.java:225)
> 	at junit.extensions.TestDecorator.basicRun(TestDecorator.java:24)
> 	at junit.extensions.TestSetup$1.protect(TestSetup.java:21)
> 	at junit.framework.TestResult.runProtected(TestResult.java:124)
> 	at junit.extensions.TestSetup.run(TestSetup.java:25)
> 	at junit.framework.TestSuite.runTest(TestSuite.java:230)
> 	at junit.framework.TestSuite.run(TestSuite.java:225)
> 	at junit.framework.TestSuite.runTest(TestSuite.java:230)
> 	at junit.framework.TestSuite.run(TestSuite.java:225)
> 	at junit.framework.TestSuite.runTest(TestSuite.java:230)
> 	at junit.framework.TestSuite.run(TestSuite.java:225)
> 	at junit.textui.TestRunner.doRun(TestRunner.java:121)
> 	at junit.textui.TestRunner.start(TestRunner.java:185)
> 	at junit.textui.TestRunner.main(TestRunner.java:143)
> java.net.SocketException: Connection reset
> 	at java.net.SocketInputStream.read(SocketInputStream.java:197)
> 	at java.net.SocketInputStream.read(SocketInputStream.java:116)
> 	at org.apache.derby.impl.drda.NetworkServerControlImpl.fillReplyBuffer(Unknown Source)
> 	at org.apache.derby.impl.drda.NetworkServerControlImpl.readResult(Unknown Source)
> 	at org.apache.derby.impl.drda.NetworkServerControlImpl.pingWithNoOpen(Unknown Source)
> 	at org.apache.derby.impl.drda.NetworkServerControlImpl.ping(Unknown Source)
> 	at org.apache.derby.drda.NetworkServerControl.ping(Unknown Source)
> 	at org.apache.derbyTesting.junit.NetworkServerTestSetup.pingForServerUp(NetworkServerTestSetup.java:613)
> 	at org.apache.derbyTesting.junit.NetworkServerTestSetup.pingForServerStart(NetworkServerTestSetup.java:684)
> 	at org.apache.derbyTesting.functionTests.tests.replicationTests.ReplicationRun.pingServer(ReplicationRun.java:2173)
> 	at org.apache.derbyTesting.functionTests.tests.replicationTests.ReplicationRun.startServer(ReplicationRun.java:1962)
> 	at org.apache.derbyTesting.functionTests.tests.replicationTests.ReplicationRun_Local_3_p5.testReplication_Local_3_p5_DERBY_3878(ReplicationRun_Local_3_p5.java:100)
> 	at sun.reflect.NativeMethodAccessorImpl.invoke0(Native Method)
> 	at sun.reflect.NativeMethodAccessorImpl.invoke(NativeMethodAccessorImpl.java:79)
> 	at sun.reflect.DelegatingMethodAccessorImpl.invoke(DelegatingMethodAccessorImpl.java:43)
> 	at java.lang.reflect.Method.invoke(Method.java:619)
> 	at junit.framework.TestCase.runTest(TestCase.java:164)
> 	at junit.framework.TestCase.runBare(TestCase.java:130)
> 	at org.apache.derbyTesting.junit.BaseTestCase.runBare(BaseTestCase.java:117)
> 	at org.apache.derbyTesting.functionTests.tests.replicationTests.ReplicationRun.runBare(ReplicationRun.java:247)
> 	at junit.framework.TestResult$1.protect(TestResult.java:106)
> 	at junit.framework.TestResult.runProtected(TestResult.java:124)
> 	at junit.framework.TestResult.run(TestResult.java:109)
> 	at junit.framework.TestCase.run(TestCase.java:120)
> 	at junit.framework.TestSuite.runTest(TestSuite.java:230)
> 	at junit.framework.TestSuite.run(TestSuite.java:225)
> 	at junit.framework.TestSuite.runTest(TestSuite.java:230)
> 	at junit.framework.TestSuite.run(TestSuite.java:225)
> 	at junit.extensions.TestDecorator.basicRun(TestDecorator.java:24)
> 	at junit.extensions.TestSetup$1.protect(TestSetup.java:21)
> 	at junit.framework.TestResult.runProtected(TestResult.java:124)
> 	at junit.extensions.TestSetup.run(TestSetup.java:25)
> 	at junit.framework.TestSuite.runTest(TestSuite.java:230)
> 	at junit.framework.TestSuite.run(TestSuite.java:225)
> 	at junit.framework.TestSuite.runTest(TestSuite.java:230)
> 	at junit.framework.TestSuite.run(TestSuite.java:225)
> 	at junit.framework.TestSuite.runTest(TestSuite.java:230)
> 	at junit.framework.TestSuite.run(TestSuite.java:225)
> 	at junit.textui.TestRunner.doRun(TestRunner.java:121)
> 	at junit.textui.TestRunner.start(TestRunner.java:185)
> 	at junit.textui.TestRunner.main(TestRunner.java:143)
> used 20781 ms F.
> (emb)replicationTests.ReplicationRun_Local_Encrypted_1.testReplication_Encrypted_1_stdLoad
used 21468 ms .
> (emb)replicationTests.ReplicationRun_Local_Encrypted_1.testReplication_Encrypted_1_miniLoad_negative
used 40654 ms .
> (emb)replicationTests.ReplicationRun_Local_3_p6.testReplication_Local_3_p6_autocommit_OK
used 20297 ms .
> (emb)replicationTests.ReplicationRun_Local_Derby4910.testSlaveWaitsForMaster used 31764
ms .
> (emb)replicationTests.Derby5937SlaveShutdownTest.testSlaveFailoverLeak used 3750 ms .
> (net)compatibility.ClientCompatibilityRunControl.combination(client 10.11.0.0 <>
server 10.11.0.0) used 7124 ms .
> (net)compatibility.ClientCompatibilityRunControl.combination(client 10.9.1.0 <>
server 10.11.0.0) used 5063 ms .
> (net)compatibility.ClientCompatibilityRunControl.combination(client 10.8.3.0 <>
server 10.11.0.0) used 5093 ms .
> (net)compatibility.ClientCompatibilityRunControl.combination(client 10.7.1.1 <>
server 10.11.0.0) used 4594 ms .
> (net)compatibility.ClientCompatibilityRunControl.combination(client 10.6.2.1 <>
server 10.11.0.0) used 3703 ms .
> (net)compatibility.ClientCompatibilityRunControl.combination(client 10.5.3.0 <>
server 10.11.0.0) used 3656 ms .
> (net)compatibility.ClientCompatibilityRunControl.combination(client 10.4.2.0 <>
server 10.11.0.0) used 3047 ms .
> (net)compatibility.ClientCompatibilityRunControl.combination(client 10.3.3.0 <>
server 10.11.0.0) used 3062 ms .
> (net)compatibility.ClientCompatibilityRunControl.combination(client 10.2.2.0 <>
server 10.11.0.0) used 3047 ms .
> (net)compatibility.ClientCompatibilityRunControl.combination(client 10.1.3.1 <>
server 10.11.0.0) used 3109 ms .
> (net)compatibility.ClientCompatibilityRunControl.combination(client 10.11.0.0 <>
server 10.9.1.0) used 5563 ms .
> (net)compatibility.ClientCompatibilityRunControl.combination(client 10.11.0.0 <>
server 10.8.3.0) used 6625 ms .
> (net)compatibility.ClientCompatibilityRunControl.combination(client 10.11.0.0 <>
server 10.7.1.1) used 9453 ms .
> (net)compatibility.ClientCompatibilityRunControl.combination(client 10.11.0.0 <>
server 10.6.2.1) used 7609 ms .
> (net)compatibility.ClientCompatibilityRunControl.combination(client 10.11.0.0 <>
server 10.5.3.0) used 6594 ms .
> (net)compatibility.ClientCompatibilityRunControl.combination(client 10.11.0.0 <>
server 10.4.2.0) used 6578 ms .
> (net)compatibility.ClientCompatibilityRunControl.combination(client 10.11.0.0 <>
server 10.3.3.0) used 6093 ms .
> (net)compatibility.ClientCompatibilityRunControl.combination(client 10.11.0.0 <>
server 10.2.2.0) used 4515 ms .
> (net)compatibility.ClientCompatibilityRunControl.combination(client 10.11.0.0 <>
server 10.1.3.1) used 7703 ms 
> Time: 13,225.59
> There was 1 failure:
> 1) testReplication_Local_3_p5_DERBY_3878(org.apache.derbyTesting.functionTests.tests.replicationTests.ReplicationRun_Local_3_p5)junit.framework.AssertionFailedError:
Server did not start in time
> 	at org.apache.derbyTesting.functionTests.tests.replicationTests.ReplicationRun.pingServer(ReplicationRun.java:2173)
> 	at org.apache.derbyTesting.functionTests.tests.replicationTests.ReplicationRun.startServer(ReplicationRun.java:1962)
> 	at org.apache.derbyTesting.functionTests.tests.replicationTests.ReplicationRun_Local_3_p5.testReplication_Local_3_p5_DERBY_3878(ReplicationRun_Local_3_p5.java:100)
> 	at sun.reflect.NativeMethodAccessorImpl.invoke0(Native Method)
> 	at sun.reflect.NativeMethodAccessorImpl.invoke(NativeMethodAccessorImpl.java:79)
> 	at sun.reflect.DelegatingMethodAccessorImpl.invoke(DelegatingMethodAccessorImpl.java:43)
> 	at org.apache.derbyTesting.junit.BaseTestCase.runBare(BaseTestCase.java:117)
> 	at org.apache.derbyTesting.functionTests.tests.replicationTests.ReplicationRun.runBare(ReplicationRun.java:247)
> 	at junit.extensions.TestDecorator.basicRun(TestDecorator.java:24)
> 	at junit.extensions.TestSetup$1.protect(TestSetup.java:21)
> 	at junit.extensions.TestSetup.run(TestSetup.java:25)
> FAILURES!!!
> Tests run: 15048,  Failures: 1,  Errors: 0

--
This message is automatically generated by JIRA.
If you think it was sent incorrectly, please contact your JIRA administrators
For more information on JIRA, see: http://www.atlassian.com/software/jira

Mime
View raw message