db-derby-dev mailing list archives

Site index · List index
Message view « Date » · « Thread »
Top « Date » · « Thread »
From "Mike Matrigali (JIRA)" <j...@apache.org>
Subject [jira] [Commented] (DERBY-6092) testPositionAgressive(org.apache.derbyTesting.functionTests.tests.jdbcapi.BlobClob4BlobTest)j fails with : 'The handle is invalid.: java.io.IOException'.
Date Wed, 03 Apr 2013 01:08:14 GMT

    [ https://issues.apache.org/jira/browse/DERBY-6092?page=com.atlassian.jira.plugin.system.issuetabpanels:comment-tabpanel&focusedCommentId=13620472#comment-13620472
] 

Mike Matrigali commented on DERBY-6092:
---------------------------------------

another failure 10.10 candidate branch
http://people.apache.org/~myrnavl/derby_test_results/v10_10/windows/testlog/ibm15/1461932-suites.All_diff.txt
There were 3 errors:
1) testPositionAgressive(org.apache.derbyTesting.functionTests.tests.jdbcapi.BlobClob4BlobTest)java.sql.SQLException:
Java exception: 'The handle is invalid.: java.io.IOException'.
	at org.apache.derby.impl.jdbc.SQLExceptionFactory.getSQLException(Unknown Source)
	at org.apache.derby.impl.jdbc.Util.newEmbedSQLException(Unknown Source)
	at org.apache.derby.impl.jdbc.Util.javaException(Unknown Source)
	at org.apache.derby.impl.jdbc.EmbedConnection.clearLOBMapping(Unknown Source)
	at org.apache.derby.impl.jdbc.EmbedConnection.commit(Unknown Source)
	at org.apache.derbyTesting.junit.BaseJDBCTestCase.commit(BaseJDBCTestCase.java:393)
	at org.apache.derbyTesting.functionTests.tests.jdbcapi.BlobClob4BlobTest.testPositionAgressive(BlobClob4BlobTest.java:1019)
	at sun.reflect.NativeMethodAccessorImpl.invoke0(Native Method)
	at sun.reflect.NativeMethodAccessorImpl.invoke(NativeMethodAccessorImpl.java:79)
	at sun.reflect.DelegatingMethodAccessorImpl.invoke(DelegatingMethodAccessorImpl.java:43)
	at org.apache.derbyTesting.junit.BaseTestCase.runBare(BaseTestCase.java:117)
	at org.apache.derbyTesting.junit.BaseJDBCTestCase.runBareOverridable(BaseJDBCTestCase.java:424)
	at org.apache.derbyTesting.junit.BaseJDBCTestCase.runBare(BaseJDBCTestCase.java:441)
	at junit.extensions.TestDecorator.basicRun(TestDecorator.java:24)
	at junit.extensions.TestSetup$1.protect(TestSetup.java:21)
	at junit.extensions.TestSetup.run(TestSetup.java:25)
	at org.apache.derbyTesting.junit.BaseTestSetup.run(BaseTestSetup.java:57)
	at junit.extensions.TestDecorator.basicRun(TestDecorator.java:24)
	at junit.extensions.TestSetup$1.protect(TestSetup.java:21)
	at junit.extensions.TestSetup.run(TestSetup.java:25)
	at org.apache.derbyTesting.junit.BaseTestSetup.run(BaseTestSetup.java:57)
Caused by: java.io.IOException: The handle is invalid.
	at java.io.RandomAccessFile.close0(Native Method)
	at java.io.RandomAccessFile.close(RandomAccessFile.java:573)
	at org.apache.derby.impl.jdbc.LOBFile.close(Unknown Source)
	... 40 more
2) cs_FailedStreamInsertCharBufferBoundaries(org.apache.derbyTesting.functionTests.tests.jdbcapi.Derby2017LayerATest)java.sql.SQLException:
A communications error has been detected: Connection reset by peer: socket write error.
	at org.apache.derby.client.am.SQLExceptionFactory.getSQLException(Unknown Source)
	at org.apache.derby.client.am.SqlException.getSQLException(Unknown Source)
	at org.apache.derby.client.am.ResultSet.next(Unknown Source)
	at org.apache.derbyTesting.functionTests.tests.jdbcapi.Derby2017LayerATest.doInsertTest(Derby2017LayerATest.java:563)
	at org.apache.derbyTesting.functionTests.tests.jdbcapi.Derby2017LayerATest.cs_FailedStreamInsertCharBufferBoundaries(Derby2017LayerATest.java:166)
	at sun.reflect.NativeMethodAccessorImpl.invoke0(Native Method)
	at sun.reflect.NativeMethodAccessorImpl.invoke(NativeMethodAccessorImpl.java:79)
	at sun.reflect.DelegatingMethodAccessorImpl.invoke(DelegatingMethodAccessorImpl.java:43)
	at org.apache.derbyTesting.junit.BaseTestCase.runBare(BaseTestCase.java:117)
	at org.apache.derbyTesting.junit.BaseJDBCTestCase.runBareOverridable(BaseJDBCTestCase.java:424)
	at org.apache.derbyTesting.junit.BaseJDBCTestCase.runBare(BaseJDBCTestCase.java:441)
	at junit.extensions.TestDecorator.basicRun(TestDecorator.java:24)
	at junit.extensions.TestSetup$1.protect(TestSetup.java:21)
	at junit.extensions.TestSetup.run(TestSetup.java:25)
	at org.apache.derbyTesting.junit.BaseTestSetup.run(BaseTestSetup.java:57)
	at junit.extensions.TestDecorator.basicRun(TestDecorator.java:24)
	at junit.extensions.TestSetup$1.protect(TestSetup.java:21)
	at junit.extensions.TestSetup.run(TestSetup.java:25)
Caused by: org.apache.derby.client.am.DisconnectException: A communications error has been
detected: Connection reset by peer: socket write error.
	at org.apache.derby.client.net.NetAgent.throwCommunicationsFailure(Unknown Source)
	at org.apache.derby.client.net.NetAgent.sendRequest(Unknown Source)
	at org.apache.derby.client.net.NetAgent.flush_(Unknown Source)
	at org.apache.derby.client.am.Agent.flow(Unknown Source)
	at org.apache.derby.client.am.ResultSet.flowFetch(Unknown Source)
	at org.apache.derby.client.net.NetCursor.getMoreData_(Unknown Source)
	at org.apache.derby.client.am.Cursor.stepNext(Unknown Source)
	at org.apache.derby.client.am.Cursor.next(Unknown Source)
	at org.apache.derby.client.am.ResultSet.nextX(Unknown Source)
	... 38 more
Caused by: java.net.SocketException: Connection reset by peer: socket write error
	at java.net.SocketOutputStream.socketWrite0(Native Method)
	at java.net.SocketOutputStream.socketWrite(SocketOutputStream.java:105)
	at java.net.SocketOutputStream.write(SocketOutputStream.java:149)
	at org.apache.derby.client.net.Request.sendBytes(Unknown Source)
	at org.apache.derby.client.net.Request.flush(Unknown Source)
	... 46 more
3) testCorrectClobDataWithMultiCall(org.apache.derbyTesting.functionTests.tests.jdbcapi.LobRsGetterTest)java.sql.SQLException:
Java exception: 'The handle is invalid.: java.io.IOException'.
	at org.apache.derby.impl.jdbc.SQLExceptionFactory.getSQLException(Unknown Source)
	at org.apache.derby.impl.jdbc.Util.newEmbedSQLException(Unknown Source)
	at org.apache.derby.impl.jdbc.Util.javaException(Unknown Source)
	at org.apache.derby.impl.jdbc.EmbedConnection.clearLOBMapping(Unknown Source)
	at org.apache.derby.impl.jdbc.EmbedConnection.rollback(Unknown Source)
	at org.apache.derbyTesting.junit.BaseJDBCTestCase.rollback(BaseJDBCTestCase.java:403)
	at org.apache.derbyTesting.functionTests.tests.jdbcapi.LobRsGetterTest.testCorrectClobDataWithMultiCall(LobRsGetterTest.java:451)
	at sun.reflect.NativeMethodAccessorImpl.invoke0(Native Method)
	at sun.reflect.NativeMethodAccessorImpl.invoke(NativeMethodAccessorImpl.java:79)
	at sun.reflect.DelegatingMethodAccessorImpl.invoke(DelegatingMethodAccessorImpl.java:43)
	at org.apache.derbyTesting.junit.BaseTestCase.runBare(BaseTestCase.java:117)
	at org.apache.derbyTesting.junit.BaseJDBCTestCase.runBareOverridable(BaseJDBCTestCase.java:424)
	at org.apache.derbyTesting.junit.BaseJDBCTestCase.runBare(BaseJDBCTestCase.java:441)
	at junit.extensions.TestDecorator.basicRun(TestDecorator.java:24)
	at junit.extensions.TestSetup$1.protect(TestSetup.java:21)
	at junit.extensions.TestSetup.run(TestSetup.java:25)
	at org.apache.derbyTesting.junit.BaseTestSetup.run(BaseTestSetup.java:57)
Caused by: java.io.IOException: The handle is invalid.
	at java.io.RandomAccessFile.close0(Native Method)
	at java.io.RandomAccessFile.close(RandomAccessFile.java:573)
	at org.apache.derby.impl.jdbc.LOBFile.close(Unknown Source)
	... 35 more

FAILURES!!!
Tests run: 15044,  Failures: 0,  Errors: 3

                
> testPositionAgressive(org.apache.derbyTesting.functionTests.tests.jdbcapi.BlobClob4BlobTest)j
fails with : 'The handle is invalid.: java.io.IOException'.
> ---------------------------------------------------------------------------------------------------------------------------------------------------------
>
>                 Key: DERBY-6092
>                 URL: https://issues.apache.org/jira/browse/DERBY-6092
>             Project: Derby
>          Issue Type: Bug
>          Components: JDBC
>    Affects Versions: 10.10.1.2
>         Environment: IBM 1,5 
> java.specification.version: 1.5
> java.runtime.version: pwi32dev-20121015 (SR15 )
> java.fullversion: J2RE 1.5.0 IBM J9 2.3 Windows XP x86-32 j9vmwi3223-20121012 (JIT enabled)
> J9VM - 20121010_124616_lHdSMr
> JIT  - 20120914_26053ifx1_r8
> GC   - 20120911_AA
>            Reporter: Kathey Marsden
>
> There was 1 error:
> http://people.apache.org/~myrnavl/derby_test_results/main/windows/testlog/ibm15/1449432-suites.All_diff.txt
> 1) testPositionAgressive(org.apache.derbyTesting.functionTests.tests.jdbcapi.BlobClob4BlobTest)java.sql.SQLException:
Java exception: 'The handle is invalid.: java.io.IOException'.
> 	at org.apache.derby.impl.jdbc.SQLExceptionFactory.getSQLException(Unknown Source)
> 	at org.apache.derby.impl.jdbc.Util.newEmbedSQLException(Unknown Source)
> 	at org.apache.derby.impl.jdbc.Util.javaException(Unknown Source)
> 	at org.apache.derby.impl.jdbc.EmbedConnection.clearLOBMapping(Unknown Source)
> 	at org.apache.derby.impl.jdbc.EmbedConnection.commit(Unknown Source)
> 	at org.apache.derbyTesting.junit.BaseJDBCTestCase.commit(BaseJDBCTestCase.java:393)
> 	at org.apache.derbyTesting.functionTests.tests.jdbcapi.BlobClob4BlobTest.testPositionAgressive(BlobClob4BlobTest.java:1070)
> 	at sun.reflect.NativeMethodAccessorImpl.invoke0(Native Method)
> 	at sun.reflect.NativeMethodAccessorImpl.invoke(NativeMethodAccessorImpl.java:79)
> 	at sun.reflect.DelegatingMethodAccessorImpl.invoke(DelegatingMethodAccessorImpl.java:43)
> 	at org.apache.derbyTesting.junit.BaseTestCase.runBare(BaseTestCase.java:117)
> 	at org.apache.derbyTesting.junit.BaseJDBCTestCase.runBareOverridable(BaseJDBCTestCase.java:424)
> 	at org.apache.derbyTesting.junit.BaseJDBCTestCase.runBare(BaseJDBCTestCase.java:441)
> 	at junit.extensions.TestDecorator.basicRun(TestDecorator.java:24)
> 	at junit.extensions.TestSetup$1.protect(TestSetup.java:21)
> 	at junit.extensions.TestSetup.run(TestSetup.java:25)
> 	at org.apache.derbyTesting.junit.BaseTestSetup.run(BaseTestSetup.java:57)
> 	at junit.extensions.TestDecorator.basicRun(TestDecorator.java:24)
> 	at junit.extensions.TestSetup$1.protect(TestSetup.java:21)
> 	at junit.extensions.TestSetup.run(TestSetup.java:25)
> 	at org.apache.derbyTesting.junit.BaseTestSetup.run(BaseTestSetup.java:57)
> 	at junit.extensions.TestDecorator.basicRun(TestDecorator.java:24)
> 	at junit.extensions.TestSetup$1.protect(TestSetup.java:21)
> 	at junit.extensions.TestSetup.run(TestSetup.java:25)
> 	at junit.extensions.TestDecorator.basicRun(TestDecorator.java:24)
> 	at junit.extensions.TestSetup$1.protect(TestSetup.java:21)
> 	at junit.extensions.TestSetup.run(TestSetup.java:25)
> 	at org.apache.derbyTesting.junit.BaseTestSetup.run(BaseTestSetup.java:57)
> 	at junit.extensions.TestDecorator.basicRun(TestDecorator.java:24)
> 	at junit.extensions.TestSetup$1.protect(TestSetup.java:21)
> 	at junit.extensions.TestSetup.run(TestSetup.java:25)
> Caused by: java.io.IOException: The handle is invalid.
> 	at java.io.RandomAccessFile.close0(Native Method)
> 	at java.io.RandomAccessFile.close(RandomAccessFile.java:573)
> 	at org.apache.derby.impl.jdbc.LOBFile.close(Unknown Source)
> 	at org.apache.derby.impl.jdbc.EncryptedLOBFile.close(Unknown Source)
> 	... 53 more

--
This message is automatically generated by JIRA.
If you think it was sent incorrectly, please contact your JIRA administrators
For more information on JIRA, see: http://www.atlassian.com/software/jira

Mime
View raw message