db-derby-dev mailing list archives

Site index · List index
Message view « Date » · « Thread »
Top « Date » · « Thread »
From "Mike Matrigali (JIRA)" <j...@apache.org>
Subject [jira] [Commented] (DERBY-6092) testPositionAgressive(org.apache.derbyTesting.functionTests.tests.jdbcapi.BlobClob4BlobTest)j fails with : 'The handle is invalid.: java.io.IOException'.
Date Mon, 08 Apr 2013 19:41:16 GMT

    [ https://issues.apache.org/jira/browse/DERBY-6092?page=com.atlassian.jira.plugin.system.issuetabpanels:comment-tabpanel&focusedCommentId=13625715#comment-13625715
] 

Mike Matrigali commented on DERBY-6092:
---------------------------------------

trunk saw this error also.  On friday all the IBM ibm15 test runs across all releases were
updated to use the following version, taken 
from the following link reporting the derbyall output.  some of the reporting headers are
out of date, but this info is live:
http://people.apache.org/~myrnavl/derby_test_results/main/windows/testlog/ibm15/1465525-derbyall_diff.txt
derbyall failures *************************************************************

derbyall full report -------------------------------------------------------------
                     -------------------------------------------------------------
Generating report for RunSuite derbyall  null null null true 
------------------ Java Information ------------------
Java Version:    1.5.0
Java Vendor:     IBM Corporation
Java home:       C:\jartest\ibm15\jre
Java classpath:  C:/jartest/jars/derbyrun.jar;C:/jartest/jars/derbyTesting.jar;c:/jartest/tools/java/jakarta-oro-2.0.8.jar;c:/jartest/junit/junit.jar;
OS name:         Windows XP
OS architecture: x86
OS version:      5.1 build 2600 Service Pack 3
Java user name:  cloudtest
Java user home:  C:\Documents and Settings\cloudtest
Java user dir:   C:\jartest\JarResults.2013-04-07\ibm15_derbyall
java.specification.name: Java Platform API Specification
java.specification.version: 1.5
java.runtime.version: pwi32devifx-20130304b (SR16 +IV37422)
java.fullversion: J2RE 1.5.0 IBM J9 2.3 Windows XP x86-32 j9vmwi3223-20130203 (JIT enabled)
J9VM - 20130112_134700_lHdSMr
JIT  - 20121221_30553_r8
GC   - 20120911_AA


Here is the link for the error in trunk:
http://people.apache.org/~myrnavl/derby_test_results/main/windows/testlog/ibm15/1465525-suites.All_diff.txt

There was 1 error:
1) testPositionAgressive(org.apache.derbyTesting.functionTests.tests.jdbcapi.BlobClob4BlobTest)java.sql.SQLException:
Java exception: 'The handle is invalid.: java.io.IOException'.
	at org.apache.derby.impl.jdbc.SQLExceptionFactory.getSQLException(Unknown Source)
	at org.apache.derby.impl.jdbc.Util.newEmbedSQLException(Unknown Source)
	at org.apache.derby.impl.jdbc.Util.javaException(Unknown Source)
	at org.apache.derby.impl.jdbc.EmbedConnection.clearLOBMapping(Unknown Source)
	at org.apache.derby.impl.jdbc.EmbedConnection.commit(Unknown Source)
	at org.apache.derbyTesting.junit.BaseJDBCTestCase.commit(BaseJDBCTestCase.java:411)
	at org.apache.derbyTesting.functionTests.tests.jdbcapi.BlobClob4BlobTest.testPositionAgressive(BlobClob4BlobTest.java:1063)
	at sun.reflect.NativeMethodAccessorImpl.invoke0(Native Method)
	at sun.reflect.NativeMethodAccessorImpl.invoke(NativeMethodAccessorImpl.java:79)
	at sun.reflect.DelegatingMethodAccessorImpl.invoke(DelegatingMethodAccessorImpl.java:43)
	at org.apache.derbyTesting.junit.BaseTestCase.runBare(BaseTestCase.java:117)
	at org.apache.derbyTesting.junit.BaseJDBCTestCase.runBareOverridable(BaseJDBCTestCase.java:442)
	at org.apache.derbyTesting.junit.BaseJDBCTestCase.runBare(BaseJDBCTestCase.java:459)
	at junit.extensions.TestDecorator.basicRun(TestDecorator.java:24)
	at junit.extensions.TestSetup$1.protect(TestSetup.java:21)
	at junit.extensions.TestSetup.run(TestSetup.java:25)
	at org.apache.derbyTesting.junit.BaseTestSetup.run(BaseTestSetup.java:57)
	at junit.extensions.TestDecorator.basicRun(TestDecorator.java:24)
	at junit.extensions.TestSetup$1.protect(TestSetup.java:21)
	at junit.extensions.TestSetup.run(TestSetup.java:25)
	at org.apache.derbyTesting.junit.BaseTestSetup.run(BaseTestSetup.java:57)
	at junit.extensions.TestDecorator.basicRun(TestDecorator.java:24)
	at junit.extensions.TestSetup$1.protect(TestSetup.java:21)
	at junit.extensions.TestSetup.run(TestSetup.java:25)
	at junit.extensions.TestDecorator.basicRun(TestDecorator.java:24)
	at junit.extensions.TestSetup$1.protect(TestSetup.java:21)
	at junit.extensions.TestSetup.run(TestSetup.java:25)
	at org.apache.derbyTesting.junit.BaseTestSetup.run(BaseTestSetup.java:57)
	at junit.extensions.TestDecorator.basicRun(TestDecorator.java:24)
	at junit.extensions.TestSetup$1.protect(TestSetup.java:21)
	at junit.extensions.TestSetup.run(TestSetup.java:25)
Caused by: java.io.IOException: The handle is invalid.
	at java.io.RandomAccessFile.close0(Native Method)
	at java.io.RandomAccessFile.close(RandomAccessFile.java:573)
	at org.apache.derby.impl.jdbc.LOBFile.close(Unknown Source)
	at org.apache.derby.impl.jdbc.EncryptedLOBFile.close(Unknown Source)
	... 53 more

FAILURES!!!
Tests run: 15056,  Failures: 0,  Errors: 1

                
> testPositionAgressive(org.apache.derbyTesting.functionTests.tests.jdbcapi.BlobClob4BlobTest)j
fails with : 'The handle is invalid.: java.io.IOException'.
> ---------------------------------------------------------------------------------------------------------------------------------------------------------
>
>                 Key: DERBY-6092
>                 URL: https://issues.apache.org/jira/browse/DERBY-6092
>             Project: Derby
>          Issue Type: Bug
>          Components: JDBC
>    Affects Versions: 10.10.1.2
>         Environment: IBM 1,5 
> java.specification.version: 1.5
> java.runtime.version: pwi32dev-20121015 (SR15 )
> java.fullversion: J2RE 1.5.0 IBM J9 2.3 Windows XP x86-32 j9vmwi3223-20121012 (JIT enabled)
> J9VM - 20121010_124616_lHdSMr
> JIT  - 20120914_26053ifx1_r8
> GC   - 20120911_AA
>            Reporter: Kathey Marsden
>            Priority: Blocker
>         Attachments: derby-6092_noorderby.diff
>
>
> There was 1 error:
> http://people.apache.org/~myrnavl/derby_test_results/main/windows/testlog/ibm15/1449432-suites.All_diff.txt
> 1) testPositionAgressive(org.apache.derbyTesting.functionTests.tests.jdbcapi.BlobClob4BlobTest)java.sql.SQLException:
Java exception: 'The handle is invalid.: java.io.IOException'.
> 	at org.apache.derby.impl.jdbc.SQLExceptionFactory.getSQLException(Unknown Source)
> 	at org.apache.derby.impl.jdbc.Util.newEmbedSQLException(Unknown Source)
> 	at org.apache.derby.impl.jdbc.Util.javaException(Unknown Source)
> 	at org.apache.derby.impl.jdbc.EmbedConnection.clearLOBMapping(Unknown Source)
> 	at org.apache.derby.impl.jdbc.EmbedConnection.commit(Unknown Source)
> 	at org.apache.derbyTesting.junit.BaseJDBCTestCase.commit(BaseJDBCTestCase.java:393)
> 	at org.apache.derbyTesting.functionTests.tests.jdbcapi.BlobClob4BlobTest.testPositionAgressive(BlobClob4BlobTest.java:1070)
> 	at sun.reflect.NativeMethodAccessorImpl.invoke0(Native Method)
> 	at sun.reflect.NativeMethodAccessorImpl.invoke(NativeMethodAccessorImpl.java:79)
> 	at sun.reflect.DelegatingMethodAccessorImpl.invoke(DelegatingMethodAccessorImpl.java:43)
> 	at org.apache.derbyTesting.junit.BaseTestCase.runBare(BaseTestCase.java:117)
> 	at org.apache.derbyTesting.junit.BaseJDBCTestCase.runBareOverridable(BaseJDBCTestCase.java:424)
> 	at org.apache.derbyTesting.junit.BaseJDBCTestCase.runBare(BaseJDBCTestCase.java:441)
> 	at junit.extensions.TestDecorator.basicRun(TestDecorator.java:24)
> 	at junit.extensions.TestSetup$1.protect(TestSetup.java:21)
> 	at junit.extensions.TestSetup.run(TestSetup.java:25)
> 	at org.apache.derbyTesting.junit.BaseTestSetup.run(BaseTestSetup.java:57)
> 	at junit.extensions.TestDecorator.basicRun(TestDecorator.java:24)
> 	at junit.extensions.TestSetup$1.protect(TestSetup.java:21)
> 	at junit.extensions.TestSetup.run(TestSetup.java:25)
> 	at org.apache.derbyTesting.junit.BaseTestSetup.run(BaseTestSetup.java:57)
> 	at junit.extensions.TestDecorator.basicRun(TestDecorator.java:24)
> 	at junit.extensions.TestSetup$1.protect(TestSetup.java:21)
> 	at junit.extensions.TestSetup.run(TestSetup.java:25)
> 	at junit.extensions.TestDecorator.basicRun(TestDecorator.java:24)
> 	at junit.extensions.TestSetup$1.protect(TestSetup.java:21)
> 	at junit.extensions.TestSetup.run(TestSetup.java:25)
> 	at org.apache.derbyTesting.junit.BaseTestSetup.run(BaseTestSetup.java:57)
> 	at junit.extensions.TestDecorator.basicRun(TestDecorator.java:24)
> 	at junit.extensions.TestSetup$1.protect(TestSetup.java:21)
> 	at junit.extensions.TestSetup.run(TestSetup.java:25)
> Caused by: java.io.IOException: The handle is invalid.
> 	at java.io.RandomAccessFile.close0(Native Method)
> 	at java.io.RandomAccessFile.close(RandomAccessFile.java:573)
> 	at org.apache.derby.impl.jdbc.LOBFile.close(Unknown Source)
> 	at org.apache.derby.impl.jdbc.EncryptedLOBFile.close(Unknown Source)
> 	... 53 more

--
This message is automatically generated by JIRA.
If you think it was sent incorrectly, please contact your JIRA administrators
For more information on JIRA, see: http://www.atlassian.com/software/jira

Mime
View raw message