db-derby-dev mailing list archives

Site index · List index
Message view « Date » · « Thread »
Top « Date » · « Thread »
From Apache Jenkins Server <jenk...@builds.apache.org>
Subject Build failed in Jenkins: Derby-branch-10.8 #186
Date Sat, 30 Mar 2013 08:24:40 GMT
See <https://builds.apache.org/job/Derby-branch-10.8/186/changes>

Changes:

[myrnavl] DERBY-3838; Convert derbynet/DerbyNetAutoStart to JUnit
  backporting revision 1462304 and 1462677 from 10.9.

------------------------------------------
[...truncated 4801 lines...]
AU        tools/release/notices/nisttestgrant.txt
AU        tools/release/notices/separator.txt
A         tools/release/jirasoap
A         tools/release/jirasoap/src
A         tools/release/jirasoap/src/main
A         tools/release/jirasoap/src/main/java
A         tools/release/jirasoap/src/main/java/org
A         tools/release/jirasoap/src/main/java/org/apache
A         tools/release/jirasoap/src/main/java/org/apache/derbyBuild
A         tools/release/jirasoap/src/main/java/org/apache/derbyBuild/jirasoap
AU        tools/release/jirasoap/src/main/java/org/apache/derbyBuild/jirasoap/FilteredIssueLister.java
AU        tools/release/jirasoap/src/main/java/org/apache/derbyBuild/jirasoap/DerbyVersion.java
AU        tools/release/jirasoap/src/main/java/org/apache/derbyBuild/jirasoap/FilteredIssueListerAntWrapper.java
A         tools/release/jirasoap/src/main/wsdl
AU        tools/release/jirasoap/src/main/wsdl/jirasoapservice-v2.wsdl
AU        tools/release/jirasoap/pom.xml
AU        tools/release/build.xml
A         tools/release/templates
AU        tools/release/templates/releaseNote.html
AU        tools/release/templates/releaseSummaryTemplate.xml
A         tools/ide
A         tools/ide/netbeans
A         tools/ide/netbeans/6.0
A         tools/ide/netbeans/6.0/nbproject
A         tools/ide/netbeans/6.0/nbproject/project.xml
A         tools/ide/netbeans/5.5
A         tools/ide/netbeans/5.5/nbproject
A         tools/ide/netbeans/5.5/nbproject/project.xml
A         tools/ide/netbeans/README.txt
A         tools/java
AU        tools/java/javacc.jar
AU        tools/java/xml-apis.jar
AU        tools/java/jakarta-oro-2.0.8.jar
AU        tools/java/geronimo-spec-servlet-2.4-rc4.jar
A         tools/ant
A         tools/ant/xsl
AU        tools/ant/xsl/sysinfo_junitreport.xsl
A         tools/ant/properties
AU        tools/ant/properties/modern.properties
AU        tools/ant/properties/packaging.tmpl
AU        tools/ant/properties/compilepath.properties
AU        tools/ant/properties/sanetrue.properties
AU        tools/ant/properties/defaultcompiler.properties
AU        tools/ant/properties/extrapath.properties
AU        tools/ant/properties/release.properties
AU        tools/ant/properties/dirs.properties
AU        tools/ant/properties/sanefalse.properties
A         tools/j2ee
A         tools/j2ee/derby
A         tools/j2ee/derby/WEB-INF
AU        tools/j2ee/derby/WEB-INF/web.xml
A         tools/javadoc
AU        tools/javadoc/publishedapi_jdbc3.ant
A         tools/javadoc/logo
AU        tools/javadoc/logo/derby_logo64.png
AU        tools/javadoc/logo/derby_logo32.png
AU        tools/javadoc/publishedapi_jdbc4.ant
AU        tools/javadoc/derbydocs_jdbc4_exclusions.ant
A         tools/javadoc/package-list
AU        tools/javadoc/publishedapi.ant
A         tools/javadoc/derbydocs_exclusions.ant
A         tools/l10n
AU        tools/l10n/LocCompare.java
AU        tools/l10n/README
AU        tools/l10n/build.xml
A         tools/jar
AU        tools/jar/dnc.properties
AU        tools/jar/net.properties
AU        tools/jar/extraDBMSclasses.properties
AU        tools/jar/DBMSnodes.properties
AU        tools/jar/extraDBMStypes.properties
AU        tools/jar/tools.properties
A         tools/testing
A         tools/testing/i18nTestGenerator
A         tools/testing/i18nTestGenerator/genClient1.sed
AU        tools/testing/i18nTestGenerator/genClient2.sed
AU        tools/testing/i18nTestGenerator/generateClientMessageTest.sh
AU        tools/testing/i18nTestGenerator/clientPrologue.txt
AU        tools/testing/i18nTestGenerator/README
A         tools/testing/reporting
A         tools/testing/reporting/scripts
AU        tools/testing/reporting/scripts/svnDiffToRev
AU        tools/testing/reporting/scripts/mkGNUplot
AU        tools/testing/reporting/scripts/cygwin-system
AU        tools/testing/reporting/scripts/system
AU        tools/testing/reporting/scripts/buildDerby
AU        tools/testing/reporting/scripts/textMail
AU        tools/testing/reporting/scripts/initDERBYDIR
AU        tools/testing/reporting/scripts/env
AU        tools/testing/reporting/scripts/updateBuildTestDerby
AU        tools/testing/reporting/scripts/createBaselineFiles
AU        tools/testing/reporting/scripts/platformsDurPrcnt
AU        tools/testing/reporting/scripts/testSummariesDerby
AU        tools/testing/reporting/scripts/README.1
AU        tools/testing/reporting/scripts/README.2
AU        tools/testing/reporting/scripts/mkJIRArefs
AU        tools/testing/reporting/scripts/mkAllPlotDataAndPlots
AU        tools/testing/reporting/scripts/solaris-cpu_mem
AU        tools/testing/reporting/scripts/scp_dummy
AU        tools/testing/reporting/scripts/createBaselineFilesOnePlatform
AU        tools/testing/reporting/scripts/toSeconds
AU        tools/testing/reporting/scripts/getBaselineTime
AU        tools/testing/reporting/scripts/cronCurrentTestInfoDerby
AU        tools/testing/reporting/scripts/updateDerby
AU        tools/testing/reporting/scripts/svnLogRevs
AU        tools/testing/reporting/scripts/cronUpdateBuildTestDerby
AU        tools/testing/reporting/scripts/platformsFailCount
AU        tools/testing/reporting/scripts/mkDerbyTestIndex_all
AU        tools/testing/reporting/scripts/mkJIRArefs.current
AU        tools/testing/reporting/scripts/mkAllDerbyTestInfo.public
AU        tools/testing/reporting/scripts/runAllTests
AU        tools/testing/reporting/scripts/cronMkAllPlotDataAndPlots
AU        tools/testing/reporting/scripts/linux-system
AU        tools/testing/reporting/scripts/linux-cpu_mem
AU        tools/testing/reporting/scripts/fromSeconds
AU        tools/testing/reporting/scripts/calcPercent
AU        tools/testing/reporting/scripts/cygwin-cpu_mem
AU        tools/testing/reporting/scripts/mkDerbyTestIndex
AU        tools/testing/reporting/scripts/cpu_mem
AU        tools/testing/reporting/scripts/mkPercentForTimeListVsBaseline
AU        tools/testing/reporting/scripts/mkUpdateInfo
A         tools/testing/reporting/scripts/gnuplot
AU        tools/testing/reporting/scripts/gnuplot/duration_all.gp
AU        tools/testing/reporting/scripts/gnuplot/duration.gp
AU        tools/testing/reporting/scripts/doplot_all
AU        tools/testing/reporting/scripts/testPlatformsDerby
AU        tools/testing/reporting/scripts/solaris-system
AU        tools/testing/reporting/scripts/mkGNUplot.recent
AU        tools/testing/reporting/scripts/cronMkDerbyTestIndex_all
AU        tools/testing/reporting/scripts/cronUpdateAllTestInfoDerby
AU        tools/testing/reporting/scripts/testHistoriesDerby
AU        tools/testing/reporting/scripts/svnLogRevs.new
AU        tools/testing/reporting/scripts/doplot
AU        tools/testing/reporting/scripts/mkAllDerbyTestInfo
AU        tools/testing/reporting/scripts/vsTimeBase
AU        tools/testing/reporting/scripts/calcJarFootprint
AU        tools/testing/reporting/scripts/mkSandBoxSummary
AU        tools/testing/reporting/scripts/TODO
AU        tools/testing/reporting/scripts/mkGNUplot_last20
AU        tools/testing/reporting/scripts/testDerby
AU        tools/testing/reporting/scripts/startDerbyTests
A         tools/testing/reporting/Failures
AU        tools/testing/reporting/Failures/JIRA_description.txt
A         tools/testing/reporting/TEMPLATES
AU        tools/testing/reporting/TEMPLATES/env.sh
AU        tools/testing/reporting/TEMPLATES/testenv.sh
AU        tools/testing/reporting/TEMPLATES/index.html
AU        tools/testing/reporting/TEMPLATES/index.shtml
AU        published_api_overview.html
A         bin
AU        bin/dblook.bat
AU        bin/setNetworkServerCP
AU        bin/sysinfo.bat
AU        bin/derby_common.bat
AU        bin/startNetworkServer.bat
AU        bin/setNetworkServerCP.bat
AU        bin/NetworkServerControl.bat
AU        bin/ij.bat
AU        bin/setNetworkClientCP
AU        bin/setEmbeddedCP
AU        bin/stopNetworkServer.bat
AU        bin/setNetworkClientCP.bat
AU        bin/setEmbeddedCP.bat
A         bin/templates
AU        bin/templates/NetworkServerControl
AU        bin/templates/ij
AU        bin/templates/derby_common.sh
AU        bin/templates/stopNetworkServer
AU        bin/templates/dblook
AU        bin/templates/sysinfo
AU        bin/templates/startNetworkServer
AU        RELEASE-NOTES.html
AU        index.html
AU        KEYS
 U        .
At revision 1462713
[Derby-branch-10.8] $ /bin/bash -xe /tmp/hudson3465007038479025551.sh
FATAL: Unable to delete script file /tmp/hudson3465007038479025551.sh
hudson.util.IOException2: remote file operation failed: /tmp/hudson3465007038479025551.sh
at hudson.remoting.Channel@74b38dde:ubuntu2
	at hudson.FilePath.act(FilePath.java:861)
	at hudson.FilePath.act(FilePath.java:838)
	at hudson.FilePath.delete(FilePath.java:1223)
	at hudson.tasks.CommandInterpreter.perform(CommandInterpreter.java:101)
	at hudson.tasks.CommandInterpreter.perform(CommandInterpreter.java:60)
	at hudson.tasks.BuildStepMonitor$1.perform(BuildStepMonitor.java:19)
	at hudson.model.AbstractBuild$AbstractBuildExecution.perform(AbstractBuild.java:810)
	at hudson.model.Build$BuildExecution.build(Build.java:199)
	at hudson.model.Build$BuildExecution.doRun(Build.java:160)
	at hudson.model.AbstractBuild$AbstractBuildExecution.run(AbstractBuild.java:592)
	at hudson.model.Run.execute(Run.java:1568)
	at hudson.model.FreeStyleBuild.run(FreeStyleBuild.java:46)
	at hudson.model.ResourceController.execute(ResourceController.java:88)
	at hudson.model.Executor.run(Executor.java:236)
Caused by: hudson.remoting.ChannelClosedException: channel is already closed
	at hudson.remoting.Channel.send(Channel.java:494)
	at hudson.remoting.Request.call(Request.java:129)
	at hudson.remoting.Channel.call(Channel.java:672)
	at hudson.FilePath.act(FilePath.java:854)
	... 13 more
Caused by: hudson.remoting.Channel$OrderlyShutdown: java.util.concurrent.TimeoutException:
Ping started on 1364631447051 hasn't completed at 1364631687052
	at hudson.remoting.Channel$CloseCommand.execute(Channel.java:850)
	at hudson.remoting.Channel$2.handle(Channel.java:435)
	at hudson.remoting.SynchronousCommandTransport$ReaderThread.run(SynchronousCommandTransport.java:60)
Caused by: Command close created at
	at hudson.remoting.Command.<init>(Command.java:56)
	at hudson.remoting.Channel$CloseCommand.<init>(Channel.java:844)
	at hudson.remoting.Channel$CloseCommand.<init>(Channel.java:842)
	at hudson.remoting.Channel.close(Channel.java:909)
	at hudson.slaves.ChannelPinger$1.onDead(ChannelPinger.java:110)
	at hudson.remoting.PingThread.ping(PingThread.java:120)
	at hudson.remoting.PingThread.run(PingThread.java:81)
Caused by: java.util.concurrent.TimeoutException: Ping started on 1364631447051 hasn't completed
at 1364631687052
	... 2 more
FATAL: hudson.remoting.RequestAbortedException: hudson.remoting.Channel$OrderlyShutdown: java.util.concurrent.TimeoutException:
Ping started on 1364631447051 hasn't completed at 1364631687052
hudson.remoting.RequestAbortedException: hudson.remoting.RequestAbortedException: hudson.remoting.Channel$OrderlyShutdown:
java.util.concurrent.TimeoutException: Ping started on 1364631447051 hasn't completed at 1364631687052
	at hudson.remoting.Request.call(Request.java:174)
	at hudson.remoting.Channel.call(Channel.java:672)
	at hudson.Launcher$RemoteLauncher.launch(Launcher.java:852)
	at hudson.Launcher$ProcStarter.start(Launcher.java:353)
	at hudson.Launcher$ProcStarter.join(Launcher.java:360)
	at hudson.tasks.CommandInterpreter.perform(CommandInterpreter.java:91)
	at hudson.tasks.CommandInterpreter.perform(CommandInterpreter.java:60)
	at hudson.tasks.BuildStepMonitor$1.perform(BuildStepMonitor.java:19)
	at hudson.model.AbstractBuild$AbstractBuildExecution.perform(AbstractBuild.java:810)
	at hudson.model.Build$BuildExecution.build(Build.java:199)
	at hudson.model.Build$BuildExecution.doRun(Build.java:160)
	at hudson.model.AbstractBuild$AbstractBuildExecution.run(AbstractBuild.java:592)
	at hudson.model.Run.execute(Run.java:1568)
	at hudson.model.FreeStyleBuild.run(FreeStyleBuild.java:46)
	at hudson.model.ResourceController.execute(ResourceController.java:88)
	at hudson.model.Executor.run(Executor.java:236)
Caused by: hudson.remoting.RequestAbortedException: hudson.remoting.Channel$OrderlyShutdown:
java.util.concurrent.TimeoutException: Ping started on 1364631447051 hasn't completed at 1364631687052
	at hudson.remoting.Request.abort(Request.java:299)
	at hudson.remoting.Channel.terminate(Channel.java:732)
	at hudson.remoting.Channel$CloseCommand.execute(Channel.java:850)
	at hudson.remoting.Channel$2.handle(Channel.java:435)
	at hudson.remoting.SynchronousCommandTransport$ReaderThread.run(SynchronousCommandTransport.java:60)
Caused by: hudson.remoting.Channel$OrderlyShutdown: java.util.concurrent.TimeoutException:
Ping started on 1364631447051 hasn't completed at 1364631687052
	... 3 more
Caused by: Command close created at
	at hudson.remoting.Command.<init>(Command.java:56)
	at hudson.remoting.Channel$CloseCommand.<init>(Channel.java:844)
	at hudson.remoting.Channel$CloseCommand.<init>(Channel.java:842)
	at hudson.remoting.Channel.close(Channel.java:909)
	at hudson.slaves.ChannelPinger$1.onDead(ChannelPinger.java:110)
	at hudson.remoting.PingThread.ping(PingThread.java:120)
	at hudson.remoting.PingThread.run(PingThread.java:81)
Caused by: java.util.concurrent.TimeoutException: Ping started on 1364631447051 hasn't completed
at 1364631687052
	... 2 more

Mime
View raw message