db-derby-dev mailing list archives

Site index · List index
Message view « Date » · « Thread »
Top « Date » · « Thread »
From "Myrna van Lunteren (JIRA)" <j...@apache.org>
Subject [jira] [Updated] (DERBY-5754) nightly regresstession test failure:RAFReadWriteMultipleThreads(org.apache.derbyTesting.functionTests.tests.store.InterruptResilienceTest)java.sql.SQLException:
Date Wed, 26 Sep 2012 21:53:09 GMT

     [ https://issues.apache.org/jira/browse/DERBY-5754?page=com.atlassian.jira.plugin.system.issuetabpanels:all-tabpanel
]

Myrna van Lunteren updated DERBY-5754:
--------------------------------------

    Urgency: Normal
     Labels: derby_triage10_10  (was: )
    
> nightly regresstession test failure:RAFReadWriteMultipleThreads(org.apache.derbyTesting.functionTests.tests.store.InterruptResilienceTest)java.sql.SQLException:
> ----------------------------------------------------------------------------------------------------------------------------------------------------------------
>
>                 Key: DERBY-5754
>                 URL: https://issues.apache.org/jira/browse/DERBY-5754
>             Project: Derby
>          Issue Type: Bug
>          Components: Test
>    Affects Versions: 10.8.2.3
>            Reporter: Mike Matrigali
>              Labels: derby_triage10_10
>
> http://people.apache.org/~myrnavl/derby_test_results/v10_8/windows/testlog/ibm16/1335325-suites.All_diff.txt
> intermittent error failed in 10.8 branch, ibm16 jvm, build 1335325
> There was 1 error:
> 1) testRAFReadWriteMultipleThreads(org.apache.derbyTesting.functionTests.tests.store.InterruptResilienceTest)java.sql.SQLException:
The exception 'junit.framework.AssertionFailedError: WorkerThread 0' was thrown while evaluating
an expression.
> 	at org.apache.derby.impl.jdbc.SQLExceptionFactory40.getSQLException(Unknown Source)
> 	at org.apache.derby.impl.jdbc.Util.newEmbedSQLException(Unknown Source)
> 	at org.apache.derby.impl.jdbc.Util.seeNextException(Unknown Source)
> 	at org.apache.derby.impl.jdbc.TransactionResourceImpl.wrapInSQLException(Unknown Source)
> 	at org.apache.derby.impl.jdbc.TransactionResourceImpl.handleException(Unknown Source)
> 	at org.apache.derby.impl.jdbc.EmbedConnection.handleException(Unknown Source)
> 	at org.apache.derby.impl.jdbc.ConnectionChild.handleException(Unknown Source)
> 	at org.apache.derby.impl.jdbc.EmbedStatement.executeStatement(Unknown Source)
> 	at org.apache.derby.impl.jdbc.EmbedStatement.execute(Unknown Source)
> 	at org.apache.derby.impl.jdbc.EmbedStatement.executeUpdate(Unknown Source)
> 	at org.apache.derbyTesting.functionTests.tests.store.InterruptResilienceTest.testRAFReadWriteMultipleThreads(InterruptResilienceTest.java:532)
> 	at sun.reflect.NativeMethodAccessorImpl.invoke0(Native Method)
> 	at sun.reflect.NativeMethodAccessorImpl.invoke(NativeMethodAccessorImpl.java:60)
> 	at sun.reflect.DelegatingMethodAccessorImpl.invoke(DelegatingMethodAccessorImpl.java:37)
> 	at org.apache.derbyTesting.junit.BaseTestCase.runBare(BaseTestCase.java:110)
> 	at junit.extensions.TestDecorator.basicRun(TestDecorator.java:24)
> 	at junit.extensions.TestSetup$1.protect(TestSetup.java:21)
> 	at junit.extensions.TestSetup.run(TestSetup.java:25)
> 	at org.apache.derbyTesting.junit.BaseTestSetup.run(BaseTestSetup.java:57)
> 	at junit.extensions.TestDecorator.basicRun(TestDecorator.java:24)
> 	at junit.extensions.TestSetup$1.protect(TestSetup.java:21)
> 	at junit.extensions.TestSetup.run(TestSetup.java:25)
> 	at junit.extensions.TestDecorator.basicRun(TestDecorator.java:24)
> 	at junit.extensions.TestSetup$1.protect(TestSetup.java:21)
> 	at junit.extensions.TestSetup.run(TestSetup.java:25)
> Caused by: java.sql.SQLException: The exception 'junit.framework.AssertionFailedError:
WorkerThread 0' was thrown while evaluating an expression.
> 	at org.apache.derby.impl.jdbc.SQLExceptionFactory.getSQLException(Unknown Source)
> 	at org.apache.derby.impl.jdbc.SQLExceptionFactory40.wrapArgsForTransportAcrossDRDA(Unknown
Source)
> 	... 48 more
> Caused by: java.sql.SQLException: Java exception: 'WorkerThread 0: junit.framework.AssertionFailedError'.
> 	at org.apache.derby.impl.jdbc.SQLExceptionFactory.getSQLException(Unknown Source)
> 	at org.apache.derby.impl.jdbc.SQLExceptionFactory40.wrapArgsForTransportAcrossDRDA(Unknown
Source)
> 	at org.apache.derby.impl.jdbc.SQLExceptionFactory40.getSQLException(Unknown Source)
> 	at org.apache.derby.impl.jdbc.Util.newEmbedSQLException(Unknown Source)
> 	at org.apache.derby.impl.jdbc.Util.javaException(Unknown Source)
> 	at org.apache.derby.impl.jdbc.TransactionResourceImpl.wrapInSQLException(Unknown Source)
> 	... 45 more
> Caused by: junit.framework.AssertionFailedError: WorkerThread 0
> 	at org.apache.derbyTesting.junit.BaseTestCase.fail(BaseTestCase.java:829)
> 	at org.apache.derbyTesting.functionTests.tests.store.InterruptResilienceTest.tstRAFReadWriteMultipleThreads(InterruptResilienceTest.java:323)
> 	at org.apache.derby.exe.ac8f3600b1x0137x2aa5xa312x00001fa18e580.g0(Unknown Source)
> 	at sun.reflect.NativeMethodAccessorImpl.invoke0(Native Method)
> 	at sun.reflect.NativeMethodAccessorImpl.invoke(NativeMethodAccessorImpl.java:60)
> 	at sun.reflect.DelegatingMethodAccessorImpl.invoke(DelegatingMethodAccessorImpl.java:37)
> 	at org.apache.derby.impl.services.reflect.ReflectMethod.invoke(Unknown Source)
> 	at org.apache.derby.impl.sql.execute.CallStatementResultSet.open(Unknown Source)
> 	at org.apache.derby.impl.sql.GenericPreparedStatement.executeStmt(Unknown Source)
> 	at org.apache.derby.impl.sql.GenericPreparedStatement.execute(Unknown Source)
> 	... 41 more
> Caused by: junit.framework.AssertionFailedError
> 	at org.apache.derbyTesting.functionTests.tests.store.InterruptResilienceTest$WorkerThread.run(InterruptResilienceTest.java:430)
> FAILURES!!!
> Tests run: 14079,  Failures: 0,  Errors: 1

--
This message is automatically generated by JIRA.
If you think it was sent incorrectly, please contact your JIRA administrators
For more information on JIRA, see: http://www.atlassian.com/software/jira

Mime
View raw message