db-derby-dev mailing list archives

Site index · List index
Message view « Date » · « Thread »
Top « Date » · « Thread »
From "Myrna van Lunteren (JIRA)" <j...@apache.org>
Subject [jira] [Updated] (DERBY-5686) multiple intermittent errors in nightly tests during DriverMgrAuthenticationTest test. reason: An SQL data change is not permitted for a read-only connection, user or database.
Date Tue, 25 Sep 2012 21:46:07 GMT

     [ https://issues.apache.org/jira/browse/DERBY-5686?page=com.atlassian.jira.plugin.system.issuetabpanels:all-tabpanel
]

Myrna van Lunteren updated DERBY-5686:
--------------------------------------

    Urgency: Normal
     Labels: derby_triage10_10  (was: )
    
> multiple intermittent errors in nightly tests during DriverMgrAuthenticationTest test.
reason: An SQL data change is not permitted for a read-only connection, user or database.
	
> ----------------------------------------------------------------------------------------------------------------------------------------------------------------------------------
>
>                 Key: DERBY-5686
>                 URL: https://issues.apache.org/jira/browse/DERBY-5686
>             Project: Derby
>          Issue Type: Bug
>          Components: Test
>         Environment: Most often seen with trunk, on: Windows XP (Professional Version
2002, SP3) Intel(R) Xeon(TM) CPU 2.40 GHz 2.39 GHz, 3.87 GB of RAM. Hyperthreading on or off.
JVM version seems not to matter (seen with ibm 1.5, 1.6, 1.7, weme6.2). Machine runs 4 jvm
suites.All runs concurrently, so heavily loaded. Similar load on a windows XP on VMWare similuated
with Xeon(TM) MP CPU 3.33GHz, 3.34GHz machine does not display this behavior.
> Once a variation was seen (see DERBY-5735) on another machine (Windows 2008, 4 CPU) with
10.8.
>            Reporter: Mike Matrigali
>              Labels: derby_triage10_10
>         Attachments: DERBY-5686_1.diff, DERBY-5686_2.diff, DERBY-5686-3a-add_missing_return.diff,
DERBY-5686_3.diff, DERBY-5686_4.diff, DERBY-5686_5.diff, DERBY-5686_6.diff, DERBY-5686_7.diff
>
>
> 8 errors in nightly test runs on 4/4/2012 against trunk, windows, ibm16, build 1310147
.  Tests passed against same build, same machine on ibm15 and ibm17
> http://people.apache.org/~myrnavl/derby_test_results/main/windows/testlog/ibm16/1310147-suites.All_diff.txt
> There were 8 errors:
> 1) testNotFullAccessUsers(org.apache.derbyTesting.functionTests.tests.jdbcapi.DriverMgrAuthenticationTest)java.sql.SQLException:
An SQL data change is not permitted for a read-only connection, user or database.
> 	at org.apache.derby.client.am.SQLExceptionFactory40.getSQLException(Unknown Source)
> 	at org.apache.derby.client.am.SqlException.getSQLException(Unknown Source)
> 	at org.apache.derby.client.am.PreparedStatement.executeUpdate(Unknown Source)
> 	at org.apache.derbyTesting.junit.DatabasePropertyTestSetup.setProperties(DatabasePropertyTestSetup.java:352)
> 	at org.apache.derbyTesting.junit.DatabasePropertyTestSetup.setUp(DatabasePropertyTestSetup.java:268)
> 	at junit.extensions.TestSetup$1.protect(TestSetup.java:20)
> 	at junit.extensions.TestSetup.run(TestSetup.java:25)
> 	at org.apache.derbyTesting.junit.BaseTestSetup.run(BaseTestSetup.java:57)
> 	at junit.extensions.TestDecorator.basicRun(TestDecorator.java:24)
> 	at junit.extensions.TestSetup$1.protect(TestSetup.java:21)
> 	at junit.extensions.TestSetup.run(TestSetup.java:25)
> 	at org.apache.derbyTesting.junit.BaseTestSetup.run(BaseTestSetup.java:57)
> 	at junit.extensions.TestDecorator.basicRun(TestDecorator.java:24)
> 	at junit.extensions.TestSetup$1.protect(TestSetup.java:21)
> 	at junit.extensions.TestSetup.run(TestSetup.java:25)
> 	at junit.extensions.TestDecorator.basicRun(TestDecorator.java:24)
> 	at junit.extensions.TestSetup$1.protect(TestSetup.java:21)
> 	at junit.extensions.TestSetup.run(TestSetup.java:25)
> 	at org.apache.derbyTesting.junit.BaseTestSetup.run(BaseTestSetup.java:57)
> 	at junit.extensions.TestDecorator.basicRun(TestDecorator.java:24)
> 	at junit.extensions.TestSetup$1.protect(TestSetup.java:21)
> 	at junit.extensions.TestSetup.run(TestSetup.java:25)
> 	at junit.extensions.TestDecorator.basicRun(TestDecorator.java:24)
> 	at junit.extensions.TestSetup$1.protect(TestSetup.java:21)
> 	at junit.extensions.TestSetup.run(TestSetup.java:25)
> 	at org.apache.derbyTesting.junit.BaseTestSetup.run(BaseTestSetup.java:57)
> 	at junit.extensions.TestDecorator.basicRun(TestDecorator.java:24)
> 	at junit.extensions.TestSetup$1.protect(TestSetup.java:21)
> 	at junit.extensions.TestSetup.run(TestSetup.java:25)
> Caused by: org.apache.derby.client.am.SqlException: An SQL data change is not permitted
for a read-only connection, user or database.
> 	at org.apache.derby.client.am.Statement.completeExecute(Unknown Source)
> 	at org.apache.derby.client.net.NetStatementReply.parseEXCSQLSTTreply(Unknown Source)
> 	at org.apache.derby.client.net.NetStatementReply.readExecuteCall(Unknown Source)
> 	at org.apache.derby.client.net.StatementReply.readExecuteCall(Unknown Source)
> 	at org.apache.derby.client.net.NetStatement.readExecuteCall_(Unknown Source)
> 	at org.apache.derby.client.am.Statement.readExecuteCall(Unknown Source)
> 	at org.apache.derby.client.am.PreparedStatement.flowExecute(Unknown Source)
> 	at org.apache.derby.client.am.PreparedStatement.executeUpdateX(Unknown Source)
> 	... 47 more
> 2) testNotFullAccessUsers(org.apache.derbyTesting.functionTests.tests.jdbcapi.DriverMgrAuthenticationTest)java.sql.SQLException:
An SQL data change is not permitted for a read-only connection, user or database.
> 	at org.apache.derby.client.am.SQLExceptionFactory40.getSQLException(Unknown Source)
> 	at org.apache.derby.client.am.SqlException.getSQLException(Unknown Source)
> 	at org.apache.derby.client.am.PreparedStatement.executeUpdate(Unknown Source)
> 	at org.apache.derbyTesting.junit.DatabasePropertyTestSetup.tearDown(DatabasePropertyTestSetup.java:294)
> 	at junit.extensions.TestSetup$1.protect(TestSetup.java:22)
> 	at junit.extensions.TestSetup.run(TestSetup.java:25)
> 	at org.apache.derbyTesting.junit.BaseTestSetup.run(BaseTestSetup.java:57)
> 	at junit.extensions.TestDecorator.basicRun(TestDecorator.java:24)
> 	at junit.extensions.TestSetup$1.protect(TestSetup.java:21)
> 	at junit.extensions.TestSetup.run(TestSetup.java:25)
> 	at junit.extensions.TestDecorator.basicRun(TestDecorator.java:24)
> 	at junit.extensions.TestSetup$1.protect(TestSetup.java:21)
> 	at junit.extensions.TestSetup.run(TestSetup.java:25)
> 	at org.apache.derbyTesting.junit.BaseTestSetup.run(BaseTestSetup.java:57)
> 	at junit.extensions.TestDecorator.basicRun(TestDecorator.java:24)
> 	at junit.extensions.TestSetup$1.protect(TestSetup.java:21)
> 	at junit.extensions.TestSetup.run(TestSetup.java:25)
> 	at junit.extensions.TestDecorator.basicRun(TestDecorator.java:24)
> 	at junit.extensions.TestSetup$1.protect(TestSetup.java:21)
> 	at junit.extensions.TestSetup.run(TestSetup.java:25)
> 	at org.apache.derbyTesting.junit.BaseTestSetup.run(BaseTestSetup.java:57)
> 	at junit.extensions.TestDecorator.basicRun(TestDecorator.java:24)
> 	at junit.extensions.TestSetup$1.protect(TestSetup.java:21)
> 	at junit.extensions.TestSetup.run(TestSetup.java:25)
> Caused by: org.apache.derby.client.am.SqlException: An SQL data change is not permitted
for a read-only connection, user or database.
> 	at org.apache.derby.client.am.Statement.completeExecute(Unknown Source)
> 	at org.apache.derby.client.net.NetStatementReply.parseEXCSQLSTTreply(Unknown Source)
> 	at org.apache.derby.client.net.NetStatementReply.readExecuteCall(Unknown Source)
> 	at org.apache.derby.client.net.StatementReply.readExecuteCall(Unknown Source)
> 	at org.apache.derby.client.net.NetStatement.readExecuteCall_(Unknown Source)
> 	at org.apache.derby.client.am.Statement.readExecuteCall(Unknown Source)
> 	at org.apache.derby.client.am.PreparedStatement.flowExecute(Unknown Source)
> 	at org.apache.derby.client.am.PreparedStatement.executeUpdateX(Unknown Source)
> 	... 41 more
> 3) testChangePasswordAndDatabasePropertiesOnly(org.apache.derbyTesting.functionTests.tests.jdbcapi.DriverMgrAuthenticationTest)java.sql.SQLException:
An SQL data change is not permitted for a read-only connection, user or database.
> 	at org.apache.derby.client.am.SQLExceptionFactory40.getSQLException(Unknown Source)
> 	at org.apache.derby.client.am.SqlException.getSQLException(Unknown Source)
> 	at org.apache.derby.client.am.PreparedStatement.executeUpdate(Unknown Source)
> 	at org.apache.derbyTesting.junit.DatabasePropertyTestSetup.setProperties(DatabasePropertyTestSetup.java:352)
> 	at org.apache.derbyTesting.junit.DatabasePropertyTestSetup.setUp(DatabasePropertyTestSetup.java:268)
> 	at junit.extensions.TestSetup$1.protect(TestSetup.java:20)
> 	at junit.extensions.TestSetup.run(TestSetup.java:25)
> 	at org.apache.derbyTesting.junit.BaseTestSetup.run(BaseTestSetup.java:57)
> 	at junit.extensions.TestDecorator.basicRun(TestDecorator.java:24)
> 	at junit.extensions.TestSetup$1.protect(TestSetup.java:21)
> 	at junit.extensions.TestSetup.run(TestSetup.java:25)
> 	at org.apache.derbyTesting.junit.BaseTestSetup.run(BaseTestSetup.java:57)
> 	at junit.extensions.TestDecorator.basicRun(TestDecorator.java:24)
> 	at junit.extensions.TestSetup$1.protect(TestSetup.java:21)
> 	at junit.extensions.TestSetup.run(TestSetup.java:25)
> 	at junit.extensions.TestDecorator.basicRun(TestDecorator.java:24)
> 	at junit.extensions.TestSetup$1.protect(TestSetup.java:21)
> 	at junit.extensions.TestSetup.run(TestSetup.java:25)
> 	at org.apache.derbyTesting.junit.BaseTestSetup.run(BaseTestSetup.java:57)
> 	at junit.extensions.TestDecorator.basicRun(TestDecorator.java:24)
> 	at junit.extensions.TestSetup$1.protect(TestSetup.java:21)
> 	at junit.extensions.TestSetup.run(TestSetup.java:25)
> 	at junit.extensions.TestDecorator.basicRun(TestDecorator.java:24)
> 	at junit.extensions.TestSetup$1.protect(TestSetup.java:21)
> 	at junit.extensions.TestSetup.run(TestSetup.java:25)
> 	at org.apache.derbyTesting.junit.BaseTestSetup.run(BaseTestSetup.java:57)
> 	at junit.extensions.TestDecorator.basicRun(TestDecorator.java:24)
> 	at junit.extensions.TestSetup$1.protect(TestSetup.java:21)
> 	at junit.extensions.TestSetup.run(TestSetup.java:25)
> Caused by: org.apache.derby.client.am.SqlException: An SQL data change is not permitted
for a read-only connection, user or database.
> 	at org.apache.derby.client.am.Statement.completeExecute(Unknown Source)
> 	at org.apache.derby.client.net.NetStatementReply.parseEXCSQLSTTreply(Unknown Source)
> 	at org.apache.derby.client.net.NetStatementReply.readExecuteCall(Unknown Source)
> 	at org.apache.derby.client.net.StatementReply.readExecuteCall(Unknown Source)
> 	at org.apache.derby.client.net.NetStatement.readExecuteCall_(Unknown Source)
> 	at org.apache.derby.client.am.Statement.readExecuteCall(Unknown Source)
> 	at org.apache.derby.client.am.PreparedStatement.flowExecute(Unknown Source)
> 	at org.apache.derby.client.am.PreparedStatement.executeUpdateX(Unknown Source)
> 	... 47 more
> 4) testChangePasswordAndDatabasePropertiesOnly(org.apache.derbyTesting.functionTests.tests.jdbcapi.DriverMgrAuthenticationTest)java.sql.SQLException:
An SQL data change is not permitted for a read-only connection, user or database.
> 	at org.apache.derby.client.am.SQLExceptionFactory40.getSQLException(Unknown Source)
> 	at org.apache.derby.client.am.SqlException.getSQLException(Unknown Source)
> 	at org.apache.derby.client.am.PreparedStatement.executeUpdate(Unknown Source)
> 	at org.apache.derbyTesting.junit.DatabasePropertyTestSetup.tearDown(DatabasePropertyTestSetup.java:294)
> 	at junit.extensions.TestSetup$1.protect(TestSetup.java:22)
> 	at junit.extensions.TestSetup.run(TestSetup.java:25)
> 	at org.apache.derbyTesting.junit.BaseTestSetup.run(BaseTestSetup.java:57)
> 	at junit.extensions.TestDecorator.basicRun(TestDecorator.java:24)
> 	at junit.extensions.TestSetup$1.protect(TestSetup.java:21)
> 	at junit.extensions.TestSetup.run(TestSetup.java:25)
> 	at junit.extensions.TestDecorator.basicRun(TestDecorator.java:24)
> 	at junit.extensions.TestSetup$1.protect(TestSetup.java:21)
> 	at junit.extensions.TestSetup.run(TestSetup.java:25)
> 	at org.apache.derbyTesting.junit.BaseTestSetup.run(BaseTestSetup.java:57)
> 	at junit.extensions.TestDecorator.basicRun(TestDecorator.java:24)
> 	at junit.extensions.TestSetup$1.protect(TestSetup.java:21)
> 	at junit.extensions.TestSetup.run(TestSetup.java:25)
> 	at junit.extensions.TestDecorator.basicRun(TestDecorator.java:24)
> 	at junit.extensions.TestSetup$1.protect(TestSetup.java:21)
> 	at junit.extensions.TestSetup.run(TestSetup.java:25)
> 	at org.apache.derbyTesting.junit.BaseTestSetup.run(BaseTestSetup.java:57)
> 	at junit.extensions.TestDecorator.basicRun(TestDecorator.java:24)
> 	at junit.extensions.TestSetup$1.protect(TestSetup.java:21)
> 	at junit.extensions.TestSetup.run(TestSetup.java:25)
> Caused by: org.apache.derby.client.am.SqlException: An SQL data change is not permitted
for a read-only connection, user or database.
> 	at org.apache.derby.client.am.Statement.completeExecute(Unknown Source)
> 	at org.apache.derby.client.net.NetStatementReply.parseEXCSQLSTTreply(Unknown Source)
> 	at org.apache.derby.client.net.NetStatementReply.readExecuteCall(Unknown Source)
> 	at org.apache.derby.client.net.StatementReply.readExecuteCall(Unknown Source)
> 	at org.apache.derby.client.net.NetStatement.readExecuteCall_(Unknown Source)
> 	at org.apache.derby.client.am.Statement.readExecuteCall(Unknown Source)
> 	at org.apache.derby.client.am.PreparedStatement.flowExecute(Unknown Source)
> 	at org.apache.derby.client.am.PreparedStatement.executeUpdateX(Unknown Source)
> 	... 41 more
> 5) testGreekCharacters(org.apache.derbyTesting.functionTests.tests.jdbcapi.DriverMgrAuthenticationTest)java.sql.SQLException:
An SQL data change is not permitted for a read-only connection, user or database.
> 	at org.apache.derby.client.am.SQLExceptionFactory40.getSQLException(Unknown Source)
> 	at org.apache.derby.client.am.SqlException.getSQLException(Unknown Source)
> 	at org.apache.derby.client.am.PreparedStatement.executeUpdate(Unknown Source)
> 	at org.apache.derbyTesting.junit.DatabasePropertyTestSetup.setProperties(DatabasePropertyTestSetup.java:352)
> 	at org.apache.derbyTesting.junit.DatabasePropertyTestSetup.setUp(DatabasePropertyTestSetup.java:268)
> 	at junit.extensions.TestSetup$1.protect(TestSetup.java:20)
> 	at junit.extensions.TestSetup.run(TestSetup.java:25)
> 	at org.apache.derbyTesting.junit.BaseTestSetup.run(BaseTestSetup.java:57)
> 	at junit.extensions.TestDecorator.basicRun(TestDecorator.java:24)
> 	at junit.extensions.TestSetup$1.protect(TestSetup.java:21)
> 	at junit.extensions.TestSetup.run(TestSetup.java:25)
> 	at org.apache.derbyTesting.junit.BaseTestSetup.run(BaseTestSetup.java:57)
> 	at junit.extensions.TestDecorator.basicRun(TestDecorator.java:24)
> 	at junit.extensions.TestSetup$1.protect(TestSetup.java:21)
> 	at junit.extensions.TestSetup.run(TestSetup.java:25)
> 	at junit.extensions.TestDecorator.basicRun(TestDecorator.java:24)
> 	at junit.extensions.TestSetup$1.protect(TestSetup.java:21)
> 	at junit.extensions.TestSetup.run(TestSetup.java:25)
> 	at org.apache.derbyTesting.junit.BaseTestSetup.run(BaseTestSetup.java:57)
> 	at junit.extensions.TestDecorator.basicRun(TestDecorator.java:24)
> 	at junit.extensions.TestSetup$1.protect(TestSetup.java:21)
> 	at junit.extensions.TestSetup.run(TestSetup.java:25)
> 	at junit.extensions.TestDecorator.basicRun(TestDecorator.java:24)
> 	at junit.extensions.TestSetup$1.protect(TestSetup.java:21)
> 	at junit.extensions.TestSetup.run(TestSetup.java:25)
> 	at org.apache.derbyTesting.junit.BaseTestSetup.run(BaseTestSetup.java:57)
> 	at junit.extensions.TestDecorator.basicRun(TestDecorator.java:24)
> 	at junit.extensions.TestSetup$1.protect(TestSetup.java:21)
> 	at junit.extensions.TestSetup.run(TestSetup.java:25)
> Caused by: org.apache.derby.client.am.SqlException: An SQL data change is not permitted
for a read-only connection, user or database.
> 	at org.apache.derby.client.am.Statement.completeExecute(Unknown Source)
> 	at org.apache.derby.client.net.NetStatementReply.parseEXCSQLSTTreply(Unknown Source)
> 	at org.apache.derby.client.net.NetStatementReply.readExecuteCall(Unknown Source)
> 	at org.apache.derby.client.net.StatementReply.readExecuteCall(Unknown Source)
> 	at org.apache.derby.client.net.NetStatement.readExecuteCall_(Unknown Source)
> 	at org.apache.derby.client.am.Statement.readExecuteCall(Unknown Source)
> 	at org.apache.derby.client.am.PreparedStatement.flowExecute(Unknown Source)
> 	at org.apache.derby.client.am.PreparedStatement.executeUpdateX(Unknown Source)
> 	... 47 more
> 6) testGreekCharacters(org.apache.derbyTesting.functionTests.tests.jdbcapi.DriverMgrAuthenticationTest)java.sql.SQLException:
An SQL data change is not permitted for a read-only connection, user or database.
> 	at org.apache.derby.client.am.SQLExceptionFactory40.getSQLException(Unknown Source)
> 	at org.apache.derby.client.am.SqlException.getSQLException(Unknown Source)
> 	at org.apache.derby.client.am.PreparedStatement.executeUpdate(Unknown Source)
> 	at org.apache.derbyTesting.junit.DatabasePropertyTestSetup.tearDown(DatabasePropertyTestSetup.java:294)
> 	at junit.extensions.TestSetup$1.protect(TestSetup.java:22)
> 	at junit.extensions.TestSetup.run(TestSetup.java:25)
> 	at org.apache.derbyTesting.junit.BaseTestSetup.run(BaseTestSetup.java:57)
> 	at junit.extensions.TestDecorator.basicRun(TestDecorator.java:24)
> 	at junit.extensions.TestSetup$1.protect(TestSetup.java:21)
> 	at junit.extensions.TestSetup.run(TestSetup.java:25)
> 	at junit.extensions.TestDecorator.basicRun(TestDecorator.java:24)
> 	at junit.extensions.TestSetup$1.protect(TestSetup.java:21)
> 	at junit.extensions.TestSetup.run(TestSetup.java:25)
> 	at org.apache.derbyTesting.junit.BaseTestSetup.run(BaseTestSetup.java:57)
> 	at junit.extensions.TestDecorator.basicRun(TestDecorator.java:24)
> 	at junit.extensions.TestSetup$1.protect(TestSetup.java:21)
> 	at junit.extensions.TestSetup.run(TestSetup.java:25)
> 	at junit.extensions.TestDecorator.basicRun(TestDecorator.java:24)
> 	at junit.extensions.TestSetup$1.protect(TestSetup.java:21)
> 	at junit.extensions.TestSetup.run(TestSetup.java:25)
> 	at org.apache.derbyTesting.junit.BaseTestSetup.run(BaseTestSetup.java:57)
> 	at junit.extensions.TestDecorator.basicRun(TestDecorator.java:24)
> 	at junit.extensions.TestSetup$1.protect(TestSetup.java:21)
> 	at junit.extensions.TestSetup.run(TestSetup.java:25)
> Caused by: org.apache.derby.client.am.SqlException: An SQL data change is not permitted
for a read-only connection, user or database.
> 	at org.apache.derby.client.am.Statement.completeExecute(Unknown Source)
> 	at org.apache.derby.client.net.NetStatementReply.parseEXCSQLSTTreply(Unknown Source)
> 	at org.apache.derby.client.net.NetStatementReply.readExecuteCall(Unknown Source)
> 	at org.apache.derby.client.net.StatementReply.readExecuteCall(Unknown Source)
> 	at org.apache.derby.client.net.NetStatement.readExecuteCall_(Unknown Source)
> 	at org.apache.derby.client.am.Statement.readExecuteCall(Unknown Source)
> 	at org.apache.derby.client.am.PreparedStatement.flowExecute(Unknown Source)
> 	at org.apache.derby.client.am.PreparedStatement.executeUpdateX(Unknown Source)
> 	... 41 more
> 7) testSystemShutdown(org.apache.derbyTesting.functionTests.tests.jdbcapi.DriverMgrAuthenticationTest)java.sql.SQLException:
An SQL data change is not permitted for a read-only connection, user or database.
> 	at org.apache.derby.client.am.SQLExceptionFactory40.getSQLException(Unknown Source)
> 	at org.apache.derby.client.am.SqlException.getSQLException(Unknown Source)
> 	at org.apache.derby.client.am.PreparedStatement.executeUpdate(Unknown Source)
> 	at org.apache.derbyTesting.junit.DatabasePropertyTestSetup.setProperties(DatabasePropertyTestSetup.java:352)
> 	at org.apache.derbyTesting.junit.DatabasePropertyTestSetup.setUp(DatabasePropertyTestSetup.java:268)
> 	at junit.extensions.TestSetup$1.protect(TestSetup.java:20)
> 	at junit.extensions.TestSetup.run(TestSetup.java:25)
> 	at org.apache.derbyTesting.junit.BaseTestSetup.run(BaseTestSetup.java:57)
> 	at junit.extensions.TestDecorator.basicRun(TestDecorator.java:24)
> 	at junit.extensions.TestSetup$1.protect(TestSetup.java:21)
> 	at junit.extensions.TestSetup.run(TestSetup.java:25)
> 	at org.apache.derbyTesting.junit.BaseTestSetup.run(BaseTestSetup.java:57)
> 	at junit.extensions.TestDecorator.basicRun(TestDecorator.java:24)
> 	at junit.extensions.TestSetup$1.protect(TestSetup.java:21)
> 	at junit.extensions.TestSetup.run(TestSetup.java:25)
> 	at junit.extensions.TestDecorator.basicRun(TestDecorator.java:24)
> 	at junit.extensions.TestSetup$1.protect(TestSetup.java:21)
> 	at junit.extensions.TestSetup.run(TestSetup.java:25)
> 	at org.apache.derbyTesting.junit.BaseTestSetup.run(BaseTestSetup.java:57)
> 	at junit.extensions.TestDecorator.basicRun(TestDecorator.java:24)
> 	at junit.extensions.TestSetup$1.protect(TestSetup.java:21)
> 	at junit.extensions.TestSetup.run(TestSetup.java:25)
> 	at junit.extensions.TestDecorator.basicRun(TestDecorator.java:24)
> 	at junit.extensions.TestSetup$1.protect(TestSetup.java:21)
> 	at junit.extensions.TestSetup.run(TestSetup.java:25)
> 	at org.apache.derbyTesting.junit.BaseTestSetup.run(BaseTestSetup.java:57)
> 	at junit.extensions.TestDecorator.basicRun(TestDecorator.java:24)
> 	at junit.extensions.TestSetup$1.protect(TestSetup.java:21)
> 	at junit.extensions.TestSetup.run(TestSetup.java:25)
> Caused by: org.apache.derby.client.am.SqlException: An SQL data change is not permitted
for a read-only connection, user or database.
> 	at org.apache.derby.client.am.Statement.completeExecute(Unknown Source)
> 	at org.apache.derby.client.net.NetStatementReply.parseEXCSQLSTTreply(Unknown Source)
> 	at org.apache.derby.client.net.NetStatementReply.readExecuteCall(Unknown Source)
> 	at org.apache.derby.client.net.StatementReply.readExecuteCall(Unknown Source)
> 	at org.apache.derby.client.net.NetStatement.readExecuteCall_(Unknown Source)
> 	at org.apache.derby.client.am.Statement.readExecuteCall(Unknown Source)
> 	at org.apache.derby.client.am.PreparedStatement.flowExecute(Unknown Source)
> 	at org.apache.derby.client.am.PreparedStatement.executeUpdateX(Unknown Source)
> 	... 47 more
> 8) testSystemShutdown(org.apache.derbyTesting.functionTests.tests.jdbcapi.DriverMgrAuthenticationTest)java.sql.SQLException:
An SQL data change is not permitted for a read-only connection, user or database.
> 	at org.apache.derby.client.am.SQLExceptionFactory40.getSQLException(Unknown Source)
> 	at org.apache.derby.client.am.SqlException.getSQLException(Unknown Source)
> 	at org.apache.derby.client.am.PreparedStatement.executeUpdate(Unknown Source)
> 	at org.apache.derbyTesting.junit.DatabasePropertyTestSetup.tearDown(DatabasePropertyTestSetup.java:294)
> 	at junit.extensions.TestSetup$1.protect(TestSetup.java:22)
> 	at junit.extensions.TestSetup.run(TestSetup.java:25)
> 	at org.apache.derbyTesting.junit.BaseTestSetup.run(BaseTestSetup.java:57)
> 	at junit.extensions.TestDecorator.basicRun(TestDecorator.java:24)
> 	at junit.extensions.TestSetup$1.protect(TestSetup.java:21)
> 	at junit.extensions.TestSetup.run(TestSetup.java:25)
> 	at junit.extensions.TestDecorator.basicRun(TestDecorator.java:24)
> 	at junit.extensions.TestSetup$1.protect(TestSetup.java:21)
> 	at junit.extensions.TestSetup.run(TestSetup.java:25)
> 	at org.apache.derbyTesting.junit.BaseTestSetup.run(BaseTestSetup.java:57)
> 	at junit.extensions.TestDecorator.basicRun(TestDecorator.java:24)
> 	at junit.extensions.TestSetup$1.protect(TestSetup.java:21)
> 	at junit.extensions.TestSetup.run(TestSetup.java:25)
> 	at junit.extensions.TestDecorator.basicRun(TestDecorator.java:24)
> 	at junit.extensions.TestSetup$1.protect(TestSetup.java:21)
> 	at junit.extensions.TestSetup.run(TestSetup.java:25)
> 	at org.apache.derbyTesting.junit.BaseTestSetup.run(BaseTestSetup.java:57)
> 	at junit.extensions.TestDecorator.basicRun(TestDecorator.java:24)
> 	at junit.extensions.TestSetup$1.protect(TestSetup.java:21)
> 	at junit.extensions.TestSetup.run(TestSetup.java:25)
> Caused by: org.apache.derby.client.am.SqlException: An SQL data change is not permitted
for a read-only connection, user or database.
> 	at org.apache.derby.client.am.Statement.completeExecute(Unknown Source)
> 	at org.apache.derby.client.net.NetStatementReply.parseEXCSQLSTTreply(Unknown Source)
> 	at org.apache.derby.client.net.NetStatementReply.readExecuteCall(Unknown Source)
> 	at org.apache.derby.client.net.StatementReply.readExecuteCall(Unknown Source)
> 	at org.apache.derby.client.net.NetStatement.readExecuteCall_(Unknown Source)
> 	at org.apache.derby.client.am.Statement.readExecuteCall(Unknown Source)
> 	at org.apache.derby.client.am.PreparedStatement.flowExecute(Unknown Source)
> 	at org.apache.derby.client.am.PreparedStatement.executeUpdateX(Unknown Source)
> 	... 41 more
> FAILURES!!!
> Tests run: 15467,  Failures: 0,  Errors: 8

--
This message is automatically generated by JIRA.
If you think it was sent incorrectly, please contact your JIRA administrators
For more information on JIRA, see: http://www.atlassian.com/software/jira

Mime
View raw message