db-derby-dev mailing list archives

Site index · List index
Message view « Date » · « Thread »
Top « Date » · « Thread »
From "Mike Matrigali (Commented) (JIRA)" <j...@apache.org>
Subject [jira] [Commented] (DERBY-5686) multiple intermittent errors in nightly tests during DriverMgrAuthenticationTest test. reason: An SQL data change is not permitted for a read-only connection, user or database.
Date Fri, 06 Apr 2012 19:55:23 GMT

    [ https://issues.apache.org/jira/browse/DERBY-5686?page=com.atlassian.jira.plugin.system.issuetabpanels:comment-tabpanel&focusedCommentId=13248659#comment-13248659 ] 

Mike Matrigali commented on DERBY-5686:
---------------------------------------

I think this is the same issue, though shows different tests failing and only 4 errors.  failed windows, ibm16, build 1308644, 4/2/2012
http://people.apache.org/~myrnavl/derby_test_results/main/windows/testlog/ibm16/1308644-suites.All_diff.txt

1) testSystemShutdown(org.apache.derbyTesting.functionTests.tests.jdbcapi.DriverMgrAuthenticationTest)java.sql.SQLException: An SQL data change is not permitted for a read-only connection, user or database.
	at org.apache.derby.impl.jdbc.SQLExceptionFactory40.getSQLException(Unknown Source)
	at org.apache.derby.impl.jdbc.Util.generateCsSQLException(Unknown Source)
	at org.apache.derby.impl.jdbc.TransactionResourceImpl.wrapInSQLException(Unknown Source)
	at org.apache.derby.impl.jdbc.TransactionResourceImpl.handleException(Unknown Source)
	at org.apache.derby.impl.jdbc.EmbedConnection.handleException(Unknown Source)
	at org.apache.derby.impl.jdbc.ConnectionChild.handleException(Unknown Source)
	at org.apache.derby.impl.jdbc.EmbedStatement.executeStatement(Unknown Source)
	at org.apache.derby.impl.jdbc.EmbedPreparedStatement.executeStatement(Unknown Source)
	at org.apache.derby.impl.jdbc.EmbedCallableStatement.executeStatement(Unknown Source)
	at org.apache.derby.impl.jdbc.EmbedPreparedStatement.execute(Unknown Source)
	at org.apache.derbyTesting.functionTests.tests.jdbcapi.AuthenticationTest.setDatabaseProperty(AuthenticationTest.java:1297)
	at org.apache.derbyTesting.functionTests.tests.jdbcapi.AuthenticationTest.setUp(AuthenticationTest.java:192)
	at org.apache.derbyTesting.junit.BaseTestCase.runBare(BaseTestCase.java:113)
	at junit.extensions.TestDecorator.basicRun(TestDecorator.java:24)
	at junit.extensions.TestSetup$1.protect(TestSetup.java:21)
	at junit.extensions.TestSetup.run(TestSetup.java:25)
	at org.apache.derbyTesting.junit.BaseTestSetup.run(BaseTestSetup.java:57)
	at junit.extensions.TestDecorator.basicRun(TestDecorator.java:24)
	at junit.extensions.TestSetup$1.protect(TestSetup.java:21)
	at junit.extensions.TestSetup.run(TestSetup.java:25)
	at junit.extensions.TestDecorator.basicRun(TestDecorator.java:24)
	at junit.extensions.TestSetup$1.protect(TestSetup.java:21)
	at junit.extensions.TestSetup.run(TestSetup.java:25)
	at org.apache.derbyTesting.junit.BaseTestSetup.run(BaseTestSetup.java:57)
	at junit.extensions.TestDecorator.basicRun(TestDecorator.java:24)
	at junit.extensions.TestSetup$1.protect(TestSetup.java:21)
	at junit.extensions.TestSetup.run(TestSetup.java:25)
	at org.apache.derbyTesting.junit.BaseTestSetup.run(BaseTestSetup.java:57)
	at junit.extensions.TestDecorator.basicRun(TestDecorator.java:24)
	at junit.extensions.TestSetup$1.protect(TestSetup.java:21)
	at junit.extensions.TestSetup.run(TestSetup.java:25)
	at junit.extensions.TestDecorator.basicRun(TestDecorator.java:24)
	at junit.extensions.TestSetup$1.protect(TestSetup.java:21)
	at junit.extensions.TestSetup.run(TestSetup.java:25)
	at org.apache.derbyTesting.junit.BaseTestSetup.run(BaseTestSetup.java:57)
	at junit.extensions.TestDecorator.basicRun(TestDecorator.java:24)
	at junit.extensions.TestSetup$1.protect(TestSetup.java:21)
	at junit.extensions.TestSetup.run(TestSetup.java:25)
Caused by: java.sql.SQLException: An SQL data change is not permitted for a read-only connection, user or database.
	at org.apache.derby.impl.jdbc.SQLExceptionFactory.getSQLException(Unknown Source)
	at org.apache.derby.impl.jdbc.SQLExceptionFactory40.wrapArgsForTransportAcrossDRDA(Unknown Source)
	... 63 more
Caused by: ERROR 25502: An SQL data change is not permitted for a read-only connection, user or database.
	at org.apache.derby.iapi.error.StandardException.newException(Unknown Source)
	at org.apache.derby.impl.sql.conn.GenericAuthorizer.authorize(Unknown Source)
	at org.apache.derby.exe.ac0249415ax0136x76efxea75xffff977260360.g0(Unknown Source)
	at sun.reflect.NativeMethodAccessorImpl.invoke0(Native Method)
	at sun.reflect.NativeMethodAccessorImpl.invoke(NativeMethodAccessorImpl.java:60)
	at sun.reflect.DelegatingMethodAccessorImpl.invoke(DelegatingMethodAccessorImpl.java:37)
	at org.apache.derby.impl.services.reflect.ReflectMethod.invoke(Unknown Source)
	at org.apache.derby.impl.sql.execute.CallStatementResultSet.open(Unknown Source)
	at org.apache.derby.impl.sql.GenericPreparedStatement.executeStmt(Unknown Source)
	at org.apache.derby.impl.sql.GenericPreparedStatement.execute(Unknown Source)
	... 57 more
2) testSystemShutdown(org.apache.derbyTesting.functionTests.tests.jdbcapi.DriverMgrAuthenticationTest)java.sql.SQLException: An SQL data change is not permitted for a read-only connection, user or database.
	at org.apache.derby.impl.jdbc.SQLExceptionFactory40.getSQLException(Unknown Source)
	at org.apache.derby.impl.jdbc.Util.generateCsSQLException(Unknown Source)
	at org.apache.derby.impl.jdbc.TransactionResourceImpl.wrapInSQLException(Unknown Source)
	at org.apache.derby.impl.jdbc.TransactionResourceImpl.handleException(Unknown Source)
	at org.apache.derby.impl.jdbc.EmbedConnection.handleException(Unknown Source)
	at org.apache.derby.impl.jdbc.ConnectionChild.handleException(Unknown Source)
	at org.apache.derby.impl.jdbc.EmbedStatement.executeStatement(Unknown Source)
	at org.apache.derby.impl.jdbc.EmbedPreparedStatement.executeStatement(Unknown Source)
	at org.apache.derby.impl.jdbc.EmbedCallableStatement.executeStatement(Unknown Source)
	at org.apache.derby.impl.jdbc.EmbedPreparedStatement.executeUpdate(Unknown Source)
	at org.apache.derbyTesting.junit.DatabasePropertyTestSetup.tearDown(DatabasePropertyTestSetup.java:294)
	at junit.extensions.TestSetup$1.protect(TestSetup.java:22)
	at junit.extensions.TestSetup.run(TestSetup.java:25)
	at org.apache.derbyTesting.junit.BaseTestSetup.run(BaseTestSetup.java:57)
	at junit.extensions.TestDecorator.basicRun(TestDecorator.java:24)
	at junit.extensions.TestSetup$1.protect(TestSetup.java:21)
	at junit.extensions.TestSetup.run(TestSetup.java:25)
	at junit.extensions.TestDecorator.basicRun(TestDecorator.java:24)
	at junit.extensions.TestSetup$1.protect(TestSetup.java:21)
	at junit.extensions.TestSetup.run(TestSetup.java:25)
	at org.apache.derbyTesting.junit.BaseTestSetup.run(BaseTestSetup.java:57)
	at junit.extensions.TestDecorator.basicRun(TestDecorator.java:24)
	at junit.extensions.TestSetup$1.protect(TestSetup.java:21)
	at junit.extensions.TestSetup.run(TestSetup.java:25)
	at org.apache.derbyTesting.junit.BaseTestSetup.run(BaseTestSetup.java:57)
	at junit.extensions.TestDecorator.basicRun(TestDecorator.java:24)
	at junit.extensions.TestSetup$1.protect(TestSetup.java:21)
	at junit.extensions.TestSetup.run(TestSetup.java:25)
	at junit.extensions.TestDecorator.basicRun(TestDecorator.java:24)
	at junit.extensions.TestSetup$1.protect(TestSetup.java:21)
	at junit.extensions.TestSetup.run(TestSetup.java:25)
	at org.apache.derbyTesting.junit.BaseTestSetup.run(BaseTestSetup.java:57)
	at junit.extensions.TestDecorator.basicRun(TestDecorator.java:24)
	at junit.extensions.TestSetup$1.protect(TestSetup.java:21)
	at junit.extensions.TestSetup.run(TestSetup.java:25)
Caused by: java.sql.SQLException: An SQL data change is not permitted for a read-only connection, user or database.
	at <unknown class>.<unknown method>(Unknown Source)
	... 55 more
Caused by: ERROR 25502: An SQL data change is not permitted for a read-only connection, user or database.
	at org.apache.derby.iapi.error.StandardException.newException(Unknown Source)
	at org.apache.derby.impl.sql.conn.GenericAuthorizer.authorize(Unknown Source)
	at org.apache.derby.exe.acfb4d815dx0136x76efxea75xffff977260360.g0(Unknown Source)
	at sun.reflect.NativeMethodAccessorImpl.invoke0(Native Method)
	at sun.reflect.NativeMethodAccessorImpl.invoke(NativeMethodAccessorImpl.java:60)
	at sun.reflect.DelegatingMethodAccessorImpl.invoke(DelegatingMethodAccessorImpl.java:37)
	at org.apache.derby.impl.services.reflect.ReflectMethod.invoke(Unknown Source)
	at org.apache.derby.impl.sql.execute.CallStatementResultSet.open(Unknown Source)
	at org.apache.derby.impl.sql.GenericPreparedStatement.executeStmt(Unknown Source)
	at org.apache.derby.impl.sql.GenericPreparedStatement.execute(Unknown Source)
	... 49 more
3) testSystemShutdown(org.apache.derbyTesting.functionTests.tests.jdbcapi.DriverMgrAuthenticationTest)java.sql.SQLNonTransientConnectionException: Connection authentication failure occurred.  Reason: Invalid authentication..
	at org.apache.derby.impl.jdbc.SQLExceptionFactory40.getSQLException(Unknown Source)
	at org.apache.derby.impl.jdbc.Util.newEmbedSQLException(Unknown Source)
	at org.apache.derby.impl.jdbc.Util.newEmbedSQLException(Unknown Source)
	at org.apache.derby.impl.jdbc.Util.generateCsSQLException(Unknown Source)
	at org.apache.derby.impl.jdbc.EmbedConnection.newSQLException(Unknown Source)
	at org.apache.derby.impl.jdbc.EmbedConnection.checkUserCredentials(Unknown Source)
	at org.apache.derby.impl.jdbc.EmbedConnection.<init>(Unknown Source)
	at org.apache.derby.jdbc.Driver40.getNewEmbedConnection(Unknown Source)
	at org.apache.derby.jdbc.InternalDriver.connect(Unknown Source)
	at org.apache.derby.jdbc.AutoloadedDriver.connect(Unknown Source)
	at java.sql.DriverManager.getConnection(DriverManager.java:379)
	at java.sql.DriverManager.getConnection(DriverManager.java:354)
	at org.apache.derbyTesting.junit.DriverManagerConnector.openConnection(DriverManagerConnector.java:100)
	at org.apache.derbyTesting.junit.DriverManagerConnector.openConnection(DriverManagerConnector.java:67)
	at org.apache.derbyTesting.junit.DriverManagerConnector.openConnection(DriverManagerConnector.java:43)
	at org.apache.derbyTesting.junit.TestConfiguration.openDefaultConnection(TestConfiguration.java:1633)
	at org.apache.derbyTesting.junit.BaseJDBCTestSetup.getConnection(BaseJDBCTestSetup.java:72)
	at org.apache.derbyTesting.junit.DatabasePropertyTestSetup.tearDown(DatabasePropertyTestSetup.java:280)
	at junit.extensions.TestSetup$1.protect(TestSetup.java:22)
	at junit.extensions.TestSetup.run(TestSetup.java:25)
	at org.apache.derbyTesting.junit.BaseTestSetup.run(BaseTestSetup.java:57)
	at junit.extensions.TestDecorator.basicRun(TestDecorator.java:24)
	at junit.extensions.TestSetup$1.protect(TestSetup.java:21)
	at junit.extensions.TestSetup.run(TestSetup.java:25)
	at org.apache.derbyTesting.junit.BaseTestSetup.run(BaseTestSetup.java:57)
	at junit.extensions.TestDecorator.basicRun(TestDecorator.java:24)
	at junit.extensions.TestSetup$1.protect(TestSetup.java:21)
	at junit.extensions.TestSetup.run(TestSetup.java:25)
	at junit.extensions.TestDecorator.basicRun(TestDecorator.java:24)
	at junit.extensions.TestSetup$1.protect(TestSetup.java:21)
	at junit.extensions.TestSetup.run(TestSetup.java:25)
	at org.apache.derbyTesting.junit.BaseTestSetup.run(BaseTestSetup.java:57)
	at junit.extensions.TestDecorator.basicRun(TestDecorator.java:24)
	at junit.extensions.TestSetup$1.protect(TestSetup.java:21)
	at junit.extensions.TestSetup.run(TestSetup.java:25)
Caused by: java.sql.SQLException: Connection authentication failure occurred.  Reason: Invalid authentication..
	at org.apache.derby.impl.jdbc.SQLExceptionFactory.getSQLException(Unknown Source)
	at org.apache.derby.impl.jdbc.SQLExceptionFactory40.wrapArgsForTransportAcrossDRDA(Unknown Source)
	... 53 more
4) testSystemShutdown(org.apache.derbyTesting.functionTests.tests.jdbcapi.DriverMgrAuthenticationTest)java.sql.SQLNonTransientConnectionException: Connection authentication failure occurred.  Reason: Invalid authentication..
	at org.apache.derby.impl.jdbc.SQLExceptionFactory40.getSQLException(Unknown Source)
	at org.apache.derby.impl.jdbc.Util.newEmbedSQLException(Unknown Source)
	at org.apache.derby.impl.jdbc.Util.newEmbedSQLException(Unknown Source)
	at org.apache.derby.impl.jdbc.Util.generateCsSQLException(Unknown Source)
	at org.apache.derby.impl.jdbc.EmbedConnection.newSQLException(Unknown Source)
	at org.apache.derby.impl.jdbc.EmbedConnection.checkUserCredentials(Unknown Source)
	at org.apache.derby.impl.jdbc.EmbedConnection.<init>(Unknown Source)
	at org.apache.derby.jdbc.Driver40.getNewEmbedConnection(Unknown Source)
	at org.apache.derby.jdbc.InternalDriver.connect(Unknown Source)
	at org.apache.derby.jdbc.AutoloadedDriver.connect(Unknown Source)
	at java.sql.DriverManager.getConnection(DriverManager.java:379)
	at java.sql.DriverManager.getConnection(DriverManager.java:354)
	at org.apache.derbyTesting.junit.DriverManagerConnector.openConnection(DriverManagerConnector.java:100)
	at org.apache.derbyTesting.junit.DriverManagerConnector.openConnection(DriverManagerConnector.java:67)
	at org.apache.derbyTesting.junit.DriverManagerConnector.openConnection(DriverManagerConnector.java:43)
	at org.apache.derbyTesting.junit.TestConfiguration.openDefaultConnection(TestConfiguration.java:1633)
	at org.apache.derbyTesting.junit.BaseJDBCTestSetup.getConnection(BaseJDBCTestSetup.java:72)
	at org.apache.derbyTesting.junit.DatabasePropertyTestSetup.tearDown(DatabasePropertyTestSetup.java:280)
	at junit.extensions.TestSetup$1.protect(TestSetup.java:22)
	at junit.extensions.TestSetup.run(TestSetup.java:25)
	at org.apache.derbyTesting.junit.BaseTestSetup.run(BaseTestSetup.java:57)
	at junit.extensions.TestDecorator.basicRun(TestDecorator.java:24)
	at junit.extensions.TestSetup$1.protect(TestSetup.java:21)
	at junit.extensions.TestSetup.run(TestSetup.java:25)
	at junit.extensions.TestDecorator.basicRun(TestDecorator.java:24)
	at junit.extensions.TestSetup$1.protect(TestSetup.java:21)
	at junit.extensions.TestSetup.run(TestSetup.java:25)
	at org.apache.derbyTesting.junit.BaseTestSetup.run(BaseTestSetup.java:57)
	at junit.extensions.TestDecorator.basicRun(TestDecorator.java:24)
	at junit.extensions.TestSetup$1.protect(TestSetup.java:21)
	at junit.extensions.TestSetup.run(TestSetup.java:25)
Caused by: java.sql.SQLException: Connection authentication failure occurred.  Reason: Invalid authentication..
	at org.apache.derby.impl.jdbc.SQLExceptionFactory.getSQLException(Unknown Source)
	at org.apache.derby.impl.jdbc.SQLExceptionFactory40.wrapArgsForTransportAcrossDRDA(Unknown Source)
	... 48 more
There was 1 failure:
1) DriverMgrAuthenticationTestjunit.framework.AssertionFailedError: Failed to delete 14 files (root=D:\jartest\JarResults.2012-04-02\ibm16_suites.All\system\singleUse\oneusebf): D:\jartest\JarResults.2012-04-02\ibm16_suites.All\system\singleUse\oneusebf\seg0\c10.dat (isDir=false, canRead=true, canWrite=true, size=20480), D:\jartest\JarResults.2012-04-02\ibm16_suites.All\system\singleUse\oneusebf\seg0\c180.dat (isDir=false, canRead=true, canWrite=true, size=36864), D:\jartest\JarResults.2012-04-02\ibm16_suites.All\system\singleUse\oneusebf\seg0\c191.dat (isDir=false, canRead=true, canWrite=true, size=16384), D:\jartest\JarResults.2012-04-02\ibm16_suites.All\system\singleUse\oneusebf\seg0\c20.dat (isDir=false, canRead=true, canWrite=true, size=32768), D:\jartest\JarResults.2012-04-02\ibm16_suites.All\system\singleUse\oneusebf\seg0\c51.dat (isDir=false, canRead=true, canWrite=true, size=16384), D:\jartest\JarResults.2012-04-02\ibm16_suites.All\system\singleUse\oneusebf\seg0\c60.dat (isDir=false, canRead=true, canWrite=true, size=12288), D:\jartest\JarResults.2012-04-02\ibm16_suites.All\system\singleUse\oneusebf\seg0\c71.dat (isDir=false, canRead=true, canWrite=true, size=8192), D:\jartest\JarResults.2012-04-02\ibm16_suites.All\system\singleUse\oneusebf\seg0\c90.dat (isDir=false, canRead=true, canWrite=true, size=24576), D:\jartest\JarResults.2012-04-02\ibm16_suites.All\system\singleUse\oneusebf\seg0\ca1.dat (isDir=false, canRead=true, canWrite=true, size=24576), D:\jartest\JarResults.2012-04-02\ibm16_suites.All\system\singleUse\oneusebf\seg0\cc0.dat (isDir=false, canRead=true, canWrite=true, size=8192), D:\jartest\JarResults.2012-04-02\ibm16_suites.All\system\singleUse\oneusebf\seg0\cd1.dat (isDir=false, canRead=true, canWrite=true, size=8192), D:\jartest\JarResults.2012-04-02\ibm16_suites.All\system\singleUse\oneusebf\seg0\ce1.dat (isDir=false, canRead=true, canWrite=true, size=8192), D:\jartest\JarResults.2012-04-02\ibm16_suites.All\system\singleUse\oneusebf\seg0 (isDir=true, canRead=true, canWrite=true, size=0), D:\jartest\JarResults.2012-04-02\ibm16_suites.All\system\singleUse\oneusebf (isDir=true, canRead=true, canWrite=true, size=0)
	at org.apache.derbyTesting.junit.BaseJDBCTestCase.assertDirectoryDeleted(BaseJDBCTestCase.java:1491)
	at org.apache.derbyTesting.junit.DropDatabaseSetup.removeDir(DropDatabaseSetup.java:120)
	at org.apache.derbyTesting.junit.DropDatabaseSetup.access$000(DropDatabaseSetup.java:35)
	at org.apache.derbyTesting.junit.DropDatabaseSetup$1.run(DropDatabaseSetup.java:106)
	at java.security.AccessController.doPrivileged(AccessController.java:202)
	at org.apache.derbyTesting.junit.DropDatabaseSetup.removeDirectory(DropDatabaseSetup.java:103)
	at org.apache.derbyTesting.junit.DropDatabaseSetup.removeDirectory(DropDatabaseSetup.java:99)
	at org.apache.derbyTesting.junit.DropDatabaseSetup.removeDatabase(DropDatabaseSetup.java:92)
	at org.apache.derbyTesting.junit.DropDatabaseSetup.tearDown(DropDatabaseSetup.java:78)
	at junit.extensions.TestSetup$1.protect(TestSetup.java:22)
	at junit.extensions.TestSetup.run(TestSetup.java:25)
	at org.apache.derbyTesting.junit.BaseTestSetup.run(BaseTestSetup.java:57)
	at junit.extensions.TestDecorator.basicRun(TestDecorator.java:24)
	at junit.extensions.TestSetup$1.protect(TestSetup.java:21)
	at junit.extensions.TestSetup.run(TestSetup.java:25)

FAILURES!!!
Tests run: 15471,  Failures: 1,  Errors: 4


Here is the output from when the test failed:
(net)jdbcapi.AutoGenJDBC30Test.testUserGivenColumnsNull used 94 ms .
(emb)jdbcapi.DriverMgrAuthenticationTest.testConnectShutdownAuthentication used 27905 ms .
(emb)jdbcapi.DriverMgrAuthenticationTest.testUserFunctions used 2469 ms .
(emb)jdbcapi.DriverMgrAuthenticationTest.testNotFullAccessUsers used 765 ms .
(emb)jdbcapi.DriverMgrAuthenticationTest.testChangePasswordAndDatabasePropertiesOnly used 1000 ms .

(emb)jdbcapi.DriverMgrAuthenticationTest.testGreekCharacters used 7656 ms .
(emb)jdbcapi.DriverMgrAuthenticationTest.testSystemShutdown java.io.FileNotFoundException: system\singleUse\oneusebf\db.lck (Access is denied.)
	at java.io.FileInputStream.open(Native Method)
	at java.io.FileInputStream.<init>(FileInputStream.java:137)
	at org.apache.derbyTesting.functionTests.util.PrivilegedFileOpsForTests.copySingleFile(PrivilegedFileOpsForTests.java:304)
	at org.apache.derbyTesting.functionTests.util.PrivilegedFileOpsForTests.recursiveCopy(PrivilegedFileOpsForTests.java:276)
	at org.apache.derbyTesting.functionTests.util.PrivilegedFileOpsForTests.access$000(PrivilegedFileOpsForTests.java:49)
	at org.apache.derbyTesting.functionTests.util.PrivilegedFileOpsForTests$8.run(PrivilegedFileOpsForTests.java:235)
	at java.security.AccessController.doPrivileged(AccessController.java:251)
	at org.apache.derbyTesting.functionTests.util.PrivilegedFileOpsForTests.copy(PrivilegedFileOpsForTests.java:233)
	at org.apache.derbyTesting.junit.BaseTestCase.runBare(BaseTestCase.java:137)
	at junit.framework.TestResult$1.protect(TestResult.java:106)
	at junit.framework.TestResult.runProtected(TestResult.java:124)
	at junit.framework.TestResult.run(TestResult.java:109)
	at junit.framework.TestCase.run(TestCase.java:120)
	at junit.extensions.TestDecorator.basicRun(TestDecorator.java:24)
	at junit.extensions.TestSetup$1.protect(TestSetup.java:21)
	at junit.framework.TestResult.runProtected(TestResult.java:124)
	at junit.extensions.TestSetup.run(TestSetup.java:25)
	at org.apache.derbyTesting.junit.BaseTestSetup.run(BaseTestSetup.java:57)
	at junit.extensions.TestDecorator.basicRun(TestDecorator.java:24)
	at junit.extensions.TestSetup$1.protect(TestSetup.java:21)
	at junit.framework.TestResult.runProtected(TestResult.java:124)
	at junit.extensions.TestSetup.run(TestSetup.java:25)
	at junit.extensions.TestDecorator.basicRun(TestDecorator.java:24)
	at junit.extensions.TestSetup$1.protect(TestSetup.java:21)
	at junit.framework.TestResult.runProtected(TestResult.java:124)
	at junit.extensions.TestSetup.run(TestSetup.java:25)
	at org.apache.derbyTesting.junit.BaseTestSetup.run(BaseTestSetup.java:57)
	at junit.extensions.TestDecorator.basicRun(TestDecorator.java:24)
	at junit.extensions.TestSetup$1.protect(TestSetup.java:21)
	at junit.framework.TestResult.runProtected(TestResult.java:124)
	at junit.extensions.TestSetup.run(TestSetup.java:25)
	at org.apache.derbyTesting.junit.BaseTestSetup.run(BaseTestSetup.java:57)
	at junit.extensions.TestDecorator.basicRun(TestDecorator.java:24)
	at junit.extensions.TestSetup$1.protect(TestSetup.java:21)
	at junit.framework.TestResult.runProtected(TestResult.java:124)
	at junit.extensions.TestSetup.run(TestSetup.java:25)
	at junit.framework.TestSuite.runTest(TestSuite.java:230)
	at junit.framework.TestSuite.run(TestSuite.java:225)
	at junit.extensions.TestDecorator.basicRun(TestDecorator.java:24)
	at junit.extensions.TestSetup$1.protect(TestSetup.java:21)
	at junit.framework.TestResult.runProtected(TestResult.java:124)
	at junit.extensions.TestSetup.run(TestSetup.java:25)
	at org.apache.derbyTesting.junit.BaseTestSetup.run(BaseTestSetup.java:57)
	at junit.extensions.TestDecorator.basicRun(TestDecorator.java:24)
	at junit.extensions.TestSetup$1.protect(TestSetup.java:21)
	at junit.framework.TestResult.runProtected(TestResult.java:124)
	at junit.extensions.TestSetup.run(TestSetup.java:25)
	at junit.framework.TestSuite.runTest(TestSuite.java:230)
	at junit.framework.TestSuite.run(TestSuite.java:225)
	at junit.framework.TestSuite.runTest(TestSuite.java:230)
	at junit.framework.TestSuite.run(TestSuite.java:225)
	at junit.framework.TestSuite.runTest(TestSuite.java:230)
	at junit.framework.TestSuite.run(TestSuite.java:225)
	at junit.framework.TestSuite.runTest(TestSuite.java:230)
	at junit.framework.TestSuite.run(TestSuite.java:225)
	at junit.textui.TestRunner.doRun(TestRunner.java:121)
	at junit.textui.TestRunner.start(TestRunner.java:185)
	at junit.textui.TestRunner.main(TestRunner.java:143)
used 1484 ms EEEE<assertDirectoryDeleted> attempt 1 left 15 files/dirs behind: 0=D:\jartest\JarResults.2012-04-02\ibm16_suites.All\system\singleUse\oneusebf\db.lck 1=D:\jartest\JarResults.2012-04-02\ibm16_suites.All\system\singleUse\oneusebf\seg0\c10.dat 2=D:\jartest\JarResults.2012-04-02\ibm16_suites.All\system\singleUse\oneusebf\seg0\c180.dat 3=D:\jartest\JarResults.2012-04-02\ibm16_suites.All\system\singleUse\oneusebf\seg0\c191.dat 4=D:\jartest\JarResults.2012-04-02\ibm16_suites.All\system\singleUse\oneusebf\seg0\c20.dat 5=D:\jartest\JarResults.2012-04-02\ibm16_suites.All\system\singleUse\oneusebf\seg0\c51.dat 6=D:\jartest\JarResults.2012-04-02\ibm16_suites.All\system\singleUse\oneusebf\seg0\c60.dat 7=D:\jartest\JarResults.2012-04-02\ibm16_suites.All\system\singleUse\oneusebf\seg0\c71.dat 8=D:\jartest\JarResults.2012-04-02\ibm16_suites.All\system\singleUse\oneusebf\seg0\c90.dat 9=D:\jartest\JarResults.2012-04-02\ibm16_suites.All\system\singleUse\oneusebf\seg0\ca1.dat 10=D:\jartest\JarResults.2012-04-02\ibm16_suites.All\system\singleUse\oneusebf\seg0\cc0.dat 11=D:\jartest\JarResults.2012-04-02\ibm16_suites.All\system\singleUse\oneusebf\seg0\cd1.dat 12=D:\jartest\JarResults.2012-04-02\ibm16_suites.All\system\singleUse\oneusebf\seg0\ce1.dat 13=D:\jartest\JarResults.2012-04-02\ibm16_suites.All\system\singleUse\oneusebf\seg0 14=D:\jartest\JarResults.2012-04-02\ibm16_suites.All\system\singleUse\oneusebf
<assertDirectoryDeleted> attempt 2 left 14 files/dirs behind: 0=D:\jartest\JarResults.2012-04-02\ibm16_suites.All\system\singleUse\oneusebf\seg0\c10.dat 1=D:\jartest\JarResults.2012-04-02\ibm16_suites.All\system\singleUse\oneusebf\seg0\c180.dat 2=D:\jartest\JarResults.2012-04-02\ibm16_suites.All\system\singleUse\oneusebf\seg0\c191.dat 3=D:\jartest\JarResults.2012-04-02\ibm16_suites.All\system\singleUse\oneusebf\seg0\c20.dat 4=D:\jartest\JarResults.2012-04-02\ibm16_suites.All\system\singleUse\oneusebf\seg0\c51.dat 5=D:\jartest\JarResults.2012-04-02\ibm16_suites.All\system\singleUse\oneusebf\seg0\c60.dat 6=D:\jartest\JarResults.2012-04-02\ibm16_suites.All\system\singleUse\oneusebf\seg0\c71.dat 7=D:\jartest\JarResults.2012-04-02\ibm16_suites.All\system\singleUse\oneusebf\seg0\c90.dat 8=D:\jartest\JarResults.2012-04-02\ibm16_suites.All\system\singleUse\oneusebf\seg0\ca1.dat 9=D:\jartest\JarResults.2012-04-02\ibm16_suites.All\system\singleUse\oneusebf\seg0\cc0.dat 10=D:\jartest\JarResults.2012-04-02\ibm16_suites.All\system\singleUse\oneusebf\seg0\cd1.dat 11=D:\jartest\JarResults.2012-04-02\ibm16_suites.All\system\singleUse\oneusebf\seg0\ce1.dat 12=D:\jartest\JarResults.2012-04-02\ibm16_suites.All\system\singleUse\oneusebf\seg0 13=D:\jartest\JarResults.2012-04-02\ibm16_suites.All\system\singleUse\oneusebf
<assertDirectoryDeleted> attempt 3 left 14 files/dirs behind: 0=D:\jartest\JarResults.2012-04-02\ibm16_suites.All\system\singleUse\oneusebf\seg0\c10.dat 1=D:\jartest\JarResults.2012-04-02\ibm16_suites.All\system\singleUse\oneusebf\seg0\c180.dat 2=D:\jartest\JarResults.2012-04-02\ibm16_suites.All\system\singleUse\oneusebf\seg0\c191.dat 3=D:\jartest\JarResults.2012-04-02\ibm16_suites.All\system\singleUse\oneusebf\seg0\c20.dat 4=D:\jartest\JarResults.2012-04-02\ibm16_suites.All\system\singleUse\oneusebf\seg0\c51.dat 5=D:\jartest\JarResults.2012-04-02\ibm16_suites.All\system\singleUse\oneusebf\seg0\c60.dat 6=D:\jartest\JarResults.2012-04-02\ibm16_suites.All\system\singleUse\oneusebf\seg0\c71.dat 7=D:\jartest\JarResults.2012-04-02\ibm16_suites.All\system\singleUse\oneusebf\seg0\c90.dat 8=D:\jartest\JarResults.2012-04-02\ibm16_suites.All\system\singleUse\oneusebf\seg0\ca1.dat 9=D:\jartest\JarResults.2012-04-02\ibm16_suites.All\system\singleUse\oneusebf\seg0\cc0.dat 10=D:\jartest\JarResults.2012-04-02\ibm16_suites.All\system\singleUse\oneusebf\seg0\cd1.dat 11=D:\jartest\JarResults.2012-04-02\ibm16_suites.All\system\singleUse\oneusebf\seg0\ce1.dat 12=D:\jartest\JarResults.2012-04-02\ibm16_suites.All\system\singleUse\oneusebf\seg0 13=D:\jartest\JarResults.2012-04-02\ibm16_suites.All\system\singleUse\oneusebf
<assertDirectoryDeleted> attempt 4 left 14 files/dirs behind: 0=D:\jartest\JarResults.2012-04-02\ibm16_suites.All\system\singleUse\oneusebf\seg0\c10.dat 1=D:\jartest\JarResults.2012-04-02\ibm16_suites.All\system\singleUse\oneusebf\seg0\c180.dat 2=D:\jartest\JarResults.2012-04-02\ibm16_suites.All\system\singleUse\oneusebf\seg0\c191.dat 3=D:\jartest\JarResults.2012-04-02\ibm16_suites.All\system\singleUse\oneusebf\seg0\c20.dat 4=D:\jartest\JarResults.2012-04-02\ibm16_suites.All\system\singleUse\oneusebf\seg0\c51.dat 5=D:\jartest\JarResults.2012-04-02\ibm16_suites.All\system\singleUse\oneusebf\seg0\c60.dat 6=D:\jartest\JarResults.2012-04-02\ibm16_suites.All\system\singleUse\oneusebf\seg0\c71.dat 7=D:\jartest\JarResults.2012-04-02\ibm16_suites.All\system\singleUse\oneusebf\seg0\c90.dat 8=D:\jartest\JarResults.2012-04-02\ibm16_suites.All\system\singleUse\oneusebf\seg0\ca1.dat 9=D:\jartest\JarResults.2012-04-02\ibm16_suites.All\system\singleUse\oneusebf\seg0\cc0.dat 10=D:\jartest\JarResults.2012-04-02\ibm16_suites.All\system\singleUse\oneusebf\seg0\cd1.dat 11=D:\jartest\JarResults.2012-04-02\ibm16_suites.All\system\singleUse\oneusebf\seg0\ce1.dat 12=D:\jartest\JarResults.2012-04-02\ibm16_suites.All\system\singleUse\oneusebf\seg0 13=D:\jartest\JarResults.2012-04-02\ibm16_suites.All\system\singleUse\oneusebf
F.
(net)jdbcapi.DriverMgrAuthenticationTest.testConnectShutdownAuthentication used 4625 ms .
(net)jdbcapi.DriverMgrAuthenticationTest.testUserFunctions used 937 ms .
(net)jdbcapi.DriverMgrAuthenticationTest.testNotFullAccessUsers used 1188 ms .
(net)jdbcapi.DriverMgrAuthenticationTest.testChangePasswordAndDatabasePropertiesOnly used 578 ms .
(net)jdbcapi.DriverMgrAuthenticationTest.testGreekCharacters used 2219 ms .
(net)jdbcapi.DriverMgrAuthenticationTest.testSystemShutdown used 1188 ms .
(emb)jdbcapi.PoolDSAuthenticationTest.testConnectShutdownAuthentication used 6391 ms .


                
> multiple intermittent errors in nightly tests during DriverMgrAuthenticationTest test. reason: An SQL data change is not permitted for a read-only connection, user or database. 	
> ----------------------------------------------------------------------------------------------------------------------------------------------------------------------------------
>
>                 Key: DERBY-5686
>                 URL: https://issues.apache.org/jira/browse/DERBY-5686
>             Project: Derby
>          Issue Type: Bug
>          Components: Test
>            Reporter: Mike Matrigali
>
> 8 errors in nightly test runs on 4/4/2012 against trunk, windows, ibm16, build 1310147 .  Tests passed against same build, same machine on ibm15 and ibm17
> http://people.apache.org/~myrnavl/derby_test_results/main/windows/testlog/ibm16/1310147-suites.All_diff.txt
> There were 8 errors:
> 1) testNotFullAccessUsers(org.apache.derbyTesting.functionTests.tests.jdbcapi.DriverMgrAuthenticationTest)java.sql.SQLException: An SQL data change is not permitted for a read-only connection, user or database.
> 	at org.apache.derby.client.am.SQLExceptionFactory40.getSQLException(Unknown Source)
> 	at org.apache.derby.client.am.SqlException.getSQLException(Unknown Source)
> 	at org.apache.derby.client.am.PreparedStatement.executeUpdate(Unknown Source)
> 	at org.apache.derbyTesting.junit.DatabasePropertyTestSetup.setProperties(DatabasePropertyTestSetup.java:352)
> 	at org.apache.derbyTesting.junit.DatabasePropertyTestSetup.setUp(DatabasePropertyTestSetup.java:268)
> 	at junit.extensions.TestSetup$1.protect(TestSetup.java:20)
> 	at junit.extensions.TestSetup.run(TestSetup.java:25)
> 	at org.apache.derbyTesting.junit.BaseTestSetup.run(BaseTestSetup.java:57)
> 	at junit.extensions.TestDecorator.basicRun(TestDecorator.java:24)
> 	at junit.extensions.TestSetup$1.protect(TestSetup.java:21)
> 	at junit.extensions.TestSetup.run(TestSetup.java:25)
> 	at org.apache.derbyTesting.junit.BaseTestSetup.run(BaseTestSetup.java:57)
> 	at junit.extensions.TestDecorator.basicRun(TestDecorator.java:24)
> 	at junit.extensions.TestSetup$1.protect(TestSetup.java:21)
> 	at junit.extensions.TestSetup.run(TestSetup.java:25)
> 	at junit.extensions.TestDecorator.basicRun(TestDecorator.java:24)
> 	at junit.extensions.TestSetup$1.protect(TestSetup.java:21)
> 	at junit.extensions.TestSetup.run(TestSetup.java:25)
> 	at org.apache.derbyTesting.junit.BaseTestSetup.run(BaseTestSetup.java:57)
> 	at junit.extensions.TestDecorator.basicRun(TestDecorator.java:24)
> 	at junit.extensions.TestSetup$1.protect(TestSetup.java:21)
> 	at junit.extensions.TestSetup.run(TestSetup.java:25)
> 	at junit.extensions.TestDecorator.basicRun(TestDecorator.java:24)
> 	at junit.extensions.TestSetup$1.protect(TestSetup.java:21)
> 	at junit.extensions.TestSetup.run(TestSetup.java:25)
> 	at org.apache.derbyTesting.junit.BaseTestSetup.run(BaseTestSetup.java:57)
> 	at junit.extensions.TestDecorator.basicRun(TestDecorator.java:24)
> 	at junit.extensions.TestSetup$1.protect(TestSetup.java:21)
> 	at junit.extensions.TestSetup.run(TestSetup.java:25)
> Caused by: org.apache.derby.client.am.SqlException: An SQL data change is not permitted for a read-only connection, user or database.
> 	at org.apache.derby.client.am.Statement.completeExecute(Unknown Source)
> 	at org.apache.derby.client.net.NetStatementReply.parseEXCSQLSTTreply(Unknown Source)
> 	at org.apache.derby.client.net.NetStatementReply.readExecuteCall(Unknown Source)
> 	at org.apache.derby.client.net.StatementReply.readExecuteCall(Unknown Source)
> 	at org.apache.derby.client.net.NetStatement.readExecuteCall_(Unknown Source)
> 	at org.apache.derby.client.am.Statement.readExecuteCall(Unknown Source)
> 	at org.apache.derby.client.am.PreparedStatement.flowExecute(Unknown Source)
> 	at org.apache.derby.client.am.PreparedStatement.executeUpdateX(Unknown Source)
> 	... 47 more
> 2) testNotFullAccessUsers(org.apache.derbyTesting.functionTests.tests.jdbcapi.DriverMgrAuthenticationTest)java.sql.SQLException: An SQL data change is not permitted for a read-only connection, user or database.
> 	at org.apache.derby.client.am.SQLExceptionFactory40.getSQLException(Unknown Source)
> 	at org.apache.derby.client.am.SqlException.getSQLException(Unknown Source)
> 	at org.apache.derby.client.am.PreparedStatement.executeUpdate(Unknown Source)
> 	at org.apache.derbyTesting.junit.DatabasePropertyTestSetup.tearDown(DatabasePropertyTestSetup.java:294)
> 	at junit.extensions.TestSetup$1.protect(TestSetup.java:22)
> 	at junit.extensions.TestSetup.run(TestSetup.java:25)
> 	at org.apache.derbyTesting.junit.BaseTestSetup.run(BaseTestSetup.java:57)
> 	at junit.extensions.TestDecorator.basicRun(TestDecorator.java:24)
> 	at junit.extensions.TestSetup$1.protect(TestSetup.java:21)
> 	at junit.extensions.TestSetup.run(TestSetup.java:25)
> 	at junit.extensions.TestDecorator.basicRun(TestDecorator.java:24)
> 	at junit.extensions.TestSetup$1.protect(TestSetup.java:21)
> 	at junit.extensions.TestSetup.run(TestSetup.java:25)
> 	at org.apache.derbyTesting.junit.BaseTestSetup.run(BaseTestSetup.java:57)
> 	at junit.extensions.TestDecorator.basicRun(TestDecorator.java:24)
> 	at junit.extensions.TestSetup$1.protect(TestSetup.java:21)
> 	at junit.extensions.TestSetup.run(TestSetup.java:25)
> 	at junit.extensions.TestDecorator.basicRun(TestDecorator.java:24)
> 	at junit.extensions.TestSetup$1.protect(TestSetup.java:21)
> 	at junit.extensions.TestSetup.run(TestSetup.java:25)
> 	at org.apache.derbyTesting.junit.BaseTestSetup.run(BaseTestSetup.java:57)
> 	at junit.extensions.TestDecorator.basicRun(TestDecorator.java:24)
> 	at junit.extensions.TestSetup$1.protect(TestSetup.java:21)
> 	at junit.extensions.TestSetup.run(TestSetup.java:25)
> Caused by: org.apache.derby.client.am.SqlException: An SQL data change is not permitted for a read-only connection, user or database.
> 	at org.apache.derby.client.am.Statement.completeExecute(Unknown Source)
> 	at org.apache.derby.client.net.NetStatementReply.parseEXCSQLSTTreply(Unknown Source)
> 	at org.apache.derby.client.net.NetStatementReply.readExecuteCall(Unknown Source)
> 	at org.apache.derby.client.net.StatementReply.readExecuteCall(Unknown Source)
> 	at org.apache.derby.client.net.NetStatement.readExecuteCall_(Unknown Source)
> 	at org.apache.derby.client.am.Statement.readExecuteCall(Unknown Source)
> 	at org.apache.derby.client.am.PreparedStatement.flowExecute(Unknown Source)
> 	at org.apache.derby.client.am.PreparedStatement.executeUpdateX(Unknown Source)
> 	... 41 more
> 3) testChangePasswordAndDatabasePropertiesOnly(org.apache.derbyTesting.functionTests.tests.jdbcapi.DriverMgrAuthenticationTest)java.sql.SQLException: An SQL data change is not permitted for a read-only connection, user or database.
> 	at org.apache.derby.client.am.SQLExceptionFactory40.getSQLException(Unknown Source)
> 	at org.apache.derby.client.am.SqlException.getSQLException(Unknown Source)
> 	at org.apache.derby.client.am.PreparedStatement.executeUpdate(Unknown Source)
> 	at org.apache.derbyTesting.junit.DatabasePropertyTestSetup.setProperties(DatabasePropertyTestSetup.java:352)
> 	at org.apache.derbyTesting.junit.DatabasePropertyTestSetup.setUp(DatabasePropertyTestSetup.java:268)
> 	at junit.extensions.TestSetup$1.protect(TestSetup.java:20)
> 	at junit.extensions.TestSetup.run(TestSetup.java:25)
> 	at org.apache.derbyTesting.junit.BaseTestSetup.run(BaseTestSetup.java:57)
> 	at junit.extensions.TestDecorator.basicRun(TestDecorator.java:24)
> 	at junit.extensions.TestSetup$1.protect(TestSetup.java:21)
> 	at junit.extensions.TestSetup.run(TestSetup.java:25)
> 	at org.apache.derbyTesting.junit.BaseTestSetup.run(BaseTestSetup.java:57)
> 	at junit.extensions.TestDecorator.basicRun(TestDecorator.java:24)
> 	at junit.extensions.TestSetup$1.protect(TestSetup.java:21)
> 	at junit.extensions.TestSetup.run(TestSetup.java:25)
> 	at junit.extensions.TestDecorator.basicRun(TestDecorator.java:24)
> 	at junit.extensions.TestSetup$1.protect(TestSetup.java:21)
> 	at junit.extensions.TestSetup.run(TestSetup.java:25)
> 	at org.apache.derbyTesting.junit.BaseTestSetup.run(BaseTestSetup.java:57)
> 	at junit.extensions.TestDecorator.basicRun(TestDecorator.java:24)
> 	at junit.extensions.TestSetup$1.protect(TestSetup.java:21)
> 	at junit.extensions.TestSetup.run(TestSetup.java:25)
> 	at junit.extensions.TestDecorator.basicRun(TestDecorator.java:24)
> 	at junit.extensions.TestSetup$1.protect(TestSetup.java:21)
> 	at junit.extensions.TestSetup.run(TestSetup.java:25)
> 	at org.apache.derbyTesting.junit.BaseTestSetup.run(BaseTestSetup.java:57)
> 	at junit.extensions.TestDecorator.basicRun(TestDecorator.java:24)
> 	at junit.extensions.TestSetup$1.protect(TestSetup.java:21)
> 	at junit.extensions.TestSetup.run(TestSetup.java:25)
> Caused by: org.apache.derby.client.am.SqlException: An SQL data change is not permitted for a read-only connection, user or database.
> 	at org.apache.derby.client.am.Statement.completeExecute(Unknown Source)
> 	at org.apache.derby.client.net.NetStatementReply.parseEXCSQLSTTreply(Unknown Source)
> 	at org.apache.derby.client.net.NetStatementReply.readExecuteCall(Unknown Source)
> 	at org.apache.derby.client.net.StatementReply.readExecuteCall(Unknown Source)
> 	at org.apache.derby.client.net.NetStatement.readExecuteCall_(Unknown Source)
> 	at org.apache.derby.client.am.Statement.readExecuteCall(Unknown Source)
> 	at org.apache.derby.client.am.PreparedStatement.flowExecute(Unknown Source)
> 	at org.apache.derby.client.am.PreparedStatement.executeUpdateX(Unknown Source)
> 	... 47 more
> 4) testChangePasswordAndDatabasePropertiesOnly(org.apache.derbyTesting.functionTests.tests.jdbcapi.DriverMgrAuthenticationTest)java.sql.SQLException: An SQL data change is not permitted for a read-only connection, user or database.
> 	at org.apache.derby.client.am.SQLExceptionFactory40.getSQLException(Unknown Source)
> 	at org.apache.derby.client.am.SqlException.getSQLException(Unknown Source)
> 	at org.apache.derby.client.am.PreparedStatement.executeUpdate(Unknown Source)
> 	at org.apache.derbyTesting.junit.DatabasePropertyTestSetup.tearDown(DatabasePropertyTestSetup.java:294)
> 	at junit.extensions.TestSetup$1.protect(TestSetup.java:22)
> 	at junit.extensions.TestSetup.run(TestSetup.java:25)
> 	at org.apache.derbyTesting.junit.BaseTestSetup.run(BaseTestSetup.java:57)
> 	at junit.extensions.TestDecorator.basicRun(TestDecorator.java:24)
> 	at junit.extensions.TestSetup$1.protect(TestSetup.java:21)
> 	at junit.extensions.TestSetup.run(TestSetup.java:25)
> 	at junit.extensions.TestDecorator.basicRun(TestDecorator.java:24)
> 	at junit.extensions.TestSetup$1.protect(TestSetup.java:21)
> 	at junit.extensions.TestSetup.run(TestSetup.java:25)
> 	at org.apache.derbyTesting.junit.BaseTestSetup.run(BaseTestSetup.java:57)
> 	at junit.extensions.TestDecorator.basicRun(TestDecorator.java:24)
> 	at junit.extensions.TestSetup$1.protect(TestSetup.java:21)
> 	at junit.extensions.TestSetup.run(TestSetup.java:25)
> 	at junit.extensions.TestDecorator.basicRun(TestDecorator.java:24)
> 	at junit.extensions.TestSetup$1.protect(TestSetup.java:21)
> 	at junit.extensions.TestSetup.run(TestSetup.java:25)
> 	at org.apache.derbyTesting.junit.BaseTestSetup.run(BaseTestSetup.java:57)
> 	at junit.extensions.TestDecorator.basicRun(TestDecorator.java:24)
> 	at junit.extensions.TestSetup$1.protect(TestSetup.java:21)
> 	at junit.extensions.TestSetup.run(TestSetup.java:25)
> Caused by: org.apache.derby.client.am.SqlException: An SQL data change is not permitted for a read-only connection, user or database.
> 	at org.apache.derby.client.am.Statement.completeExecute(Unknown Source)
> 	at org.apache.derby.client.net.NetStatementReply.parseEXCSQLSTTreply(Unknown Source)
> 	at org.apache.derby.client.net.NetStatementReply.readExecuteCall(Unknown Source)
> 	at org.apache.derby.client.net.StatementReply.readExecuteCall(Unknown Source)
> 	at org.apache.derby.client.net.NetStatement.readExecuteCall_(Unknown Source)
> 	at org.apache.derby.client.am.Statement.readExecuteCall(Unknown Source)
> 	at org.apache.derby.client.am.PreparedStatement.flowExecute(Unknown Source)
> 	at org.apache.derby.client.am.PreparedStatement.executeUpdateX(Unknown Source)
> 	... 41 more
> 5) testGreekCharacters(org.apache.derbyTesting.functionTests.tests.jdbcapi.DriverMgrAuthenticationTest)java.sql.SQLException: An SQL data change is not permitted for a read-only connection, user or database.
> 	at org.apache.derby.client.am.SQLExceptionFactory40.getSQLException(Unknown Source)
> 	at org.apache.derby.client.am.SqlException.getSQLException(Unknown Source)
> 	at org.apache.derby.client.am.PreparedStatement.executeUpdate(Unknown Source)
> 	at org.apache.derbyTesting.junit.DatabasePropertyTestSetup.setProperties(DatabasePropertyTestSetup.java:352)
> 	at org.apache.derbyTesting.junit.DatabasePropertyTestSetup.setUp(DatabasePropertyTestSetup.java:268)
> 	at junit.extensions.TestSetup$1.protect(TestSetup.java:20)
> 	at junit.extensions.TestSetup.run(TestSetup.java:25)
> 	at org.apache.derbyTesting.junit.BaseTestSetup.run(BaseTestSetup.java:57)
> 	at junit.extensions.TestDecorator.basicRun(TestDecorator.java:24)
> 	at junit.extensions.TestSetup$1.protect(TestSetup.java:21)
> 	at junit.extensions.TestSetup.run(TestSetup.java:25)
> 	at org.apache.derbyTesting.junit.BaseTestSetup.run(BaseTestSetup.java:57)
> 	at junit.extensions.TestDecorator.basicRun(TestDecorator.java:24)
> 	at junit.extensions.TestSetup$1.protect(TestSetup.java:21)
> 	at junit.extensions.TestSetup.run(TestSetup.java:25)
> 	at junit.extensions.TestDecorator.basicRun(TestDecorator.java:24)
> 	at junit.extensions.TestSetup$1.protect(TestSetup.java:21)
> 	at junit.extensions.TestSetup.run(TestSetup.java:25)
> 	at org.apache.derbyTesting.junit.BaseTestSetup.run(BaseTestSetup.java:57)
> 	at junit.extensions.TestDecorator.basicRun(TestDecorator.java:24)
> 	at junit.extensions.TestSetup$1.protect(TestSetup.java:21)
> 	at junit.extensions.TestSetup.run(TestSetup.java:25)
> 	at junit.extensions.TestDecorator.basicRun(TestDecorator.java:24)
> 	at junit.extensions.TestSetup$1.protect(TestSetup.java:21)
> 	at junit.extensions.TestSetup.run(TestSetup.java:25)
> 	at org.apache.derbyTesting.junit.BaseTestSetup.run(BaseTestSetup.java:57)
> 	at junit.extensions.TestDecorator.basicRun(TestDecorator.java:24)
> 	at junit.extensions.TestSetup$1.protect(TestSetup.java:21)
> 	at junit.extensions.TestSetup.run(TestSetup.java:25)
> Caused by: org.apache.derby.client.am.SqlException: An SQL data change is not permitted for a read-only connection, user or database.
> 	at org.apache.derby.client.am.Statement.completeExecute(Unknown Source)
> 	at org.apache.derby.client.net.NetStatementReply.parseEXCSQLSTTreply(Unknown Source)
> 	at org.apache.derby.client.net.NetStatementReply.readExecuteCall(Unknown Source)
> 	at org.apache.derby.client.net.StatementReply.readExecuteCall(Unknown Source)
> 	at org.apache.derby.client.net.NetStatement.readExecuteCall_(Unknown Source)
> 	at org.apache.derby.client.am.Statement.readExecuteCall(Unknown Source)
> 	at org.apache.derby.client.am.PreparedStatement.flowExecute(Unknown Source)
> 	at org.apache.derby.client.am.PreparedStatement.executeUpdateX(Unknown Source)
> 	... 47 more
> 6) testGreekCharacters(org.apache.derbyTesting.functionTests.tests.jdbcapi.DriverMgrAuthenticationTest)java.sql.SQLException: An SQL data change is not permitted for a read-only connection, user or database.
> 	at org.apache.derby.client.am.SQLExceptionFactory40.getSQLException(Unknown Source)
> 	at org.apache.derby.client.am.SqlException.getSQLException(Unknown Source)
> 	at org.apache.derby.client.am.PreparedStatement.executeUpdate(Unknown Source)
> 	at org.apache.derbyTesting.junit.DatabasePropertyTestSetup.tearDown(DatabasePropertyTestSetup.java:294)
> 	at junit.extensions.TestSetup$1.protect(TestSetup.java:22)
> 	at junit.extensions.TestSetup.run(TestSetup.java:25)
> 	at org.apache.derbyTesting.junit.BaseTestSetup.run(BaseTestSetup.java:57)
> 	at junit.extensions.TestDecorator.basicRun(TestDecorator.java:24)
> 	at junit.extensions.TestSetup$1.protect(TestSetup.java:21)
> 	at junit.extensions.TestSetup.run(TestSetup.java:25)
> 	at junit.extensions.TestDecorator.basicRun(TestDecorator.java:24)
> 	at junit.extensions.TestSetup$1.protect(TestSetup.java:21)
> 	at junit.extensions.TestSetup.run(TestSetup.java:25)
> 	at org.apache.derbyTesting.junit.BaseTestSetup.run(BaseTestSetup.java:57)
> 	at junit.extensions.TestDecorator.basicRun(TestDecorator.java:24)
> 	at junit.extensions.TestSetup$1.protect(TestSetup.java:21)
> 	at junit.extensions.TestSetup.run(TestSetup.java:25)
> 	at junit.extensions.TestDecorator.basicRun(TestDecorator.java:24)
> 	at junit.extensions.TestSetup$1.protect(TestSetup.java:21)
> 	at junit.extensions.TestSetup.run(TestSetup.java:25)
> 	at org.apache.derbyTesting.junit.BaseTestSetup.run(BaseTestSetup.java:57)
> 	at junit.extensions.TestDecorator.basicRun(TestDecorator.java:24)
> 	at junit.extensions.TestSetup$1.protect(TestSetup.java:21)
> 	at junit.extensions.TestSetup.run(TestSetup.java:25)
> Caused by: org.apache.derby.client.am.SqlException: An SQL data change is not permitted for a read-only connection, user or database.
> 	at org.apache.derby.client.am.Statement.completeExecute(Unknown Source)
> 	at org.apache.derby.client.net.NetStatementReply.parseEXCSQLSTTreply(Unknown Source)
> 	at org.apache.derby.client.net.NetStatementReply.readExecuteCall(Unknown Source)
> 	at org.apache.derby.client.net.StatementReply.readExecuteCall(Unknown Source)
> 	at org.apache.derby.client.net.NetStatement.readExecuteCall_(Unknown Source)
> 	at org.apache.derby.client.am.Statement.readExecuteCall(Unknown Source)
> 	at org.apache.derby.client.am.PreparedStatement.flowExecute(Unknown Source)
> 	at org.apache.derby.client.am.PreparedStatement.executeUpdateX(Unknown Source)
> 	... 41 more
> 7) testSystemShutdown(org.apache.derbyTesting.functionTests.tests.jdbcapi.DriverMgrAuthenticationTest)java.sql.SQLException: An SQL data change is not permitted for a read-only connection, user or database.
> 	at org.apache.derby.client.am.SQLExceptionFactory40.getSQLException(Unknown Source)
> 	at org.apache.derby.client.am.SqlException.getSQLException(Unknown Source)
> 	at org.apache.derby.client.am.PreparedStatement.executeUpdate(Unknown Source)
> 	at org.apache.derbyTesting.junit.DatabasePropertyTestSetup.setProperties(DatabasePropertyTestSetup.java:352)
> 	at org.apache.derbyTesting.junit.DatabasePropertyTestSetup.setUp(DatabasePropertyTestSetup.java:268)
> 	at junit.extensions.TestSetup$1.protect(TestSetup.java:20)
> 	at junit.extensions.TestSetup.run(TestSetup.java:25)
> 	at org.apache.derbyTesting.junit.BaseTestSetup.run(BaseTestSetup.java:57)
> 	at junit.extensions.TestDecorator.basicRun(TestDecorator.java:24)
> 	at junit.extensions.TestSetup$1.protect(TestSetup.java:21)
> 	at junit.extensions.TestSetup.run(TestSetup.java:25)
> 	at org.apache.derbyTesting.junit.BaseTestSetup.run(BaseTestSetup.java:57)
> 	at junit.extensions.TestDecorator.basicRun(TestDecorator.java:24)
> 	at junit.extensions.TestSetup$1.protect(TestSetup.java:21)
> 	at junit.extensions.TestSetup.run(TestSetup.java:25)
> 	at junit.extensions.TestDecorator.basicRun(TestDecorator.java:24)
> 	at junit.extensions.TestSetup$1.protect(TestSetup.java:21)
> 	at junit.extensions.TestSetup.run(TestSetup.java:25)
> 	at org.apache.derbyTesting.junit.BaseTestSetup.run(BaseTestSetup.java:57)
> 	at junit.extensions.TestDecorator.basicRun(TestDecorator.java:24)
> 	at junit.extensions.TestSetup$1.protect(TestSetup.java:21)
> 	at junit.extensions.TestSetup.run(TestSetup.java:25)
> 	at junit.extensions.TestDecorator.basicRun(TestDecorator.java:24)
> 	at junit.extensions.TestSetup$1.protect(TestSetup.java:21)
> 	at junit.extensions.TestSetup.run(TestSetup.java:25)
> 	at org.apache.derbyTesting.junit.BaseTestSetup.run(BaseTestSetup.java:57)
> 	at junit.extensions.TestDecorator.basicRun(TestDecorator.java:24)
> 	at junit.extensions.TestSetup$1.protect(TestSetup.java:21)
> 	at junit.extensions.TestSetup.run(TestSetup.java:25)
> Caused by: org.apache.derby.client.am.SqlException: An SQL data change is not permitted for a read-only connection, user or database.
> 	at org.apache.derby.client.am.Statement.completeExecute(Unknown Source)
> 	at org.apache.derby.client.net.NetStatementReply.parseEXCSQLSTTreply(Unknown Source)
> 	at org.apache.derby.client.net.NetStatementReply.readExecuteCall(Unknown Source)
> 	at org.apache.derby.client.net.StatementReply.readExecuteCall(Unknown Source)
> 	at org.apache.derby.client.net.NetStatement.readExecuteCall_(Unknown Source)
> 	at org.apache.derby.client.am.Statement.readExecuteCall(Unknown Source)
> 	at org.apache.derby.client.am.PreparedStatement.flowExecute(Unknown Source)
> 	at org.apache.derby.client.am.PreparedStatement.executeUpdateX(Unknown Source)
> 	... 47 more
> 8) testSystemShutdown(org.apache.derbyTesting.functionTests.tests.jdbcapi.DriverMgrAuthenticationTest)java.sql.SQLException: An SQL data change is not permitted for a read-only connection, user or database.
> 	at org.apache.derby.client.am.SQLExceptionFactory40.getSQLException(Unknown Source)
> 	at org.apache.derby.client.am.SqlException.getSQLException(Unknown Source)
> 	at org.apache.derby.client.am.PreparedStatement.executeUpdate(Unknown Source)
> 	at org.apache.derbyTesting.junit.DatabasePropertyTestSetup.tearDown(DatabasePropertyTestSetup.java:294)
> 	at junit.extensions.TestSetup$1.protect(TestSetup.java:22)
> 	at junit.extensions.TestSetup.run(TestSetup.java:25)
> 	at org.apache.derbyTesting.junit.BaseTestSetup.run(BaseTestSetup.java:57)
> 	at junit.extensions.TestDecorator.basicRun(TestDecorator.java:24)
> 	at junit.extensions.TestSetup$1.protect(TestSetup.java:21)
> 	at junit.extensions.TestSetup.run(TestSetup.java:25)
> 	at junit.extensions.TestDecorator.basicRun(TestDecorator.java:24)
> 	at junit.extensions.TestSetup$1.protect(TestSetup.java:21)
> 	at junit.extensions.TestSetup.run(TestSetup.java:25)
> 	at org.apache.derbyTesting.junit.BaseTestSetup.run(BaseTestSetup.java:57)
> 	at junit.extensions.TestDecorator.basicRun(TestDecorator.java:24)
> 	at junit.extensions.TestSetup$1.protect(TestSetup.java:21)
> 	at junit.extensions.TestSetup.run(TestSetup.java:25)
> 	at junit.extensions.TestDecorator.basicRun(TestDecorator.java:24)
> 	at junit.extensions.TestSetup$1.protect(TestSetup.java:21)
> 	at junit.extensions.TestSetup.run(TestSetup.java:25)
> 	at org.apache.derbyTesting.junit.BaseTestSetup.run(BaseTestSetup.java:57)
> 	at junit.extensions.TestDecorator.basicRun(TestDecorator.java:24)
> 	at junit.extensions.TestSetup$1.protect(TestSetup.java:21)
> 	at junit.extensions.TestSetup.run(TestSetup.java:25)
> Caused by: org.apache.derby.client.am.SqlException: An SQL data change is not permitted for a read-only connection, user or database.
> 	at org.apache.derby.client.am.Statement.completeExecute(Unknown Source)
> 	at org.apache.derby.client.net.NetStatementReply.parseEXCSQLSTTreply(Unknown Source)
> 	at org.apache.derby.client.net.NetStatementReply.readExecuteCall(Unknown Source)
> 	at org.apache.derby.client.net.StatementReply.readExecuteCall(Unknown Source)
> 	at org.apache.derby.client.net.NetStatement.readExecuteCall_(Unknown Source)
> 	at org.apache.derby.client.am.Statement.readExecuteCall(Unknown Source)
> 	at org.apache.derby.client.am.PreparedStatement.flowExecute(Unknown Source)
> 	at org.apache.derby.client.am.PreparedStatement.executeUpdateX(Unknown Source)
> 	... 41 more
> FAILURES!!!
> Tests run: 15467,  Failures: 0,  Errors: 8

--
This message is automatically generated by JIRA.
If you think it was sent incorrectly, please contact your JIRA administrators: https://issues.apache.org/jira/secure/ContactAdministrators!default.jspa
For more information on JIRA, see: http://www.atlassian.com/software/jira

       

Mime
View raw message