db-derby-dev mailing list archives

Site index · List index
Message view « Date » · « Thread »
Top « Date » · « Thread »
From "Mike Matrigali (Commented) (JIRA)" <j...@apache.org>
Subject [jira] [Commented] (DERBY-5594) SecureServerTest java.io.IOException: Interrupted system call
Date Thu, 15 Mar 2012 20:04:37 GMT

    [ https://issues.apache.org/jira/browse/DERBY-5594?page=com.atlassian.jira.plugin.system.issuetabpanels:comment-tabpanel&focusedCommentId=13230488#comment-13230488
] 

Mike Matrigali commented on DERBY-5594:
---------------------------------------

test failed in sun nightlys:  10.8, build 13000249, linux, jdk15
http://dbtg.foundry.sun.com/derby/test/10.8Branch/jvm1.5/testing/testlog/lin/1300249-suitesAll_diff.txt
suitesAll fail *************************************************************
1) SecureServerTest( Opened = true, Authenticated= true, CustomDerbyProperties= null, WildCardHost=
null )junit.framework.AssertionFailedError: Timed out waiting for network server to start:Spawned
SpawnedNetworkServer exitCode=143
suitesAll fail *************************************************************
.........................................
.........................................
...........F..............................

lines deleted ...

Time: 13,099.676
There was 1 failure:
1) SecureServerTest( Opened = true, Authenticated= true, CustomDerbyProperties= null, WildCardHost=
null )junit.framework.AssertionFailedError: Timed out waiting for network server to start:Spawned
SpawnedNetworkServer exitCode=143
	at org.apache.derbyTesting.junit.NetworkServerTestSetup.setUp(NetworkServerTestSetup.java:210)
	at junit.extensions.TestSetup$1.protect(TestSetup.java:20)
	at junit.extensions.TestSetup.run(TestSetup.java:25)
	at org.apache.derbyTesting.junit.BaseTestSetup.run(BaseTestSetup.java:57)
	at junit.extensions.TestDecorator.basicRun(TestDecorator.java:24)
	at junit.extensions.TestSetup$1.protect(TestSetup.java:21)
	at junit.extensions.TestSetup.run(TestSetup.java:25)
	at junit.extensions.TestDecorator.basicRun(TestDecorator.java:24)
	at junit.extensions.TestSetup$1.protect(TestSetup.java:21)
	at junit.extensions.TestSetup.run(TestSetup.java:25)
	at junit.extensions.TestDecorator.basicRun(TestDecorator.java:24)
	at junit.extensions.TestSetup$1.protect(TestSetup.java:21)
	at junit.extensions.TestSetup.run(TestSetup.java:25)

                
> SecureServerTest java.io.IOException: Interrupted system call 
> --------------------------------------------------------------
>
>                 Key: DERBY-5594
>                 URL: https://issues.apache.org/jira/browse/DERBY-5594
>             Project: Derby
>          Issue Type: Bug
>          Components: Test
>    Affects Versions: 10.8.2.3
>         Environment: linix vmware IBM 1.7
> java.runtime.version: pxi3270-20110827_01
> java.fullversion: JRE 1.7.0 IBM J9 2.6 Linux x86-32 20110810_88604 (JIT enabled, AOT
enabled)
> J9VM - R26_Java726_GA_20110810_1208_B88592
> JIT  - r11_20110810_20466
> GC   - R26_Java726_GA_20110810_1208_B88592
> J9CL - 20110810_88604
>            Reporter: Kathey Marsden
>
> On 10.8.2.3 - (1236960) linux vmware, I saw the following failure.
> 1) SecureServerTest( Opened = false, Authenticated= true, CustomDerbyProperties= null,
WildCardHost= 0.00.000.0 )junit.framework.AssertionFailedError: Timed out waiting for network
server to start:Spawned SpawnedNetworkServer exitCode=143
> STDERR:
> java.io.IOException: Interrupted system call
> 	at java.io.FileInputStream.read(FileInputStream.java:255)
> 	at java.io.BufferedInputStream.fill(BufferedInputStream.java:246)
> 	at java.io.BufferedInputStream.read1(BufferedInputStream.java:286)
> 	at java.io.BufferedInputStream.read(BufferedInputStream.java:345)
> 	at java.io.FilterInputStream.read(FilterInputStream.java:118)
> 	at org.apache.derbyTesting.junit.SpawnedProcess$2.run(SpawnedProcess.java:246)
> 	at java.lang.Thread.run(Thread.java:769)
> STDOUT:
> Sat Jan 28 06:30:04 PST 2012 : Security manager installed using the Basic server security
policy.
> java.io.IOException: Interrupted system call
> 	at java.io.FileInputStream.read(FileInputStream.java:255)
> 	at java.io.BufferedInputStream.fill(BufferedInputStream.java:246)
> 	at java.io.BufferedInputStream.read1(BufferedInputStream.java:286)
> 	at java.io.BufferedInputStream.read(BufferedInputStream.java:345)
> 	at java.io.FilterInputStream.read(FilterInputStream.java:118)
> 	at org.apache.derbyTesting.junit.SpawnedProcess$2.run(SpawnedProcess.java:246)
> 	at java.lang.Thread.run(Thread.java:769)
> 	at org.apache.derbyTesting.junit.NetworkServerTestSetup.setUp(NetworkServerTestSetup.java:210)
> 	at junit.extensions.TestSetup$1.protect(TestSetup.java:20)
> 	at junit.extensions.TestSetup.run(TestSetup.java:25)
> 	at org.apache.derbyTesting.junit.BaseTestSetup.run(BaseTestSetup.java:57)
> 	at junit.extensions.TestDecorator.basicRun(TestDecorator.java:24)
> 	at junit.extensions.TestSetup$1.protect(TestSetup.java:21)
> 	at junit.extensions.TestSetup.run(TestSetup.java:25)
> 	at junit.extensions.TestDecorator.basicRun(TestDecorator.java:24)
> 	at junit.extensions.TestSetup$1.protect(TestSetup.java:21)
> 	at junit.extensions.TestSetup.run(TestSetup.java:25)
> 	at junit.extensions.TestDecorator.basicRun(TestDecorator.java:24)
> 	at junit.extensions.TestSetup$1.protect(TestSetup.java:21)
> 	at junit.extensions.TestSetup.run(TestSetup.java:25)

--
This message is automatically generated by JIRA.
If you think it was sent incorrectly, please contact your JIRA administrators: https://issues.apache.org/jira/secure/ContactAdministrators!default.jspa
For more information on JIRA, see: http://www.atlassian.com/software/jira

        

Mime
View raw message