db-derby-dev mailing list archives

Site index · List index
Message view « Date » · « Thread »
Top « Date » · « Thread »
From "Mike Matrigali (Commented) (JIRA)" <j...@apache.org>
Subject [jira] [Commented] (DERBY-5588) 14 fixtures in the AuthenticationTest failed with nested error: ERROR 25502: An SQL data change is not permitted for a read-only connection, user or database.
Date Wed, 01 Feb 2012 23:45:53 GMT

    [ https://issues.apache.org/jira/browse/DERBY-5588?page=com.atlassian.jira.plugin.system.issuetabpanels:comment-tabpanel&focusedCommentId=13198333#comment-13198333 ] 

Mike Matrigali commented on DERBY-5588:
---------------------------------------

got 51 ERROR 25502 errors against trunk, ibm17 jvm.  This time no 25502 errors in Authentication test.  Also runs on same codeline vs
ibm16 and weme were successful on this night's run.:
http://people.apache.org/~myrnavl/derby_test_results/main/windows/testlog/ibm17/1236968-suites.All_diff.txt

Here are just the tops of stacks, see above for full stacks, I can also post more info from the tests if any some more info would be useful:
1) testClientURL(org.apache.derbyTesting.functionTests.tests.jdbcapi.DriverTest)java.sql.SQLException: An SQL data change is not permitted for a read-
only connection, user or database.
2) testDbNameWithSpaces(org.apache.derbyTesting.functionTests.tests.jdbcapi.DriverTest)java.sql.SQLException: An SQL data change is not permitted for
a read-only connection, user or database.
3) testDriverCompliantVersion(org.apache.derbyTesting.functionTests.tests.jdbcapi.DriverTest)java.sql.SQLException: An SQL data change is not permitte
d for a read-only connection, user or database.
4) testAcceptsURL(org.apache.derbyTesting.functionTests.tests.jdbcapi.DriverTest)java.sql.SQLException: An SQL data change is not permitted for a read
-only connection, user or database.
5) testEmbeddedAttributes(org.apache.derbyTesting.functionTests.tests.jdbcapi.DriverTest)java.sql.SQLException: An SQL data change is not permitted fo
r a read-only connection, user or database.
6) testClientAttributes(org.apache.derbyTesting.functionTests.tests.jdbcapi.DriverTest)java.sql.SQLException: An SQL data change is not permitted for
a read-only connection, user or database.
7) testClientURL(org.apache.derbyTesting.functionTests.tests.jdbcapi.DriverTest)java.sql.SQLException: An SQL data change is not permitted for a read-
only connection, user or database.
8) testDbNameWithSpaces(org.apache.derbyTesting.functionTests.tests.jdbcapi.DriverTest)java.sql.SQLException: An SQL data change is not permitted for
a read-only connection, user or database.
9) SURTest_ij(org.apache.derbyTesting.functionTests.tests.jdbcapi.SURijTest)java.sql.SQLException: An SQL data change is not permitted for a read-only
 connection, user or database.
10) SURTest_ij(org.apache.derbyTesting.functionTests.tests.jdbcapi.SURijTest)java.sql.SQLException: An SQL data change is not permitted for a read-onl
y connection, user or database.
11) NullSQLTextTest:embeddedjava.sql.SQLException: An SQL data change is not permitted for a read-only connection, user or database.
12) NullSQLTextTest:clientjava.sql.SQLException: An SQL data change is not permitted for a read-only connection, user or database.
13) PrepStmtNullTest:embeddedjava.sql.SQLException: An SQL data change is not permitted for a read-only connection, user or database.
14) PrepStmtNullTest:clientjava.sql.SQLException: An SQL data change is not permitted for a read-only connection, user or database.
15) StatementJdbc30Test:embeddedjava.sql.SQLException: An SQL data change is not permitted for a read-only connection, user or database.
16) StatementJdbc30Test:clientjava.sql.SQLException: An SQL data change is not permitted for a read-only connection, user or database.
17) StatementJdbc20Test:embeddedjava.sql.SQLException: An SQL data change is not permitted for a read-only connection, user or database.
18) StatementJdbc20Test:clientjava.sql.SQLException: An SQL data change is not permitted for a read-only connection, user or database.
19) ClobTestjava.sql.SQLException: DDL is not permitted for a read-only connection, user or database.
20) BlobUpdatableStreamTest:embeddedjava.sql.SQLException: An SQL data change is not permitted for a read-only connection, user or database.
21) BlobUpdatableStreamTest:clientjava.sql.SQLException: An SQL data change is not permitted for a read-only connection, user or database.
22) AIjdbcTestjava.sql.SQLException: An SQL data change is not permitted for a read-only connection, user or database.
23) LargeDataLocksTest:embeddedjava.sql.SQLException: An SQL data change is not permitted for a read-only connection, user or database.
24) LargeDataLocksTest:clientjava.sql.SQLException: An SQL data change is not permitted for a read-only connection, user or database.
25) DMDBugsTest:embeddedjava.sql.SQLException: An SQL data change is not permitted for a read-only connection, user or database.
26) DMDBugsTest:clientjava.sql.SQLException: An SQL data change is not permitted for a read-only connection, user or database.
27) DataSourceTest suitejava.sql.SQLException: An SQL data change is not permitted for a read-only connection, user or database.
28) SavepointJdbc30_JSR169Test suitejava.sql.SQLException: An SQL data change is not permitted for a read-only connection, user or database.
29) RelativeTest:embeddedjava.sql.SQLException: An SQL data change is not permitted for a read-only connection, user or database.
30) RelativeTest:clientjava.sql.SQLException: An SQL data change is not permitted for a read-only connection, user or database.
31) ResultSetStreamTest:embeddedjava.sql.SQLException: An SQL data change is not permitted for a read-only connection, user or database.
32) ResultSetStreamTest:clientjava.sql.SQLException: An SQL data change is not permitted for a read-only connection, user or database.
33) InternationalConnectSimpleDSTest:embeddedjava.sql.SQLException: An SQL data change is not permitted for a read-only connection, user or database.
34) InternationalConnectSimpleDSTest:clientjava.sql.SQLException: An SQL data change is not permitted for a read-only connection, user or database.
35) Derby2017LayerATest:embeddedjava.sql.SQLException: An SQL data change is not permitted for a read-only connection, user or database.
36) Derby2017LayerATest:clientjava.sql.SQLException: An SQL data change is not permitted for a read-only connection, user or database.
37) connectionJdbc20(org.apache.derbyTesting.functionTests.tests.jdbcapi.JDBCHarnessJavaTest)java.sql.SQLException: An SQL data change is not permitte
d for a read-only connection, user or database.
38) resultsetJdbc20(org.apache.derbyTesting.functionTests.tests.jdbcapi.JDBCHarnessJavaTest)java.sql.SQLException: An SQL data change is not permitted
 for a read-only connection, user or database.
39) maxfieldsize(org.apache.derbyTesting.functionTests.tests.jdbcapi.JDBCHarnessJavaTest)java.sql.SQLException: An SQL data change is not permitted fo
r a read-only connection, user or database.
40) SetQueryTimeoutTest(org.apache.derbyTesting.functionTests.tests.jdbcapi.JDBCHarnessJavaTest)java.sql.SQLException: An SQL data change is not permi
tted for a read-only connection, user or database.
41) rsgetXXXcolumnNames(org.apache.derbyTesting.functionTests.tests.jdbcapi.JDBCHarnessJavaTest)java.sql.SQLException: An SQL data change is not permi
tted for a read-only connection, user or database.
42) connectionJdbc20(org.apache.derbyTesting.functionTests.tests.jdbcapi.JDBCHarnessJavaTest)java.sql.SQLException: An SQL data change is not permitte
d for a read-only connection, user or database.
43) resultsetJdbc20(org.apache.derbyTesting.functionTests.tests.jdbcapi.JDBCHarnessJavaTest)java.sql.SQLException: An SQL data change is not permitted
 for a read-only connection, user or database.
44) maxfieldsize(org.apache.derbyTesting.functionTests.tests.jdbcapi.JDBCHarnessJavaTest)java.sql.SQLException: An SQL data change is not permitted fo
r a read-only connection, user or database.
45) SetQueryTimeoutTest(org.apache.derbyTesting.functionTests.tests.jdbcapi.JDBCHarnessJavaTest)java.sql.SQLException: An SQL data change is not permi
tted for a read-only connection, user or database.
46) rsgetXXXcolumnNames(org.apache.derbyTesting.functionTests.tests.jdbcapi.JDBCHarnessJavaTest)java.sql.SQLException: An SQL data change is not permi
tted for a read-only connection, user or database.
47) ParameterMappingTest:embeddedjava.sql.SQLException: An SQL data change is not permitted for a read-only connection, user or database.
48) ParameterMappingTest:clientjava.sql.SQLException: An SQL data change is not permitted for a read-only connection, user or database.
49) DataSourcePropertiesTestjava.sql.SQLException: An SQL data change is not permitted for a read-only connection, user or database.
50) AutoGenJDBC30Test:embeddedjava.sql.SQLException: An SQL data change is not permitted for a read-only connection, user or database.
51) AutoGenJDBC30Test:clientjava.sql.SQLException: An SQL data change is not permitted for a read-only connection, user or database.

                
> 14 fixtures in the AuthenticationTest failed with nested error: ERROR 25502: An SQL data change is not permitted for a read-only connection, user or database.
> --------------------------------------------------------------------------------------------------------------------------------------------------------------
>
>                 Key: DERBY-5588
>                 URL: https://issues.apache.org/jira/browse/DERBY-5588
>             Project: Derby
>          Issue Type: Bug
>          Components: Test
>    Affects Versions: 10.9.0.0
>         Environment: failed in weme6.2 on windows against trunk, did not fail in any other ibm platform run against the same build:
> ------------------ Java Information ------------------
> Java Version:    WECE J2ME Foundation Specification v1.1
> Java Vendor:     IBM Corporation
> Java home:       d:\jartest\weme6.2
> Java classpath:  d:/jartest/jars/derbyrun.jar;d:/jartest/jars/derbyTesting.jar;d:/jartest/tools/java/jakarta-oro-2.0.8.jar;d:/jartest/junit/junit.jar;
> OS name:         Windows XP
> OS architecture: x86
> OS version:      5.1 build 2600 Service Pack 3
> Java user name:  cloudtest
> Java user home:  C:\Documents and Settings\cloudtest
> Java user dir:   D:\jartest\JarResults.2012-01-26\weme6.2_derbyall
> java.specification.name: J2ME Foundation Specification
> java.specification.version: 1.1
> java.runtime.version: 2.4
> java.fullversion: IBM J9 2.4 Windows XP x86-32  (JIT enabled, AOT enabled)
> J9VM - 20080919_023055_lHdFGQ
> JIT  - r9.weme62_20080724_2131
> GC   - 20080609_AA
> --------- Derby Information --------
> [D:\jartest\jars\derby.jar] 10.9.0.0 alpha - (1236495)
> [D:\jartest\jars\derbytools.jar] 10.9.0.0 alpha - (1236495)
> [D:\jartest\jars\derbynet.jar] 10.9.0.0 alpha - (1236495)
> [D:\jartest\jars\derbyclient.jar] 10.9.0.0 alpha - (1236495)
> ------------------------------------------------------
> ----------------- Locale Information -----------------
> Current Locale :  [English/United States [en_US]]
> Found support for locale: [cs]
> 	 version: 10.9.0.0 alpha - (1236495)
> Found support for locale: [de_DE]
> 	 version: 10.9.0.0 alpha - (1236495)
> Found support for locale: [es]
> 	 version: 10.9.0.0 alpha - (1236495)
> Found support for locale: [fr]
> 	 version: 10.9.0.0 alpha - (1236495)
> Found support for locale: [hu]
> 	 version: 10.9.0.0 alpha - (1236495)
> Found support for locale: [it]
> 	 version: 10.9.0.0 alpha - (1236495)
> Found support for locale: [ja_JP]
> 	 version: 10.9.0.0 alpha - (1236495)
> Found support for locale: [ko_KR]
> 	 version: 10.9.0.0 alpha - (1236495)
> Found support for locale: [pl]
> 	 version: 10.9.0.0 alpha - (1236495)
> Found support for locale: [pt_BR]
> 	 version: 10.9.0.0 alpha - (1236495)
> Found support for locale: [ru]
> 	 version: 10.9.0.0 alpha - (1236495)
> Found support for locale: [zh_CN]
> 	 version: 10.9.0.0 alpha - (1236495)
> Found support for locale: [zh_TW]
> 	 version: 10.9.0.0 alpha - (1236495)
>            Reporter: Mike Matrigali
>
> got 14 errors in the nightly runs in AuthenticationTest fixtures in weme6.2 on windows against trunk:
> http://people.apache.org/~myrnavl/derby_test_results/main/windows/testlog/weme6.2/1236495-suites.All_diff.txt
> There were 14 errors:
> 1) testUserFunctions(org.apache.derbyTesting.functionTests.tests.jdbcapi.AuthenticationTest)java.sql.SQLException: An SQL data change is not permitted for a read-only connection, user or database.
> 	at org.apache.derby.impl.jdbc.SQLExceptionFactory.getSQLException(Unknown Source)
> 	at org.apache.derby.impl.jdbc.Util.generateCsSQLException(Unknown Source)
> 	at org.apache.derby.impl.jdbc.TransactionResourceImpl.wrapInSQLException(Unknown Source)
> 	at org.apache.derby.impl.jdbc.TransactionResourceImpl.handleException(Unknown Source)
> 	at org.apache.derby.impl.jdbc.EmbedConnection.handleException(Unknown Source)
> 	at org.apache.derby.impl.jdbc.ConnectionChild.handleException(Unknown Source)
> 	at org.apache.derby.impl.jdbc.EmbedStatement.executeStatement(Unknown Source)
> 	at org.apache.derby.impl.jdbc.EmbedPreparedStatement.executeStatement(Unknown Source)
> 	at org.apache.derby.impl.jdbc.EmbedCallableStatement.executeStatement(Unknown Source)
> 	at org.apache.derby.impl.jdbc.EmbedPreparedStatement.executeUpdate(Unknown Source)
> 	at org.apache.derbyTesting.junit.DatabasePropertyTestSetup.setProperties(DatabasePropertyTestSetup.java:352)
> 	at org.apache.derbyTesting.junit.DatabasePropertyTestSetup.setUp(DatabasePropertyTestSetup.java:268)
> 	at junit.extensions.TestSetup$1.protect(TestSetup.java:20)
> 	at junit.extensions.TestSetup.run(TestSetup.java:25)
> 	at org.apache.derbyTesting.junit.BaseTestSetup.run(BaseTestSetup.java:57)
> 	at junit.extensions.TestDecorator.basicRun(TestDecorator.java:24)
> 	at junit.extensions.TestSetup$1.protect(TestSetup.java:21)
> 	at junit.extensions.TestSetup.run(TestSetup.java:25)
> 	at org.apache.derbyTesting.junit.BaseTestSetup.run(BaseTestSetup.java:57)
> 	at junit.extensions.TestDecorator.basicRun(TestDecorator.java:24)
> 	at junit.extensions.TestSetup$1.protect(TestSetup.java:21)
> 	at junit.extensions.TestSetup.run(TestSetup.java:25)
> 	at junit.extensions.TestDecorator.basicRun(TestDecorator.java:24)
> 	at junit.extensions.TestSetup$1.protect(TestSetup.java:21)
> 	at junit.extensions.TestSetup.run(TestSetup.java:25)
> 	at org.apache.derbyTesting.junit.BaseTestSetup.run(BaseTestSetup.java:57)
> 	at junit.extensions.TestDecorator.basicRun(TestDecorator.java:24)
> 	at junit.extensions.TestSetup$1.protect(TestSetup.java:21)
> 	at junit.extensions.TestSetup.run(TestSetup.java:25)
> Caused by: ERROR 25502: An SQL data change is not permitted for a read-only connection, user or database.
> 	at org.apache.derby.iapi.error.StandardException.newException(Unknown Source)
> 	at org.apache.derby.impl.sql.conn.GenericAuthorizer.authorize(Unknown Source)
> 	at org.apache.derby.exe.ac2faf0139x0135x1df2x9281xffffc03e58d61.g0(Unknown Source)
> 	at java.lang.reflect.AccessibleObject.invokeV(AccessibleObject.java:195)
> 	at org.apache.derby.impl.services.reflect.ReflectMethod.invoke(Unknown Source)
> 	at org.apache.derby.impl.sql.execute.CallStatementResultSet.open(Unknown Source)
> 	at org.apache.derby.impl.sql.GenericPreparedStatement.executeStmt(Unknown Source)
> 	at org.apache.derby.impl.sql.GenericPreparedStatement.execute(Unknown Source)
> 	... 41 more
> 2) testUserFunctions(org.apache.derbyTesting.functionTests.tests.jdbcapi.AuthenticationTest)java.sql.SQLException: An SQL data change is not permitted for a read-only connection, user or database.
> 	at org.apache.derby.impl.jdbc.SQLExceptionFactory.getSQLException(Unknown Source)
> 	at org.apache.derby.impl.jdbc.Util.generateCsSQLException(Unknown Source)
> 	at org.apache.derby.impl.jdbc.TransactionResourceImpl.wrapInSQLException(Unknown Source)
> 	at org.apache.derby.impl.jdbc.TransactionResourceImpl.handleException(Unknown Source)
> 	at org.apache.derby.impl.jdbc.EmbedConnection.handleException(Unknown Source)
> 	at org.apache.derby.impl.jdbc.ConnectionChild.handleException(Unknown Source)
> 	at org.apache.derby.impl.jdbc.EmbedStatement.executeStatement(Unknown Source)
> 	at org.apache.derby.impl.jdbc.EmbedPreparedStatement.executeStatement(Unknown Source)
> 	at org.apache.derby.impl.jdbc.EmbedCallableStatement.executeStatement(Unknown Source)
> 	at org.apache.derby.impl.jdbc.EmbedPreparedStatement.executeUpdate(Unknown Source)
> 	at org.apache.derbyTesting.junit.DatabasePropertyTestSetup.tearDown(DatabasePropertyTestSetup.java:294)
> 	at junit.extensions.TestSetup$1.protect(TestSetup.java:22)
> 	at junit.extensions.TestSetup.run(TestSetup.java:25)
> 	at org.apache.derbyTesting.junit.BaseTestSetup.run(BaseTestSetup.java:57)
> 	at junit.extensions.TestDecorator.basicRun(TestDecorator.java:24)
> 	at junit.extensions.TestSetup$1.protect(TestSetup.java:21)
> 	at junit.extensions.TestSetup.run(TestSetup.java:25)
> 	at junit.extensions.TestDecorator.basicRun(TestDecorator.java:24)
> 	at junit.extensions.TestSetup$1.protect(TestSetup.java:21)
> 	at junit.extensions.TestSetup.run(TestSetup.java:25)
> 	at org.apache.derbyTesting.junit.BaseTestSetup.run(BaseTestSetup.java:57)
> 	at junit.extensions.TestDecorator.basicRun(TestDecorator.java:24)
> 	at junit.extensions.TestSetup$1.protect(TestSetup.java:21)
> 	at junit.extensions.TestSetup.run(TestSetup.java:25)
> Caused by: ERROR 25502: An SQL data change is not permitted for a read-only connection, user or database.
> 	at org.apache.derby.iapi.error.StandardException.newException(Unknown Source)
> 	at org.apache.derby.impl.sql.conn.GenericAuthorizer.authorize(Unknown Source)
> 	at org.apache.derby.exe.ac5938c13ex0135x1df2x9281xffffc03e58d60.g0(Unknown Source)
> 	at java.lang.reflect.AccessibleObject.invokeV(AccessibleObject.java:195)
> 	at org.apache.derby.impl.services.reflect.ReflectMethod.invoke(Unknown Source)
> 	at org.apache.derby.impl.sql.execute.CallStatementResultSet.open(Unknown Source)
> 	at org.apache.derby.impl.sql.GenericPreparedStatement.executeStmt(Unknown Source)
> 	at org.apache.derby.impl.sql.GenericPreparedStatement.execute(Unknown Source)
> 	... 35 more
> 3) testNotFullAccessUsers(org.apache.derbyTesting.functionTests.tests.jdbcapi.AuthenticationTest)java.sql.SQLException: An SQL data change is not permitted for a read-only connection, user or database.
> 	at org.apache.derby.impl.jdbc.SQLExceptionFactory.getSQLException(Unknown Source)
> 	at org.apache.derby.impl.jdbc.Util.generateCsSQLException(Unknown Source)
> 	at org.apache.derby.impl.jdbc.TransactionResourceImpl.wrapInSQLException(Unknown Source)
> 	at org.apache.derby.impl.jdbc.TransactionResourceImpl.handleException(Unknown Source)
> 	at org.apache.derby.impl.jdbc.EmbedConnection.handleException(Unknown Source)
> 	at org.apache.derby.impl.jdbc.ConnectionChild.handleException(Unknown Source)
> 	at org.apache.derby.impl.jdbc.EmbedStatement.executeStatement(Unknown Source)
> 	at org.apache.derby.impl.jdbc.EmbedPreparedStatement.executeStatement(Unknown Source)
> 	at org.apache.derby.impl.jdbc.EmbedCallableStatement.executeStatement(Unknown Source)
> 	at org.apache.derby.impl.jdbc.EmbedPreparedStatement.executeUpdate(Unknown Source)
> 	at org.apache.derbyTesting.junit.DatabasePropertyTestSetup.setProperties(DatabasePropertyTestSetup.java:352)
> 	at org.apache.derbyTesting.junit.DatabasePropertyTestSetup.setUp(DatabasePropertyTestSetup.java:268)
> 	at junit.extensions.TestSetup$1.protect(TestSetup.java:20)
> 	at junit.extensions.TestSetup.run(TestSetup.java:25)
> 	at org.apache.derbyTesting.junit.BaseTestSetup.run(BaseTestSetup.java:57)
> 	at junit.extensions.TestDecorator.basicRun(TestDecorator.java:24)
> 	at junit.extensions.TestSetup$1.protect(TestSetup.java:21)
> 	at junit.extensions.TestSetup.run(TestSetup.java:25)
> 	at org.apache.derbyTesting.junit.BaseTestSetup.run(BaseTestSetup.java:57)
> 	at junit.extensions.TestDecorator.basicRun(TestDecorator.java:24)
> 	at junit.extensions.TestSetup$1.protect(TestSetup.java:21)
> 	at junit.extensions.TestSetup.run(TestSetup.java:25)
> 	at junit.extensions.TestDecorator.basicRun(TestDecorator.java:24)
> 	at junit.extensions.TestSetup$1.protect(TestSetup.java:21)
> 	at junit.extensions.TestSetup.run(TestSetup.java:25)
> 	at org.apache.derbyTesting.junit.BaseTestSetup.run(BaseTestSetup.java:57)
> 	at junit.extensions.TestDecorator.basicRun(TestDecorator.java:24)
> 	at junit.extensions.TestSetup$1.protect(TestSetup.java:21)
> 	at junit.extensions.TestSetup.run(TestSetup.java:25)
> Caused by: ERROR 25502: An SQL data change is not permitted for a read-only connection, user or database.
> 	at org.apache.derby.iapi.error.StandardException.newException(Unknown Source)
> 	at org.apache.derby.impl.sql.conn.GenericAuthorizer.authorize(Unknown Source)
> 	at org.apache.derby.exe.ac0b198144x0135x1df2x9281xffffc03e58d61.g0(Unknown Source)
> 	at java.lang.reflect.AccessibleObject.invokeV(AccessibleObject.java:195)
> 	at org.apache.derby.impl.services.reflect.ReflectMethod.invoke(Unknown Source)
> 	at org.apache.derby.impl.sql.execute.CallStatementResultSet.open(Unknown Source)
> 	at org.apache.derby.impl.sql.GenericPreparedStatement.executeStmt(Unknown Source)
> 	at org.apache.derby.impl.sql.GenericPreparedStatement.execute(Unknown Source)
> 	... 41 more
> 4) testNotFullAccessUsers(org.apache.derbyTesting.functionTests.tests.jdbcapi.AuthenticationTest)java.sql.SQLException: An SQL data change is not permitted for a read-only connection, user or database.
> 	at org.apache.derby.impl.jdbc.SQLExceptionFactory.getSQLException(Unknown Source)
> 	at org.apache.derby.impl.jdbc.Util.generateCsSQLException(Unknown Source)
> 	at org.apache.derby.impl.jdbc.TransactionResourceImpl.wrapInSQLException(Unknown Source)
> 	at org.apache.derby.impl.jdbc.TransactionResourceImpl.handleException(Unknown Source)
> 	at org.apache.derby.impl.jdbc.EmbedConnection.handleException(Unknown Source)
> 	at org.apache.derby.impl.jdbc.ConnectionChild.handleException(Unknown Source)
> 	at org.apache.derby.impl.jdbc.EmbedStatement.executeStatement(Unknown Source)
> 	at org.apache.derby.impl.jdbc.EmbedPreparedStatement.executeStatement(Unknown Source)
> 	at org.apache.derby.impl.jdbc.EmbedCallableStatement.executeStatement(Unknown Source)
> 	at org.apache.derby.impl.jdbc.EmbedPreparedStatement.executeUpdate(Unknown Source)
> 	at org.apache.derbyTesting.junit.DatabasePropertyTestSetup.tearDown(DatabasePropertyTestSetup.java:294)
> 	at junit.extensions.TestSetup$1.protect(TestSetup.java:22)
> 	at junit.extensions.TestSetup.run(TestSetup.java:25)
> 	at org.apache.derbyTesting.junit.BaseTestSetup.run(BaseTestSetup.java:57)
> 	at junit.extensions.TestDecorator.basicRun(TestDecorator.java:24)
> 	at junit.extensions.TestSetup$1.protect(TestSetup.java:21)
> 	at junit.extensions.TestSetup.run(TestSetup.java:25)
> 	at junit.extensions.TestDecorator.basicRun(TestDecorator.java:24)
> 	at junit.extensions.TestSetup$1.protect(TestSetup.java:21)
> 	at junit.extensions.TestSetup.run(TestSetup.java:25)
> 	at org.apache.derbyTesting.junit.BaseTestSetup.run(BaseTestSetup.java:57)
> 	at junit.extensions.TestDecorator.basicRun(TestDecorator.java:24)
> 	at junit.extensions.TestSetup$1.protect(TestSetup.java:21)
> 	at junit.extensions.TestSetup.run(TestSetup.java:25)
> Caused by: ERROR 25502: An SQL data change is not permitted for a read-only connection, user or database.
> 	at org.apache.derby.iapi.error.StandardException.newException(Unknown Source)
> 	at org.apache.derby.impl.sql.conn.GenericAuthorizer.authorize(Unknown Source)
> 	at org.apache.derby.exe.ac34b10149x0135x1df2x9281xffffc03e58d60.g0(Unknown Source)
> 	at java.lang.reflect.AccessibleObject.invokeV(AccessibleObject.java:195)
> 	at org.apache.derby.impl.services.reflect.ReflectMethod.invoke(Unknown Source)
> 	at org.apache.derby.impl.sql.execute.CallStatementResultSet.open(Unknown Source)
> 	at org.apache.derby.impl.sql.GenericPreparedStatement.executeStmt(Unknown Source)
> 	at org.apache.derby.impl.sql.GenericPreparedStatement.execute(Unknown Source)
> 	... 35 more
> 5) testUserAccessRoutines(org.apache.derbyTesting.functionTests.tests.jdbcapi.AuthenticationTest)java.sql.SQLException: An SQL data change is not permitted for a read-only connection, user or database.
> 	at org.apache.derby.impl.jdbc.SQLExceptionFactory.getSQLException(Unknown Source)
> 	at org.apache.derby.impl.jdbc.Util.generateCsSQLException(Unknown Source)
> 	at org.apache.derby.impl.jdbc.TransactionResourceImpl.wrapInSQLException(Unknown Source)
> 	at org.apache.derby.impl.jdbc.TransactionResourceImpl.handleException(Unknown Source)
> 	at org.apache.derby.impl.jdbc.EmbedConnection.handleException(Unknown Source)
> 	at org.apache.derby.impl.jdbc.ConnectionChild.handleException(Unknown Source)
> 	at org.apache.derby.impl.jdbc.EmbedStatement.executeStatement(Unknown Source)
> 	at org.apache.derby.impl.jdbc.EmbedPreparedStatement.executeStatement(Unknown Source)
> 	at org.apache.derby.impl.jdbc.EmbedCallableStatement.executeStatement(Unknown Source)
> 	at org.apache.derby.impl.jdbc.EmbedPreparedStatement.executeUpdate(Unknown Source)
> 	at org.apache.derbyTesting.junit.DatabasePropertyTestSetup.setProperties(DatabasePropertyTestSetup.java:352)
> 	at org.apache.derbyTesting.junit.DatabasePropertyTestSetup.setUp(DatabasePropertyTestSetup.java:268)
> 	at junit.extensions.TestSetup$1.protect(TestSetup.java:20)
> 	at junit.extensions.TestSetup.run(TestSetup.java:25)
> 	at org.apache.derbyTesting.junit.BaseTestSetup.run(BaseTestSetup.java:57)
> 	at junit.extensions.TestDecorator.basicRun(TestDecorator.java:24)
> 	at junit.extensions.TestSetup$1.protect(TestSetup.java:21)
> 	at junit.extensions.TestSetup.run(TestSetup.java:25)
> 	at org.apache.derbyTesting.junit.BaseTestSetup.run(BaseTestSetup.java:57)
> 	at junit.extensions.TestDecorator.basicRun(TestDecorator.java:24)
> 	at junit.extensions.TestSetup$1.protect(TestSetup.java:21)
> 	at junit.extensions.TestSetup.run(TestSetup.java:25)
> 	at junit.extensions.TestDecorator.basicRun(TestDecorator.java:24)
> 	at junit.extensions.TestSetup$1.protect(TestSetup.java:21)
> 	at junit.extensions.TestSetup.run(TestSetup.java:25)
> 	at org.apache.derbyTesting.junit.BaseTestSetup.run(BaseTestSetup.java:57)
> 	at junit.extensions.TestDecorator.basicRun(TestDecorator.java:24)
> 	at junit.extensions.TestSetup$1.protect(TestSetup.java:21)
> 	at junit.extensions.TestSetup.run(TestSetup.java:25)
> Caused by: ERROR 25502: An SQL data change is not permitted for a read-only connection, user or database.
> 	at org.apache.derby.iapi.error.StandardException.newException(Unknown Source)
> 	at org.apache.derby.impl.sql.conn.GenericAuthorizer.authorize(Unknown Source)
> 	at org.apache.derby.exe.ac96a2414fx0135x1df2x9281xffffc03e58d61.g0(Unknown Source)
> 	at java.lang.reflect.AccessibleObject.invokeV(AccessibleObject.java:195)
> 	at org.apache.derby.impl.services.reflect.ReflectMethod.invoke(Unknown Source)
> 	at org.apache.derby.impl.sql.execute.CallStatementResultSet.open(Unknown Source)
> 	at org.apache.derby.impl.sql.GenericPreparedStatement.executeStmt(Unknown Source)
> 	at org.apache.derby.impl.sql.GenericPreparedStatement.execute(Unknown Source)
> 	... 41 more
> 6) testUserAccessRoutines(org.apache.derbyTesting.functionTests.tests.jdbcapi.AuthenticationTest)java.sql.SQLException: An SQL data change is not permitted for a read-only connection, user or database.
> 	at org.apache.derby.impl.jdbc.SQLExceptionFactory.getSQLException(Unknown Source)
> 	at org.apache.derby.impl.jdbc.Util.generateCsSQLException(Unknown Source)
> 	at org.apache.derby.impl.jdbc.TransactionResourceImpl.wrapInSQLException(Unknown Source)
> 	at org.apache.derby.impl.jdbc.TransactionResourceImpl.handleException(Unknown Source)
> 	at org.apache.derby.impl.jdbc.EmbedConnection.handleException(Unknown Source)
> 	at org.apache.derby.impl.jdbc.ConnectionChild.handleException(Unknown Source)
> 	at org.apache.derby.impl.jdbc.EmbedStatement.executeStatement(Unknown Source)
> 	at org.apache.derby.impl.jdbc.EmbedPreparedStatement.executeStatement(Unknown Source)
> 	at org.apache.derby.impl.jdbc.EmbedCallableStatement.executeStatement(Unknown Source)
> 	at org.apache.derby.impl.jdbc.EmbedPreparedStatement.executeUpdate(Unknown Source)
> 	at org.apache.derbyTesting.junit.DatabasePropertyTestSetup.tearDown(DatabasePropertyTestSetup.java:294)
> 	at junit.extensions.TestSetup$1.protect(TestSetup.java:22)
> 	at junit.extensions.TestSetup.run(TestSetup.java:25)
> 	at org.apache.derbyTesting.junit.BaseTestSetup.run(BaseTestSetup.java:57)
> 	at junit.extensions.TestDecorator.basicRun(TestDecorator.java:24)
> 	at junit.extensions.TestSetup$1.protect(TestSetup.java:21)
> 	at junit.extensions.TestSetup.run(TestSetup.java:25)
> 	at junit.extensions.TestDecorator.basicRun(TestDecorator.java:24)
> 	at junit.extensions.TestSetup$1.protect(TestSetup.java:21)
> 	at junit.extensions.TestSetup.run(TestSetup.java:25)
> 	at org.apache.derbyTesting.junit.BaseTestSetup.run(BaseTestSetup.java:57)
> 	at junit.extensions.TestDecorator.basicRun(TestDecorator.java:24)
> 	at junit.extensions.TestSetup$1.protect(TestSetup.java:21)
> 	at junit.extensions.TestSetup.run(TestSetup.java:25)
> Caused by: ERROR 25502: An SQL data change is not permitted for a read-only connection, user or database.
> 	at org.apache.derby.iapi.error.StandardException.newException(Unknown Source)
> 	at org.apache.derby.impl.sql.conn.GenericAuthorizer.authorize(Unknown Source)
> 	at org.apache.derby.exe.ac90478154x0135x1df2x9281xffffc03e58d60.g0(Unknown Source)
> 	at java.lang.reflect.AccessibleObject.invokeV(AccessibleObject.java:195)
> 	at org.apache.derby.impl.services.reflect.ReflectMethod.invoke(Unknown Source)
> 	at org.apache.derby.impl.sql.execute.CallStatementResultSet.open(Unknown Source)
> 	at org.apache.derby.impl.sql.GenericPreparedStatement.executeStmt(Unknown Source)
> 	at org.apache.derby.impl.sql.GenericPreparedStatement.execute(Unknown Source)
> 	... 35 more
> 7) testChangePasswordAndDatabasePropertiesOnly(org.apache.derbyTesting.functionTests.tests.jdbcapi.AuthenticationTest)java.sql.SQLException: An SQL data change is not permitted for a read-only connection, user or database.
> 	at org.apache.derby.impl.jdbc.SQLExceptionFactory.getSQLException(Unknown Source)
> 	at org.apache.derby.impl.jdbc.Util.generateCsSQLException(Unknown Source)
> 	at org.apache.derby.impl.jdbc.TransactionResourceImpl.wrapInSQLException(Unknown Source)
> 	at org.apache.derby.impl.jdbc.TransactionResourceImpl.handleException(Unknown Source)
> 	at org.apache.derby.impl.jdbc.EmbedConnection.handleException(Unknown Source)
> 	at org.apache.derby.impl.jdbc.ConnectionChild.handleException(Unknown Source)
> 	at org.apache.derby.impl.jdbc.EmbedStatement.executeStatement(Unknown Source)
> 	at org.apache.derby.impl.jdbc.EmbedPreparedStatement.executeStatement(Unknown Source)
> 	at org.apache.derby.impl.jdbc.EmbedCallableStatement.executeStatement(Unknown Source)
> 	at org.apache.derby.impl.jdbc.EmbedPreparedStatement.executeUpdate(Unknown Source)
> 	at org.apache.derbyTesting.junit.DatabasePropertyTestSetup.setProperties(DatabasePropertyTestSetup.java:352)
> 	at org.apache.derbyTesting.junit.DatabasePropertyTestSetup.setUp(DatabasePropertyTestSetup.java:268)
> 	at junit.extensions.TestSetup$1.protect(TestSetup.java:20)
> 	at junit.extensions.TestSetup.run(TestSetup.java:25)
> 	at org.apache.derbyTesting.junit.BaseTestSetup.run(BaseTestSetup.java:57)
> 	at junit.extensions.TestDecorator.basicRun(TestDecorator.java:24)
> 	at junit.extensions.TestSetup$1.protect(TestSetup.java:21)
> 	at junit.extensions.TestSetup.run(TestSetup.java:25)
> 	at org.apache.derbyTesting.junit.BaseTestSetup.run(BaseTestSetup.java:57)
> 	at junit.extensions.TestDecorator.basicRun(TestDecorator.java:24)
> 	at junit.extensions.TestSetup$1.protect(TestSetup.java:21)
> 	at junit.extensions.TestSetup.run(TestSetup.java:25)
> 	at junit.extensions.TestDecorator.basicRun(TestDecorator.java:24)
> 	at junit.extensions.TestSetup$1.protect(TestSetup.java:21)
> 	at junit.extensions.TestSetup.run(TestSetup.java:25)
> 	at org.apache.derbyTesting.junit.BaseTestSetup.run(BaseTestSetup.java:57)
> 	at junit.extensions.TestDecorator.basicRun(TestDecorator.java:24)
> 	at junit.extensions.TestSetup$1.protect(TestSetup.java:21)
> 	at junit.extensions.TestSetup.run(TestSetup.java:25)
> Caused by: ERROR 25502: An SQL data change is not permitted for a read-only connection, user or database.
> 	at org.apache.derby.iapi.error.StandardException.newException(Unknown Source)
> 	at org.apache.derby.impl.sql.conn.GenericAuthorizer.authorize(Unknown Source)
> 	at org.apache.derby.exe.ac0249415ax0135x1df2x9281xffffc03e58d61.g0(Unknown Source)
> 	at java.lang.reflect.AccessibleObject.invokeV(AccessibleObject.java:195)
> 	at org.apache.derby.impl.services.reflect.ReflectMethod.invoke(Unknown Source)
> 	at org.apache.derby.impl.sql.execute.CallStatementResultSet.open(Unknown Source)
> 	at org.apache.derby.impl.sql.GenericPreparedStatement.executeStmt(Unknown Source)
> 	at org.apache.derby.impl.sql.GenericPreparedStatement.execute(Unknown Source)
> 	... 41 more
> 8) testChangePasswordAndDatabasePropertiesOnly(org.apache.derbyTesting.functionTests.tests.jdbcapi.AuthenticationTest)java.sql.SQLException: An SQL data change is not permitted for a read-only connection, user or database.
> 	at org.apache.derby.impl.jdbc.SQLExceptionFactory.getSQLException(Unknown Source)
> 	at org.apache.derby.impl.jdbc.Util.generateCsSQLException(Unknown Source)
> 	at org.apache.derby.impl.jdbc.TransactionResourceImpl.wrapInSQLException(Unknown Source)
> 	at org.apache.derby.impl.jdbc.TransactionResourceImpl.handleException(Unknown Source)
> 	at org.apache.derby.impl.jdbc.EmbedConnection.handleException(Unknown Source)
> 	at org.apache.derby.impl.jdbc.ConnectionChild.handleException(Unknown Source)
> 	at org.apache.derby.impl.jdbc.EmbedStatement.executeStatement(Unknown Source)
> 	at org.apache.derby.impl.jdbc.EmbedPreparedStatement.executeStatement(Unknown Source)
> 	at org.apache.derby.impl.jdbc.EmbedCallableStatement.executeStatement(Unknown Source)
> 	at org.apache.derby.impl.jdbc.EmbedPreparedStatement.executeUpdate(Unknown Source)
> 	at org.apache.derbyTesting.junit.DatabasePropertyTestSetup.tearDown(DatabasePropertyTestSetup.java:294)
> 	at junit.extensions.TestSetup$1.protect(TestSetup.java:22)
> 	at junit.extensions.TestSetup.run(TestSetup.java:25)
> 	at org.apache.derbyTesting.junit.BaseTestSetup.run(BaseTestSetup.java:57)
> 	at junit.extensions.TestDecorator.basicRun(TestDecorator.java:24)
> 	at junit.extensions.TestSetup$1.protect(TestSetup.java:21)
> 	at junit.extensions.TestSetup.run(TestSetup.java:25)
> 	at junit.extensions.TestDecorator.basicRun(TestDecorator.java:24)
> 	at junit.extensions.TestSetup$1.protect(TestSetup.java:21)
> 	at junit.extensions.TestSetup.run(TestSetup.java:25)
> 	at org.apache.derbyTesting.junit.BaseTestSetup.run(BaseTestSetup.java:57)
> 	at junit.extensions.TestDecorator.basicRun(TestDecorator.java:24)
> 	at junit.extensions.TestSetup$1.protect(TestSetup.java:21)
> 	at junit.extensions.TestSetup.run(TestSetup.java:25)
> Caused by: ERROR 25502: An SQL data change is not permitted for a read-only connection, user or database.
> 	at org.apache.derby.iapi.error.StandardException.newException(Unknown Source)
> 	at org.apache.derby.impl.sql.conn.GenericAuthorizer.authorize(Unknown Source)
> 	at org.apache.derby.exe.ac9bfc415fx0135x1df2x9281xffffc03e58d60.g0(Unknown Source)
> 	at java.lang.reflect.AccessibleObject.invokeV(AccessibleObject.java:195)
> 	at org.apache.derby.impl.services.reflect.ReflectMethod.invoke(Unknown Source)
> 	at org.apache.derby.impl.sql.execute.CallStatementResultSet.open(Unknown Source)
> 	at org.apache.derby.impl.sql.GenericPreparedStatement.executeStmt(Unknown Source)
> 	at org.apache.derby.impl.sql.GenericPreparedStatement.execute(Unknown Source)
> 	... 35 more
> 9) testGreekCharacters(org.apache.derbyTesting.functionTests.tests.jdbcapi.AuthenticationTest)java.sql.SQLException: An SQL data change is not permitted for a read-only connection, user or database.
> 	at org.apache.derby.impl.jdbc.SQLExceptionFactory.getSQLException(Unknown Source)
> 	at org.apache.derby.impl.jdbc.Util.generateCsSQLException(Unknown Source)
> 	at org.apache.derby.impl.jdbc.TransactionResourceImpl.wrapInSQLException(Unknown Source)
> 	at org.apache.derby.impl.jdbc.TransactionResourceImpl.handleException(Unknown Source)
> 	at org.apache.derby.impl.jdbc.EmbedConnection.handleException(Unknown Source)
> 	at org.apache.derby.impl.jdbc.ConnectionChild.handleException(Unknown Source)
> 	at org.apache.derby.impl.jdbc.EmbedStatement.executeStatement(Unknown Source)
> 	at org.apache.derby.impl.jdbc.EmbedPreparedStatement.executeStatement(Unknown Source)
> 	at org.apache.derby.impl.jdbc.EmbedCallableStatement.executeStatement(Unknown Source)
> 	at org.apache.derby.impl.jdbc.EmbedPreparedStatement.executeUpdate(Unknown Source)
> 	at org.apache.derbyTesting.junit.DatabasePropertyTestSetup.setProperties(DatabasePropertyTestSetup.java:352)
> 	at org.apache.derbyTesting.junit.DatabasePropertyTestSetup.setUp(DatabasePropertyTestSetup.java:268)
> 	at junit.extensions.TestSetup$1.protect(TestSetup.java:20)
> 	at junit.extensions.TestSetup.run(TestSetup.java:25)
> 	at org.apache.derbyTesting.junit.BaseTestSetup.run(BaseTestSetup.java:57)
> 	at junit.extensions.TestDecorator.basicRun(TestDecorator.java:24)
> 	at junit.extensions.TestSetup$1.protect(TestSetup.java:21)
> 	at junit.extensions.TestSetup.run(TestSetup.java:25)
> 	at org.apache.derbyTesting.junit.BaseTestSetup.run(BaseTestSetup.java:57)
> 	at junit.extensions.TestDecorator.basicRun(TestDecorator.java:24)
> 	at junit.extensions.TestSetup$1.protect(TestSetup.java:21)
> 	at junit.extensions.TestSetup.run(TestSetup.java:25)
> 	at junit.extensions.TestDecorator.basicRun(TestDecorator.java:24)
> 	at junit.extensions.TestSetup$1.protect(TestSetup.java:21)
> 	at junit.extensions.TestSetup.run(TestSetup.java:25)
> 	at org.apache.derbyTesting.junit.BaseTestSetup.run(BaseTestSetup.java:57)
> 	at junit.extensions.TestDecorator.basicRun(TestDecorator.java:24)
> 	at junit.extensions.TestSetup$1.protect(TestSetup.java:21)
> 	at junit.extensions.TestSetup.run(TestSetup.java:25)
> Caused by: ERROR 25502: An SQL data change is not permitted for a read-only connection, user or database.
> 	at org.apache.derby.iapi.error.StandardException.newException(Unknown Source)
> 	at org.apache.derby.impl.sql.conn.GenericAuthorizer.authorize(Unknown Source)
> 	at org.apache.derby.exe.ac7e0e8165x0135x1df2x9281xffffc03e58d61.g0(Unknown Source)
> 	at java.lang.reflect.AccessibleObject.invokeV(AccessibleObject.java:195)
> 	at org.apache.derby.impl.services.reflect.ReflectMethod.invoke(Unknown Source)
> 	at org.apache.derby.impl.sql.execute.CallStatementResultSet.open(Unknown Source)
> 	at org.apache.derby.impl.sql.GenericPreparedStatement.executeStmt(Unknown Source)
> 	at org.apache.derby.impl.sql.GenericPreparedStatement.execute(Unknown Source)
> 	... 41 more
> 10) testGreekCharacters(org.apache.derbyTesting.functionTests.tests.jdbcapi.AuthenticationTest)java.sql.SQLException: An SQL data change is not permitted for a read-only connection, user or database.
> 	at org.apache.derby.impl.jdbc.SQLExceptionFactory.getSQLException(Unknown Source)
> 	at org.apache.derby.impl.jdbc.Util.generateCsSQLException(Unknown Source)
> 	at org.apache.derby.impl.jdbc.TransactionResourceImpl.wrapInSQLException(Unknown Source)
> 	at org.apache.derby.impl.jdbc.TransactionResourceImpl.handleException(Unknown Source)
> 	at org.apache.derby.impl.jdbc.EmbedConnection.handleException(Unknown Source)
> 	at org.apache.derby.impl.jdbc.ConnectionChild.handleException(Unknown Source)
> 	at org.apache.derby.impl.jdbc.EmbedStatement.executeStatement(Unknown Source)
> 	at org.apache.derby.impl.jdbc.EmbedPreparedStatement.executeStatement(Unknown Source)
> 	at org.apache.derby.impl.jdbc.EmbedCallableStatement.executeStatement(Unknown Source)
> 	at org.apache.derby.impl.jdbc.EmbedPreparedStatement.executeUpdate(Unknown Source)
> 	at org.apache.derbyTesting.junit.DatabasePropertyTestSetup.tearDown(DatabasePropertyTestSetup.java:294)
> 	at junit.extensions.TestSetup$1.protect(TestSetup.java:22)
> 	at junit.extensions.TestSetup.run(TestSetup.java:25)
> 	at org.apache.derbyTesting.junit.BaseTestSetup.run(BaseTestSetup.java:57)
> 	at junit.extensions.TestDecorator.basicRun(TestDecorator.java:24)
> 	at junit.extensions.TestSetup$1.protect(TestSetup.java:21)
> 	at junit.extensions.TestSetup.run(TestSetup.java:25)
> 	at junit.extensions.TestDecorator.basicRun(TestDecorator.java:24)
> 	at junit.extensions.TestSetup$1.protect(TestSetup.java:21)
> 	at junit.extensions.TestSetup.run(TestSetup.java:25)
> 	at org.apache.derbyTesting.junit.BaseTestSetup.run(BaseTestSetup.java:57)
> 	at junit.extensions.TestDecorator.basicRun(TestDecorator.java:24)
> 	at junit.extensions.TestSetup$1.protect(TestSetup.java:21)
> 	at junit.extensions.TestSetup.run(TestSetup.java:25)
> Caused by: ERROR 25502: An SQL data change is not permitted for a read-only connection, user or database.
> 	at org.apache.derby.iapi.error.StandardException.newException(Unknown Source)
> 	at org.apache.derby.impl.sql.conn.GenericAuthorizer.authorize(Unknown Source)
> 	at org.apache.derby.exe.ac87cf416ax0135x1df2x9281xffffc03e58d60.g0(Unknown Source)
> 	at java.lang.reflect.AccessibleObject.invokeV(AccessibleObject.java:195)
> 	at org.apache.derby.impl.services.reflect.ReflectMethod.invoke(Unknown Source)
> 	at org.apache.derby.impl.sql.execute.CallStatementResultSet.open(Unknown Source)
> 	at org.apache.derby.impl.sql.GenericPreparedStatement.executeStmt(Unknown Source)
> 	at org.apache.derby.impl.sql.GenericPreparedStatement.execute(Unknown Source)
> 	... 35 more
> 11) testSystemShutdown(org.apache.derbyTesting.functionTests.tests.jdbcapi.AuthenticationTest)java.sql.SQLException: An SQL data change is not permitted for a read-only connection, user or database.
> 	at org.apache.derby.impl.jdbc.SQLExceptionFactory.getSQLException(Unknown Source)
> 	at org.apache.derby.impl.jdbc.Util.generateCsSQLException(Unknown Source)
> 	at org.apache.derby.impl.jdbc.TransactionResourceImpl.wrapInSQLException(Unknown Source)
> 	at org.apache.derby.impl.jdbc.TransactionResourceImpl.handleException(Unknown Source)
> 	at org.apache.derby.impl.jdbc.EmbedConnection.handleException(Unknown Source)
> 	at org.apache.derby.impl.jdbc.ConnectionChild.handleException(Unknown Source)
> 	at org.apache.derby.impl.jdbc.EmbedStatement.executeStatement(Unknown Source)
> 	at org.apache.derby.impl.jdbc.EmbedPreparedStatement.executeStatement(Unknown Source)
> 	at org.apache.derby.impl.jdbc.EmbedCallableStatement.executeStatement(Unknown Source)
> 	at org.apache.derby.impl.jdbc.EmbedPreparedStatement.executeUpdate(Unknown Source)
> 	at org.apache.derbyTesting.junit.DatabasePropertyTestSetup.setProperties(DatabasePropertyTestSetup.java:352)
> 	at org.apache.derbyTesting.junit.DatabasePropertyTestSetup.setUp(DatabasePropertyTestSetup.java:268)
> 	at junit.extensions.TestSetup$1.protect(TestSetup.java:20)
> 	at junit.extensions.TestSetup.run(TestSetup.java:25)
> 	at org.apache.derbyTesting.junit.BaseTestSetup.run(BaseTestSetup.java:57)
> 	at junit.extensions.TestDecorator.basicRun(TestDecorator.java:24)
> 	at junit.extensions.TestSetup$1.protect(TestSetup.java:21)
> 	at junit.extensions.TestSetup.run(TestSetup.java:25)
> 	at org.apache.derbyTesting.junit.BaseTestSetup.run(BaseTestSetup.java:57)
> 	at junit.extensions.TestDecorator.basicRun(TestDecorator.java:24)
> 	at junit.extensions.TestSetup$1.protect(TestSetup.java:21)
> 	at junit.extensions.TestSetup.run(TestSetup.java:25)
> 	at junit.extensions.TestDecorator.basicRun(TestDecorator.java:24)
> 	at junit.extensions.TestSetup$1.protect(TestSetup.java:21)
> 	at junit.extensions.TestSetup.run(TestSetup.java:25)
> 	at org.apache.derbyTesting.junit.BaseTestSetup.run(BaseTestSetup.java:57)
> 	at junit.extensions.TestDecorator.basicRun(TestDecorator.java:24)
> 	at junit.extensions.TestSetup$1.protect(TestSetup.java:21)
> 	at junit.extensions.TestSetup.run(TestSetup.java:25)
> Caused by: ERROR 25502: An SQL data change is not permitted for a read-only connection, user or database.
> 	at org.apache.derby.iapi.error.StandardException.newException(Unknown Source)
> 	at org.apache.derby.impl.sql.conn.GenericAuthorizer.authorize(Unknown Source)
> 	at org.apache.derby.exe.ac39f20170x0135x1df2x9281xffffc03e58d61.g0(Unknown Source)
> 	at java.lang.reflect.AccessibleObject.invokeV(AccessibleObject.java:195)
> 	at org.apache.derby.impl.services.reflect.ReflectMethod.invoke(Unknown Source)
> 	at org.apache.derby.impl.sql.execute.CallStatementResultSet.open(Unknown Source)
> 	at org.apache.derby.impl.sql.GenericPreparedStatement.executeStmt(Unknown Source)
> 	at org.apache.derby.impl.sql.GenericPreparedStatement.execute(Unknown Source)
> 	... 41 more
> 12) testSystemShutdown(org.apache.derbyTesting.functionTests.tests.jdbcapi.AuthenticationTest)java.sql.SQLException: An SQL data change is not permitted for a read-only connection, user or database.
> 	at org.apache.derby.impl.jdbc.SQLExceptionFactory.getSQLException(Unknown Source)
> 	at org.apache.derby.impl.jdbc.Util.generateCsSQLException(Unknown Source)
> 	at org.apache.derby.impl.jdbc.TransactionResourceImpl.wrapInSQLException(Unknown Source)
> 	at org.apache.derby.impl.jdbc.TransactionResourceImpl.handleException(Unknown Source)
> 	at org.apache.derby.impl.jdbc.EmbedConnection.handleException(Unknown Source)
> 	at org.apache.derby.impl.jdbc.ConnectionChild.handleException(Unknown Source)
> 	at org.apache.derby.impl.jdbc.EmbedStatement.executeStatement(Unknown Source)
> 	at org.apache.derby.impl.jdbc.EmbedPreparedStatement.executeStatement(Unknown Source)
> 	at org.apache.derby.impl.jdbc.EmbedCallableStatement.executeStatement(Unknown Source)
> 	at org.apache.derby.impl.jdbc.EmbedPreparedStatement.executeUpdate(Unknown Source)
> 	at org.apache.derbyTesting.junit.DatabasePropertyTestSetup.tearDown(DatabasePropertyTestSetup.java:294)
> 	at junit.extensions.TestSetup$1.protect(TestSetup.java:22)
> 	at junit.extensions.TestSetup.run(TestSetup.java:25)
> 	at org.apache.derbyTesting.junit.BaseTestSetup.run(BaseTestSetup.java:57)
> 	at junit.extensions.TestDecorator.basicRun(TestDecorator.java:24)
> 	at junit.extensions.TestSetup$1.protect(TestSetup.java:21)
> 	at junit.extensions.TestSetup.run(TestSetup.java:25)
> 	at junit.extensions.TestDecorator.basicRun(TestDecorator.java:24)
> 	at junit.extensions.TestSetup$1.protect(TestSetup.java:21)
> 	at junit.extensions.TestSetup.run(TestSetup.java:25)
> 	at org.apache.derbyTesting.junit.BaseTestSetup.run(BaseTestSetup.java:57)
> 	at junit.extensions.TestDecorator.basicRun(TestDecorator.java:24)
> 	at junit.extensions.TestSetup$1.protect(TestSetup.java:21)
> 	at junit.extensions.TestSetup.run(TestSetup.java:25)
> Caused by: ERROR 25502: An SQL data change is not permitted for a read-only connection, user or database.
> 	at org.apache.derby.iapi.error.StandardException.newException(Unknown Source)
> 	at org.apache.derby.impl.sql.conn.GenericAuthorizer.authorize(Unknown Source)
> 	at org.apache.derby.exe.ac83c08175x0135x1df2x9281xffffc03e58d60.g0(Unknown Source)
> 	at java.lang.reflect.AccessibleObject.invokeV(AccessibleObject.java:195)
> 	at org.apache.derby.impl.services.reflect.ReflectMethod.invoke(Unknown Source)
> 	at org.apache.derby.impl.sql.execute.CallStatementResultSet.open(Unknown Source)
> 	at org.apache.derby.impl.sql.GenericPreparedStatement.executeStmt(Unknown Source)
> 	at org.apache.derby.impl.sql.GenericPreparedStatement.execute(Unknown Source)
> 	... 35 more
> 13) testDefaultHashAlgorithm(org.apache.derbyTesting.functionTests.tests.jdbcapi.AuthenticationTest)java.sql.SQLException: An SQL data change is not permitted for a read-only connection, user or database.
> 	at org.apache.derby.impl.jdbc.SQLExceptionFactory.getSQLException(Unknown Source)
> 	at org.apache.derby.impl.jdbc.Util.generateCsSQLException(Unknown Source)
> 	at org.apache.derby.impl.jdbc.TransactionResourceImpl.wrapInSQLException(Unknown Source)
> 	at org.apache.derby.impl.jdbc.TransactionResourceImpl.handleException(Unknown Source)
> 	at org.apache.derby.impl.jdbc.EmbedConnection.handleException(Unknown Source)
> 	at org.apache.derby.impl.jdbc.ConnectionChild.handleException(Unknown Source)
> 	at org.apache.derby.impl.jdbc.EmbedStatement.executeStatement(Unknown Source)
> 	at org.apache.derby.impl.jdbc.EmbedPreparedStatement.executeStatement(Unknown Source)
> 	at org.apache.derby.impl.jdbc.EmbedCallableStatement.executeStatement(Unknown Source)
> 	at org.apache.derby.impl.jdbc.EmbedPreparedStatement.executeUpdate(Unknown Source)
> 	at org.apache.derbyTesting.junit.DatabasePropertyTestSetup.setProperties(DatabasePropertyTestSetup.java:352)
> 	at org.apache.derbyTesting.junit.DatabasePropertyTestSetup.setUp(DatabasePropertyTestSetup.java:268)
> 	at junit.extensions.TestSetup$1.protect(TestSetup.java:20)
> 	at junit.extensions.TestSetup.run(TestSetup.java:25)
> 	at org.apache.derbyTesting.junit.BaseTestSetup.run(BaseTestSetup.java:57)
> 	at junit.extensions.TestDecorator.basicRun(TestDecorator.java:24)
> 	at junit.extensions.TestSetup$1.protect(TestSetup.java:21)
> 	at junit.extensions.TestSetup.run(TestSetup.java:25)
> 	at org.apache.derbyTesting.junit.BaseTestSetup.run(BaseTestSetup.java:57)
> 	at junit.extensions.TestDecorator.basicRun(TestDecorator.java:24)
> 	at junit.extensions.TestSetup$1.protect(TestSetup.java:21)
> 	at junit.extensions.TestSetup.run(TestSetup.java:25)
> 	at junit.extensions.TestDecorator.basicRun(TestDecorator.java:24)
> 	at junit.extensions.TestSetup$1.protect(TestSetup.java:21)
> 	at junit.extensions.TestSetup.run(TestSetup.java:25)
> 	at org.apache.derbyTesting.junit.BaseTestSetup.run(BaseTestSetup.java:57)
> 	at junit.extensions.TestDecorator.basicRun(TestDecorator.java:24)
> 	at junit.extensions.TestSetup$1.protect(TestSetup.java:21)
> 	at junit.extensions.TestSetup.run(TestSetup.java:25)
> Caused by: ERROR 25502: An SQL data change is not permitted for a read-only connection, user or database.
> 	at org.apache.derby.iapi.error.StandardException.newException(Unknown Source)
> 	at org.apache.derby.impl.sql.conn.GenericAuthorizer.authorize(Unknown Source)
> 	at org.apache.derby.exe.ac65f3c17bx0135x1df2x9281xffffc03e58d61.g0(Unknown Source)
> 	at java.lang.reflect.AccessibleObject.invokeV(AccessibleObject.java:195)
> 	at org.apache.derby.impl.services.reflect.ReflectMethod.invoke(Unknown Source)
> 	at org.apache.derby.impl.sql.execute.CallStatementResultSet.open(Unknown Source)
> 	at org.apache.derby.impl.sql.GenericPreparedStatement.executeStmt(Unknown Source)
> 	at org.apache.derby.impl.sql.GenericPreparedStatement.execute(Unknown Source)
> 	... 41 more
> 14) testDefaultHashAlgorithm(org.apache.derbyTesting.functionTests.tests.jdbcapi.AuthenticationTest)java.sql.SQLException: An SQL data change is not permitted for a read-only connection, user or database.
> 	at org.apache.derby.impl.jdbc.SQLExceptionFactory.getSQLException(Unknown Source)
> 	at org.apache.derby.impl.jdbc.Util.generateCsSQLException(Unknown Source)
> 	at org.apache.derby.impl.jdbc.TransactionResourceImpl.wrapInSQLException(Unknown Source)
> 	at org.apache.derby.impl.jdbc.TransactionResourceImpl.handleException(Unknown Source)
> 	at org.apache.derby.impl.jdbc.EmbedConnection.handleException(Unknown Source)
> 	at org.apache.derby.impl.jdbc.ConnectionChild.handleException(Unknown Source)
> 	at org.apache.derby.impl.jdbc.EmbedStatement.executeStatement(Unknown Source)
> 	at org.apache.derby.impl.jdbc.EmbedPreparedStatement.executeStatement(Unknown Source)
> 	at org.apache.derby.impl.jdbc.EmbedCallableStatement.executeStatement(Unknown Source)
> 	at org.apache.derby.impl.jdbc.EmbedPreparedStatement.executeUpdate(Unknown Source)
> 	at org.apache.derbyTesting.junit.DatabasePropertyTestSetup.tearDown(DatabasePropertyTestSetup.java:294)
> 	at junit.extensions.TestSetup$1.protect(TestSetup.java:22)
> 	at junit.extensions.TestSetup.run(TestSetup.java:25)
> 	at org.apache.derbyTesting.junit.BaseTestSetup.run(BaseTestSetup.java:57)
> 	at junit.extensions.TestDecorator.basicRun(TestDecorator.java:24)
> 	at junit.extensions.TestSetup$1.protect(TestSetup.java:21)
> 	at junit.extensions.TestSetup.run(TestSetup.java:25)
> 	at junit.extensions.TestDecorator.basicRun(TestDecorator.java:24)
> 	at junit.extensions.TestSetup$1.protect(TestSetup.java:21)
> 	at junit.extensions.TestSetup.run(TestSetup.java:25)
> 	at org.apache.derbyTesting.junit.BaseTestSetup.run(BaseTestSetup.java:57)
> 	at junit.extensions.TestDecorator.basicRun(TestDecorator.java:24)
> 	at junit.extensions.TestSetup$1.protect(TestSetup.java:21)
> 	at junit.extensions.TestSetup.run(TestSetup.java:25)
> Caused by: ERROR 25502: An SQL data change is not permitted for a read-only connection, user or database.
> 	at org.apache.derby.iapi.error.StandardException.newException(Unknown Source)
> 	at org.apache.derby.impl.sql.conn.GenericAuthorizer.authorize(Unknown Source)
> 	at org.apache.derby.exe.acbfd00180x0135x1df2x9281xffffc03e58d60.g0(Unknown Source)
> 	at java.lang.reflect.AccessibleObject.invokeV(AccessibleObject.java:195)
> 	at org.apache.derby.impl.services.reflect.ReflectMethod.invoke(Unknown Source)
> 	at org.apache.derby.impl.sql.execute.CallStatementResultSet.open(Unknown Source)
> 	at org.apache.derby.impl.sql.GenericPreparedStatement.executeStmt(Unknown Source)
> 	at org.apache.derby.impl.sql.GenericPreparedStatement.execute(Unknown Source)
> 	... 35 more
> FAILURES!!!
> Tests run: 6987,  Failures: 0,  Errors: 14

--
This message is automatically generated by JIRA.
If you think it was sent incorrectly, please contact your JIRA administrators: https://issues.apache.org/jira/secure/ContactAdministrators!default.jspa
For more information on JIRA, see: http://www.atlassian.com/software/jira

        

Mime
View raw message