db-derby-dev mailing list archives

Site index · List index
Message view « Date » · « Thread »
Top « Date » · « Thread »
From "Mike Matrigali (Created) (JIRA)" <j...@apache.org>
Subject [jira] [Created] (DERBY-5575) testImportExportProcedures(org.apache.derbyTesting.functionTests.tests.tools.ImportExportProcedureTest)java.sql.SQLException: An IOException occurred while writing data to the file.
Date Thu, 19 Jan 2012 21:30:40 GMT
testImportExportProcedures(org.apache.derbyTesting.functionTests.tests.tools.ImportExportProcedureTest)java.sql.SQLException:
An IOException occurred while writing data to the file.
-------------------------------------------------------------------------------------------------------------------------------------------------------------------------------------

                 Key: DERBY-5575
                 URL: https://issues.apache.org/jira/browse/DERBY-5575
             Project: Derby
          Issue Type: Bug
          Components: Test
    Affects Versions: 10.9.0.0
            Reporter: Mike Matrigali


failed in nightly regression test suite, trunk, ibm17, windows

http://people.apache.org/~myrnavl/derby_test_results/main/windows/testlog/ibm17/1233150-suites.All_diff.txt

1) testImportExportProcedures(org.apache.derbyTesting.functionTests.tests.tools.ImportExportProcedureTest)java.sql.SQLException:
An IOException occurred while writing data to the file.
	at org.apache.derby.client.am.SQLExceptionFactory40.getSQLException(Unknown Source)
	at org.apache.derby.client.am.SqlException.getSQLException(Unknown Source)
	at org.apache.derby.client.am.PreparedStatement.executeUpdate(Unknown Source)
	at org.apache.derbyTesting.junit.BaseJDBCTestCase.assertUpdateCount(BaseJDBCTestCase.java:1230)
	at org.apache.derbyTesting.functionTests.tests.tools.ImportExportProcedureTest.testImportExportProcedures(ImportExportProcedureTest.java:842)
	at sun.reflect.NativeMethodAccessorImpl.invoke0(Native Method)
	at sun.reflect.NativeMethodAccessorImpl.invoke(NativeMethodAccessorImpl.java:88)
	at sun.reflect.DelegatingMethodAccessorImpl.invoke(DelegatingMethodAccessorImpl.java:55)
	at org.apache.derbyTesting.junit.BaseTestCase.runBare(BaseTestCase.java:116)
	at junit.extensions.TestDecorator.basicRun(TestDecorator.java:24)
	at junit.extensions.TestSetup$1.protect(TestSetup.java:21)
	at junit.extensions.TestSetup.run(TestSetup.java:25)
	at org.apache.derbyTesting.junit.BaseTestSetup.run(BaseTestSetup.java:57)
	at junit.extensions.TestDecorator.basicRun(TestDecorator.java:24)
	at junit.extensions.TestSetup$1.protect(TestSetup.java:21)
	at junit.extensions.TestSetup.run(TestSetup.java:25)
	at junit.extensions.TestDecorator.basicRun(TestDecorator.java:24)
	at junit.extensions.TestSetup$1.protect(TestSetup.java:21)
	at junit.extensions.TestSetup.run(TestSetup.java:25)
	at org.apache.derbyTesting.junit.BaseTestSetup.run(BaseTestSetup.java:57)
	at junit.extensions.TestDecorator.basicRun(TestDecorator.java:24)
	at junit.extensions.TestSetup$1.protect(TestSetup.java:21)
	at junit.extensions.TestSetup.run(TestSetup.java:25)
Caused by: org.apache.derby.client.am.SqlException: An IOException occurred while writing
data to the file.
	at org.apache.derby.client.am.Statement.completeExecute(Unknown Source)
	at org.apache.derby.client.net.NetStatementReply.parseEXCSQLSTTreply(Unknown Source)
	at org.apache.derby.client.net.NetStatementReply.readExecuteCall(Unknown Source)
	at org.apache.derby.client.net.StatementReply.readExecuteCall(Unknown Source)
	at org.apache.derby.client.net.NetStatement.readExecuteCall_(Unknown Source)
	at org.apache.derby.client.am.Statement.readExecuteCall(Unknown Source)
	at org.apache.derby.client.am.PreparedStatement.flowExecute(Unknown Source)
	at org.apache.derby.client.am.PreparedStatement.executeUpdateX(Unknown Source)
	... 47 more
Caused by: org.apache.derby.client.am.SqlException: Java exception: 'extinout\t1.del (Access
is denied.): java.io.FileNotFoundException'.
	at org.apache.derby.client.am.SqlException.<init>(Unknown Source)
	at org.apache.derby.client.am.SqlException.<init>(Unknown Source)
	... 55 more

FAILURES!!!
Tests run: 15252,  Failures: 0,  Errors: 1



--
This message is automatically generated by JIRA.
If you think it was sent incorrectly, please contact your JIRA administrators: https://issues.apache.org/jira/secure/ContactAdministrators!default.jspa
For more information on JIRA, see: http://www.atlassian.com/software/jira

        

Mime
View raw message