db-derby-dev mailing list archives

Site index · List index
Message view « Date » · « Thread »
Top « Date » · « Thread »
From "Kathey Marsden (Commented) (JIRA)" <j...@apache.org>
Subject [jira] [Commented] (DERBY-5379) testDERBY5120NumRowsInSydependsForTrigger - The number of values assigned is not the same as the number of specified or implied columns.
Date Fri, 11 Nov 2011 20:44:52 GMT

    [ https://issues.apache.org/jira/browse/DERBY-5379?page=com.atlassian.jira.plugin.system.issuetabpanels:comment-tabpanel&focusedCommentId=13148721#comment-13148721 ] 

Kathey Marsden commented on DERBY-5379:
---------------------------------------

I just started running tests on a new machine with Windows 7 64bit i7 CPU and saw this failure in 2/2 runs of suites.All followed by various failures that I think just cascade because of this one.  Let me know if there is any there is any debugging code you would like me to add for my next run,


1) testDERBY5120NumRowsInSydependsForTrigger(org.apache.derbyTesting.functionTests.tests.upgradeTest
l.SQLSyntaxErrorException: The number of values assigned is not the same as the number of specified
        at org.apache.derby.impl.jdbc.SQLExceptionFactory40.getSQLException(Unknown Source)
        at org.apache.derby.impl.jdbc.Util.generateCsSQLException(Unknown Source)
        at org.apache.derby.impl.jdbc.TransactionResourceImpl.wrapInSQLException(Unknown Source)
        at org.apache.derby.impl.jdbc.TransactionResourceImpl.handleException(Unknown Source)
        at org.apache.derby.impl.jdbc.EmbedConnection.handleException(Unknown Source)
        at org.apache.derby.impl.jdbc.ConnectionChild.handleException(Unknown Source)
        at org.apache.derby.impl.jdbc.EmbedStatement.executeStatement(Unknown Source)
        at org.apache.derby.impl.jdbc.EmbedStatement.execute(Unknown Source)
        at org.apache.derby.impl.jdbc.EmbedStatement.execute(Unknown Source)
        at org.apache.derbyTesting.functionTests.tests.upgradeTests.BasicSetup.testDERBY5120NumRowsI
(BasicSetup.java:455)
        at sun.reflect.NativeMethodAccessorImpl.invoke0(Native Method)
        at sun.reflect.NativeMethodAccessorImpl.invoke(NativeMethodAccessorImpl.java:60)
        at sun.reflect.DelegatingMethodAccessorImpl.invoke(DelegatingMethodAccessorImpl.java:37)
        at org.apache.derbyTesting.junit.BaseTestCase.runBare(BaseTestCase.java:116)
        at junit.extensions.TestDecorator.basicRun(TestDecorator.java:24)
        at junit.extensions.TestSetup$1.protect(TestSetup.java:21)
        at junit.extensions.TestSetup.run(TestSetup.java:18)
        at junit.extensions.TestDecorator.basicRun(TestDecorator.java:24)
        at junit.extensions.TestSetup$1.protect(TestSetup.java:21)
        at junit.extensions.TestSetup.run(TestSetup.java:25)
        at org.apache.derbyTesting.junit.BaseTestSetup.run(BaseTestSetup.java:51)
        at junit.extensions.TestDecorator.basicRun(TestDecorator.java:24)
        at junit.extensions.TestSetup$1.protect(TestSetup.java:21)
        at junit.extensions.TestSetup.run(TestSetup.java:25)
        at org.apache.derbyTesting.junit.BaseTestSetup.run(BaseTestSetup.java:51)
        at junit.extensions.TestDecorator.basicRun(TestDecorator.java:24)
        at junit.extensions.TestSetup$1.protect(TestSetup.java:21)
        at junit.extensions.TestSetup.run(TestSetup.java:18)
        at junit.extensions.TestDecorator.basicRun(TestDecorator.java:24)
        at junit.extensions.TestSetup$1.protect(TestSetup.java:21)
        at junit.extensions.TestSetup.run(TestSetup.java:25)
        at org.apache.derbyTesting.junit.BaseTestSetup.run(BaseTestSetup.java:51)
        at junit.extensions.TestDecorator.basicRun(TestDecorator.java:24)
        at junit.extensions.TestSetup$1.protect(TestSetup.java:21)
        at junit.extensions.TestSetup.run(TestSetup.java:18)
        at junit.extensions.TestDecorator.basicRun(TestDecorator.java:24)
        at junit.extensions.TestSetup$1.protect(TestSetup.java:21)
        at junit.extensions.TestSetup.run(TestSetup.java:25)
        at org.apache.derbyTesting.junit.BaseTestSetup.run(BaseTestSetup.java:51)
        at junit.extensions.TestDecorator.basicRun(TestDecorator.java:24)
        at junit.extensions.TestSetup$1.protect(TestSetup.java:21)
        at junit.extensions.TestSetup.run(TestSetup.java:18)
        at junit.extensions.TestDecorator.basicRun(TestDecorator.java:24)
        at junit.extensions.TestSetup$1.protect(TestSetup.java:21)
        at junit.extensions.TestSetup.run(TestSetup.java:25)
        at org.apache.derbyTesting.junit.BaseTestSetup.run(BaseTestSetup.java:51)
        at junit.extensions.TestDecorator.basicRun(TestDecorator.java:24)
        at junit.extensions.TestSetup$1.protect(TestSetup.java:21)
        at junit.extensions.TestSetup.run(TestSetup.java:18)
        at junit.extensions.TestDecorator.basicRun(TestDecorator.java:24)
        at junit.extensions.TestSetup$1.protect(TestSetup.java:21)
        at junit.extensions.TestSetup.run(TestSetup.java:25)
        at org.apache.derbyTesting.junit.BaseTestSetup.run(BaseTestSetup.java:51)
        at junit.extensions.TestDecorator.basicRun(TestDecorator.java:24)
        at junit.extensions.TestSetup$1.protect(TestSetup.java:21)
        at junit.extensions.TestSetup.run(TestSetup.java:18)
        at junit.extensions.TestDecorator.basicRun(TestDecorator.java:24)
        at junit.extensions.TestSetup$1.protect(TestSetup.java:21)
        at junit.extensions.TestSetup.run(TestSetup.java:25)
        at org.apache.derbyTesting.junit.BaseTestSetup.run(BaseTestSetup.java:51)
        at junit.extensions.TestDecorator.basicRun(TestDecorator.java:24)
        at junit.extensions.TestSetup$1.protect(TestSetup.java:21)
        at junit.extensions.TestSetup.run(TestSetup.java:18)
        at junit.extensions.TestDecorator.basicRun(TestDecorator.java:24)
        at junit.extensions.TestSetup$1.protect(TestSetup.java:21)
        at junit.extensions.TestSetup.run(TestSetup.java:18)
        at junit.extensions.TestDecorator.basicRun(TestDecorator.java:24)
        at junit.extensions.TestSetup$1.protect(TestSetup.java:21)
        at junit.extensions.TestSetup.run(TestSetup.java:18)
Caused by: java.sql.SQLException: The number of values assigned is not the same as the number of spe
lumns.
        at org.apache.derby.impl.jdbc.SQLExceptionFactory.getSQLException(Unknown Source)
        at org.apache.derby.impl.jdbc.SQLExceptionFactory40.wrapArgsForTransportAcrossDRDA(Unknown S
        ... 109 more
Caused by: ERROR 42802: The number of values assigned is not the same as the number of specified or
        at org.apache.derby.iapi.error.StandardException.newException(Unknown Source)
        at org.apache.derby.impl.sql.compile.InsertNode.bindStatement(Unknown Source)
        at org.apache.derby.impl.sql.GenericStatement.prepMinion(Unknown Source)
        at org.apache.derby.impl.sql.GenericStatement.prepareStorable(Unknown Source)
        at org.apache.derby.iapi.sql.dictionary.SPSDescriptor.compileStatement(Unknown Source)
        at org.apache.derby.iapi.sql.dictionary.SPSDescriptor.prepareAndRelease(Unknown Source)
        at org.apache.derby.iapi.sql.dictionary.SPSDescriptor.getPreparedStatement(Unknown Source)
        at org.apache.derby.iapi.sql.dictionary.SPSDescriptor.getPreparedStatement(Unknown Source)
        at org.apache.derby.impl.sql.execute.GenericTriggerExecutor.executeSPS(Unknown Source)
        at org.apache.derby.impl.sql.execute.StatementTriggerExecutor.fireTrigger(Unknown Source)
        at org.apache.derby.impl.sql.execute.TriggerEventActivator.notifyEvent(Unknown Source)
        at org.apache.derby.impl.sql.execute.UpdateResultSet.fireAfterTriggers(Unknown Source)
        at org.apache.derby.impl.sql.execute.UpdateResultSet.open(Unknown Source)
        at org.apache.derby.impl.sql.GenericPreparedStatement.executeStmt(Unknown Source)
        at org.apache.derby.impl.sql.GenericPreparedStatement.execute(Unknown Source)
        ... 103 more
2) testDERBY5044AlterTableDropColumn(org.apache.derbyTesting.functionTests.tests.upgradeTests.BasicS
eption: Operation 'DROP COLUMN' cannot be performed on object 'C22' because TRIGGER 'ATDC_13_TAB1_TR
that object.
        at org.apache.derby.impl.jdbc.SQLExceptionFactory40.getSQLException(Unknown Source)
        at org.apache.derby.impl.jdbc.Util.generateCsSQLException(Unknown Source)
        at org.apache.derby.impl.jdbc.TransactionResourceImpl.wrapInSQLException(Unknown Source)
        at org.apache.derby.impl.jdbc.TransactionResourceImpl.handleException(Unknown Source)
        at org.apache.derby.impl.jdbc.EmbedConnection.handleException(Unknown Source)
        at org.apache.derby.impl.jdbc.ConnectionChild.handleException(Unknown Source)
        at org.apache.derby.impl.jdbc.EmbedStatement.executeStatement(Unknown Source)
        at org.apache.derby.impl.jdbc.EmbedStatement.execute(Unknown Source)
        at org.apache.derby.impl.jdbc.EmbedStatement.executeUpdate(Unknown Source)
        at org.apache.derbyTesting.functionTests.tests.upgradeTests.BasicSetup.testDERBY5044AlterTab
tup.java:733)
        at sun.reflect.NativeMethodAccessorImpl.invoke0(Native Method)
        at sun.reflect.NativeMethodAccessorImpl.invoke(NativeMethodAccessorImpl.java:60)
        at sun.reflect.DelegatingMethodAccessorImpl.invoke(DelegatingMethodAccessorImpl.java:37)
        at org.apache.derbyTesting.junit.BaseTestCase.runBare(BaseTestCase.java:116)
        at junit.extensions.TestDecorator.basicRun(TestDecorator.java:24)
        at junit.extensions.TestSetup$1.protect(TestSetup.java:21)
        at junit.extensions.TestSetup.run(TestSetup.java:18)
        at junit.extensions.TestDecorator.basicRun(TestDecorator.java:24)
        at junit.extensions.TestSetup$1.protect(TestSetup.java:21)
        at junit.extensions.TestSetup.run(TestSetup.java:25)
        at org.apache.derbyTesting.junit.BaseTestSetup.run(BaseTestSetup.java:51)
        at junit.extensions.TestDecorator.basicRun(TestDecorator.java:24)
        at junit.extensions.TestSetup$1.protect(TestSetup.java:21)
        at junit.extensions.TestSetup.run(TestSetup.java:25)
        at org.apache.derbyTesting.junit.BaseTestSetup.run(BaseTestSetup.java:51)
        at junit.extensions.TestDecorator.basicRun(TestDecorator.java:24)
        at junit.extensions.TestSetup$1.protect(TestSetup.java:21)
        at junit.extensions.TestSetup.run(TestSetup.java:18)
        at junit.extensions.TestDecorator.basicRun(TestDecorator.java:24)
        at junit.extensions.TestSetup$1.protect(TestSetup.java:21)
        at junit.extensions.TestSetup.run(TestSetup.java:25)
        at org.apache.derbyTesting.junit.BaseTestSetup.run(BaseTestSetup.java:51)
        at junit.extensions.TestDecorator.basicRun(TestDecorator.java:24)
        at junit.extensions.TestSetup$1.protect(TestSetup.java:21)
        at junit.extensions.TestSetup.run(TestSetup.java:18)
        at junit.extensions.TestDecorator.basicRun(TestDecorator.java:24)
        at junit.extensions.TestSetup$1.protect(TestSetup.java:21)
        at junit.extensions.TestSetup.run(TestSetup.java:25)
        at org.apache.derbyTesting.junit.BaseTestSetup.run(BaseTestSetup.java:51)
        at junit.extensions.TestDecorator.basicRun(TestDecorator.java:24)
        at junit.extensions.TestSetup$1.protect(TestSetup.java:21)
        at junit.extensions.TestSetup.run(TestSetup.java:18)
        at junit.extensions.TestDecorator.basicRun(TestDecorator.java:24)
        at junit.extensions.TestSetup$1.protect(TestSetup.java:21)
        at junit.extensions.TestSetup.run(TestSetup.java:25)
        at org.apache.derbyTesting.junit.BaseTestSetup.run(BaseTestSetup.java:51)
        at junit.extensions.TestDecorator.basicRun(TestDecorator.java:24)
        at junit.extensions.TestSetup$1.protect(TestSetup.java:21)
        at junit.extensions.TestSetup.run(TestSetup.java:18)
        at junit.extensions.TestDecorator.basicRun(TestDecorator.java:24)
        at junit.extensions.TestSetup$1.protect(TestSetup.java:21)
        at junit.extensions.TestSetup.run(TestSetup.java:25)
        at org.apache.derbyTesting.junit.BaseTestSetup.run(BaseTestSetup.java:51)
        at junit.extensions.TestDecorator.basicRun(TestDecorator.java:24)
        at junit.extensions.TestSetup$1.protect(TestSetup.java:21)
        at junit.extensions.TestSetup.run(TestSetup.java:18)
        at junit.extensions.TestDecorator.basicRun(TestDecorator.java:24)
        at junit.extensions.TestSetup$1.protect(TestSetup.java:21)
        at junit.extensions.TestSetup.run(TestSetup.java:25)
        at org.apache.derbyTesting.junit.BaseTestSetup.run(BaseTestSetup.java:51)
        at junit.extensions.TestDecorator.basicRun(TestDecorator.java:24)
        at junit.extensions.TestSetup$1.protect(TestSetup.java:21)
        at junit.extensions.TestSetup.run(TestSetup.java:18)
        at junit.extensions.TestDecorator.basicRun(TestDecorator.java:24)
        at junit.extensions.TestSetup$1.protect(TestSetup.java:21)
        at junit.extensions.TestSetup.run(TestSetup.java:18)
        at junit.extensions.TestDecorator.basicRun(TestDecorator.java:24)
        at junit.extensions.TestSetup$1.protect(TestSetup.java:21)
        at junit.extensions.TestSetup.run(TestSetup.java:18)
Caused by: java.sql.SQLException: Operation 'DROP COLUMN' cannot be performed on object 'C22' becaus
AB1_TRG2' is dependent on that object.
        at org.apache.derby.impl.jdbc.SQLExceptionFactory.getSQLException(Unknown Source)
        at org.apache.derby.impl.jdbc.SQLExceptionFactory40.wrapArgsForTransportAcrossDRDA(Unknown S
        ... 109 more
Caused by: ERROR X0Y25: Operation 'DROP COLUMN' cannot be performed on object 'C22' because TRIGGER
is dependent on that object.
        at org.apache.derby.iapi.error.StandardException.newException(Unknown Source)
        at org.apache.derby.impl.sql.execute.AlterTableConstantAction.columnDroppedAndTriggerDepende
)
        at org.apache.derby.impl.sql.execute.AlterTableConstantAction.dropColumnFromTable(Unknown So
        at org.apache.derby.impl.sql.execute.AlterTableConstantAction.executeConstantActionBody(Unkn
        at org.apache.derby.impl.sql.execute.AlterTableConstantAction.executeConstantAction(Unknown
        at org.apache.derby.impl.sql.execute.MiscResultSet.open(Unknown Source)
        at org.apache.derby.impl.sql.GenericPreparedStatement.executeStmt(Unknown Source)
        at org.apache.derby.impl.sql.GenericPreparedStatement.execute(Unknown Source)
        ... 103 more
3) testDERBY5044_And_DERBY5120_DropColumn(org.apache.derbyTesting.functionTests.tests.upgradeTests.B
QLSyntaxErrorException: 'C112' is not a column in table or VTI 'BKUP1_5044_5120'.
        at java.lang.Throwable.<init>(Throwable.java:80)
        at java.sql.SQLException.<init>(SQLException.java:153)
        at java.sql.SQLException.<init>(SQLException.java:176)
        at org.apache.derby.impl.jdbc.SQLExceptionFactory40.getSQLException(SQLExceptionFactory40.ja
        at org.apache.derby.impl.jdbc.Util.generateCsSQLException(Util.java:256)
        at org.apache.derby.impl.jdbc.TransactionResourceImpl.wrapInSQLException(TransactionResource
        at org.apache.derby.impl.jdbc.TransactionResourceImpl.handleException(TransactionResourceImp
        at org.apache.derby.impl.jdbc.EmbedConnection.handleException(EmbedConnection.java:2290)
        at org.apache.derby.impl.jdbc.ConnectionChild.handleException(ConnectionChild.java:82)
        at org.apache.derby.impl.jdbc.EmbedStatement.execute(EmbedStatement.java:619)
        at org.apache.derby.impl.jdbc.EmbedStatement.executeUpdate(EmbedStatement.java:179)
        at org.apache.derbyTesting.functionTests.tests.upgradeTests.BasicSetup.dropColumn_triggersql
5120(BasicSetup.java:613)
        at org.apache.derbyTesting.functionTests.tests.upgradeTests.BasicSetup.testDERBY5044_And_DER
sicSetup.java:544)
        at sun.reflect.NativeMethodAccessorImpl.invoke0(Native Method)
        at sun.reflect.NativeMethodAccessorImpl.invoke(NativeMethodAccessorImpl.java:60)
        at sun.reflect.DelegatingMethodAccessorImpl.invoke(DelegatingMethodAccessorImpl.java:37)
        at org.apache.derbyTesting.junit.BaseTestCase.runBare(BaseTestCase.java:116)
        at junit.extensions.TestDecorator.basicRun(TestDecorator.java:24)
        at junit.extensions.TestSetup$1.protect(TestSetup.java:21)
        at junit.extensions.TestSetup.run(TestSetup.java:18)
        at junit.extensions.TestDecorator.basicRun(TestDecorator.java:24)
        at junit.extensions.TestSetup$1.protect(TestSetup.java:21)
        at junit.extensions.TestSetup.run(TestSetup.java:25)
        at org.apache.derbyTesting.junit.BaseTestSetup.run(BaseTestSetup.java:51)
        at junit.extensions.TestDecorator.basicRun(TestDecorator.java:24)
        at junit.extensions.TestSetup$1.protect(TestSetup.java:21)
        at junit.extensions.TestSetup.run(TestSetup.java:25)
        at org.apache.derbyTesting.junit.BaseTestSetup.run(BaseTestSetup.java:51)
        at junit.extensions.TestDecorator.basicRun(TestDecorator.java:24)
        at junit.extensions.TestSetup$1.protect(TestSetup.java:21)
        at junit.extensions.TestSetup.run(TestSetup.java:18)
        at junit.extensions.TestDecorator.basicRun(TestDecorator.java:24)
        at junit.extensions.TestSetup$1.protect(TestSetup.java:21)
        at junit.extensions.TestSetup.run(TestSetup.java:25)
        at org.apache.derbyTesting.junit.BaseTestSetup.run(BaseTestSetup.java:51)
        at junit.extensions.TestDecorator.basicRun(TestDecorator.java:24)
        at junit.extensions.TestSetup$1.protect(TestSetup.java:21)
        at junit.extensions.TestSetup.run(TestSetup.java:18)
        at junit.extensions.TestDecorator.basicRun(TestDecorator.java:24)
        at junit.extensions.TestSetup$1.protect(TestSetup.java:21)
        at junit.extensions.TestSetup.run(TestSetup.java:25)
        at org.apache.derbyTesting.junit.BaseTestSetup.run(BaseTestSetup.java:51)
        at junit.extensions.TestDecorator.basicRun(TestDecorator.java:24)
        at junit.extensions.TestSetup$1.protect(TestSetup.java:21)
        at junit.extensions.TestSetup.run(TestSetup.java:18)
        at junit.extensions.TestDecorator.basicRun(TestDecorator.java:24)
        at junit.extensions.TestSetup$1.protect(TestSetup.java:21)
        at junit.extensions.TestSetup.run(TestSetup.java:25)
        at org.apache.derbyTesting.junit.BaseTestSetup.run(BaseTestSetup.java:51)
        at junit.extensions.TestDecorator.basicRun(TestDecorator.java:24)
        at junit.extensions.TestSetup$1.protect(TestSetup.java:21)
        at junit.extensions.TestSetup.run(TestSetup.java:18)
        at junit.extensions.TestDecorator.basicRun(TestDecorator.java:24)
        at junit.extensions.TestSetup$1.protect(TestSetup.java:21)
        at junit.extensions.TestSetup.run(TestSetup.java:25)
        at org.apache.derbyTesting.junit.BaseTestSetup.run(BaseTestSetup.java:51)
        at junit.extensions.TestDecorator.basicRun(TestDecorator.java:24)
        at junit.extensions.TestSetup$1.protect(TestSetup.java:21)
        at junit.extensions.TestSetup.run(TestSetup.java:18)
        at junit.extensions.TestDecorator.basicRun(TestDecorator.java:24)
        at junit.extensions.TestSetup$1.protect(TestSetup.java:21)
        at junit.extensions.TestSetup.run(TestSetup.java:25)
        at org.apache.derbyTesting.junit.BaseTestSetup.run(BaseTestSetup.java:51)
        at junit.extensions.TestDecorator.basicRun(TestDecorator.java:24)
        at junit.extensions.TestSetup$1.protect(TestSetup.java:21)
        at junit.extensions.TestSetup.run(TestSetup.java:18)
        at junit.extensions.TestDecorator.basicRun(TestDecorator.java:24)
        at junit.extensions.TestSetup$1.protect(TestSetup.java:21)
        at junit.extensions.TestSetup.run(TestSetup.java:18)
        at junit.extensions.TestDecorator.basicRun(TestDecorator.java:24)
        at junit.extensions.TestSetup$1.protect(TestSetup.java:21)
        at junit.extensions.TestSetup.run(TestSetup.java:18)
Caused by: java.sql.SQLException: 'C112' is not a column in table or VTI 'BKUP1_5044_5120'.
        at org.apache.derby.impl.jdbc.SQLExceptionFactory.getSQLException(SQLExceptionFactory.java:4
        at org.apache.derby.impl.jdbc.SQLExceptionFactory40.wrapArgsForTransportAcrossDRDA(SQLExcept
2)
        at org.apache.derby.impl.jdbc.SQLExceptionFactory40.getSQLException(SQLExceptionFactory40.ja
        ... 108 more
Caused by: ERROR 42X14: 'C112' is not a column in table or VTI 'BKUP1_5044_5120'.
        at org.apache.derby.iapi.error.StandardException.newException(StandardException.java:295)
        at org.apache.derby.impl.sql.compile.ModifyColumnNode.bindAndValidateDefault(ModifyColumnNod
        at org.apache.derby.impl.sql.compile.TableElementList.validate(TableElementList.java:218)
        at org.apache.derby.impl.sql.compile.AlterTableNode.bindStatement(AlterTableNode.java:376)
        at org.apache.derby.impl.sql.GenericStatement.prepMinion(GenericStatement.java:373)
        at org.apache.derby.impl.sql.GenericStatement.prepare(GenericStatement.java:97)
        at org.apache.derby.impl.sql.conn.GenericLanguageConnectionContext.prepareInternalStatement(
ctionContext.java:1103)
        at org.apache.derby.impl.jdbc.EmbedStatement.execute(EmbedStatement.java:610)
        ... 102 more
4) testDERBY5120NumRowsInSydependsForTrigger(org.apache.derbyTesting.functionTests.tests.upgradeTest
l.SQLSyntaxErrorException: The number of values assigned is not the same as the number of specified
        at org.apache.derby.impl.jdbc.SQLExceptionFactory40.getSQLException(Unknown Source)
        at org.apache.derby.impl.jdbc.Util.generateCsSQLException(Unknown Source)
        at org.apache.derby.impl.jdbc.TransactionResourceImpl.wrapInSQLException(Unknown Source)
        at org.apache.derby.impl.jdbc.TransactionResourceImpl.handleException(Unknown Source)
        at org.apache.derby.impl.jdbc.EmbedConnection.handleException(Unknown Source)
        at org.apache.derby.impl.jdbc.ConnectionChild.handleException(Unknown Source)
        at org.apache.derby.impl.jdbc.EmbedStatement.executeStatement(Unknown Source)
        at org.apache.derby.impl.jdbc.EmbedStatement.execute(Unknown Source)
        at org.apache.derby.impl.jdbc.EmbedStatement.execute(Unknown Source)
        at org.apache.derbyTesting.functionTests.tests.upgradeTests.BasicSetup.testDERBY5120NumRowsI
(BasicSetup.java:479)
        at sun.reflect.NativeMethodAccessorImpl.invoke0(Native Method)
        at sun.reflect.NativeMethodAccessorImpl.invoke(NativeMethodAccessorImpl.java:60)
        at sun.reflect.DelegatingMethodAccessorImpl.invoke(DelegatingMethodAccessorImpl.java:37)
        at org.apache.derbyTesting.junit.BaseTestCase.runBare(BaseTestCase.java:116)
        at junit.extensions.TestDecorator.basicRun(TestDecorator.java:24)
        at junit.extensions.TestSetup$1.protect(TestSetup.java:21)
        at junit.extensions.TestSetup.run(TestSetup.java:18)
        at junit.extensions.TestDecorator.basicRun(TestDecorator.java:24)
        at junit.extensions.TestSetup$1.protect(TestSetup.java:21)
        at junit.extensions.TestSetup.run(TestSetup.java:25)
        at org.apache.derbyTesting.junit.BaseTestSetup.run(BaseTestSetup.java:51)
        at junit.extensions.TestDecorator.basicRun(TestDecorator.java:24)
        at junit.extensions.TestSetup$1.protect(TestSetup.java:21)
        at junit.extensions.TestSetup.run(TestSetup.java:25)
        at org.apache.derbyTesting.junit.BaseTestSetup.run(BaseTestSetup.java:51)
        at junit.extensions.TestDecorator.basicRun(TestDecorator.java:24)
        at junit.extensions.TestSetup$1.protect(TestSetup.java:21)
        at junit.extensions.TestSetup.run(TestSetup.java:18)
        at junit.extensions.TestDecorator.basicRun(TestDecorator.java:24)
        at junit.extensions.TestSetup$1.protect(TestSetup.java:21)
        at junit.extensions.TestSetup.run(TestSetup.java:25)
        at org.apache.derbyTesting.junit.BaseTestSetup.run(BaseTestSetup.java:51)
        at junit.extensions.TestDecorator.basicRun(TestDecorator.java:24)
        at junit.extensions.TestSetup$1.protect(TestSetup.java:21)
        at junit.extensions.TestSetup.run(TestSetup.java:18)
        at junit.extensions.TestDecorator.basicRun(TestDecorator.java:24)
        at junit.extensions.TestSetup$1.protect(TestSetup.java:21)
        at junit.extensions.TestSetup.run(TestSetup.java:25)
        at org.apache.derbyTesting.junit.BaseTestSetup.run(BaseTestSetup.java:51)
        at junit.extensions.TestDecorator.basicRun(TestDecorator.java:24)
        at junit.extensions.TestSetup$1.protect(TestSetup.java:21)
        at junit.extensions.TestSetup.run(TestSetup.java:18)
        at junit.extensions.TestDecorator.basicRun(TestDecorator.java:24)
        at junit.extensions.TestSetup$1.protect(TestSetup.java:21)
        at junit.extensions.TestSetup.run(TestSetup.java:25)
        at org.apache.derbyTesting.junit.BaseTestSetup.run(BaseTestSetup.java:51)
        at junit.extensions.TestDecorator.basicRun(TestDecorator.java:24)
        at junit.extensions.TestSetup$1.protect(TestSetup.java:21)
        at junit.extensions.TestSetup.run(TestSetup.java:18)
        at junit.extensions.TestDecorator.basicRun(TestDecorator.java:24)
        at junit.extensions.TestSetup$1.protect(TestSetup.java:21)
        at junit.extensions.TestSetup.run(TestSetup.java:25)
        at org.apache.derbyTesting.junit.BaseTestSetup.run(BaseTestSetup.java:51)
        at junit.extensions.TestDecorator.basicRun(TestDecorator.java:24)
        at junit.extensions.TestSetup$1.protect(TestSetup.java:21)
        at junit.extensions.TestSetup.run(TestSetup.java:18)
        at junit.extensions.TestDecorator.basicRun(TestDecorator.java:24)
        at junit.extensions.TestSetup$1.protect(TestSetup.java:21)
        at junit.extensions.TestSetup.run(TestSetup.java:25)
        at org.apache.derbyTesting.junit.BaseTestSetup.run(BaseTestSetup.java:51)
        at junit.extensions.TestDecorator.basicRun(TestDecorator.java:24)
        at junit.extensions.TestSetup$1.protect(TestSetup.java:21)
        at junit.extensions.TestSetup.run(TestSetup.java:18)
        at junit.extensions.TestDecorator.basicRun(TestDecorator.java:24)
        at junit.extensions.TestSetup$1.protect(TestSetup.java:21)
        at junit.extensions.TestSetup.run(TestSetup.java:18)
        at junit.extensions.TestDecorator.basicRun(TestDecorator.java:24)
        at junit.extensions.TestSetup$1.protect(TestSetup.java:21)
        at junit.extensions.TestSetup.run(TestSetup.java:18)
Caused by: java.sql.SQLException: The number of values assigned is not the same as the number of spe
lumns.
        at org.apache.derby.impl.jdbc.SQLExceptionFactory.getSQLException(Unknown Source)
        at org.apache.derby.impl.jdbc.SQLExceptionFactory40.wrapArgsForTransportAcrossDRDA(Unknown S
        ... 109 more
Caused by: ERROR 42802: The number of values assigned is not the same as the number of specified or
        at org.apache.derby.iapi.error.StandardException.newException(Unknown Source)
        at org.apache.derby.impl.sql.compile.InsertNode.bindStatement(Unknown Source)
        at org.apache.derby.impl.sql.GenericStatement.prepMinion(Unknown Source)
        at org.apache.derby.impl.sql.GenericStatement.prepareStorable(Unknown Source)
        at org.apache.derby.iapi.sql.dictionary.SPSDescriptor.compileStatement(Unknown Source)
        at org.apache.derby.iapi.sql.dictionary.SPSDescriptor.prepareAndRelease(Unknown Source)
        at org.apache.derby.iapi.sql.dictionary.SPSDescriptor.getPreparedStatement(Unknown Source)
        at org.apache.derby.iapi.sql.dictionary.SPSDescriptor.getPreparedStatement(Unknown Source)
        at org.apache.derby.impl.sql.execute.GenericTriggerExecutor.executeSPS(Unknown Source)
        at org.apache.derby.impl.sql.execute.StatementTriggerExecutor.fireTrigger(Unknown Source)
        at org.apache.derby.impl.sql.execute.TriggerEventActivator.notifyEvent(Unknown Source)
        at org.apache.derby.impl.sql.execute.UpdateResultSet.fireAfterTriggers(Unknown Source)
        at org.apache.derby.impl.sql.execute.UpdateResultSet.open(Unknown Source)
        at org.apache.derby.impl.sql.GenericPreparedStatement.executeStmt(Unknown Source)
        at org.apache.derby.impl.sql.GenericPreparedStatement.execute(Unknown Source)
        ... 103 more
5) testDERBY5044_And_DERBY5120_DropColumn(org.apache.derbyTesting.functionTests.tests.upgradeTests.B
QLSyntaxErrorException: 'C112' is not a column in table or VTI 'BKUP1_5044_5120'.
        at org.apache.derby.impl.jdbc.SQLExceptionFactory40.getSQLException(Unknown Source)
        at org.apache.derby.impl.jdbc.Util.generateCsSQLException(Unknown Source)
        at org.apache.derby.impl.jdbc.TransactionResourceImpl.wrapInSQLException(Unknown Source)
        at org.apache.derby.impl.jdbc.TransactionResourceImpl.handleException(Unknown Source)
        at org.apache.derby.impl.jdbc.EmbedConnection.handleException(Unknown Source)
        at org.apache.derby.impl.jdbc.ConnectionChild.handleException(Unknown Source)
        at org.apache.derby.impl.jdbc.EmbedStatement.execute(Unknown Source)
        at org.apache.derby.impl.jdbc.EmbedStatement.executeUpdate(Unknown Source)
        at org.apache.derbyTesting.functionTests.tests.upgradeTests.BasicSetup.dropColumn_triggersql
5120(BasicSetup.java:592)
        at org.apache.derbyTesting.functionTests.tests.upgradeTests.BasicSetup.testDERBY5044_And_DER
sicSetup.java:544)
        at sun.reflect.NativeMethodAccessorImpl.invoke0(Native Method)
        at sun.reflect.NativeMethodAccessorImpl.invoke(NativeMethodAccessorImpl.java:60)
        at sun.reflect.DelegatingMethodAccessorImpl.invoke(DelegatingMethodAccessorImpl.java:37)
        at org.apache.derbyTesting.junit.BaseTestCase.runBare(BaseTestCase.java:116)
        at junit.extensions.TestDecorator.basicRun(TestDecorator.java:24)
        at junit.extensions.TestSetup$1.protect(TestSetup.java:21)
        at junit.extensions.TestSetup.run(TestSetup.java:18)
        at junit.extensions.TestDecorator.basicRun(TestDecorator.java:24)
        at junit.extensions.TestSetup$1.protect(TestSetup.java:21)
        at junit.extensions.TestSetup.run(TestSetup.java:25)
        at org.apache.derbyTesting.junit.BaseTestSetup.run(BaseTestSetup.java:51)
        at junit.extensions.TestDecorator.basicRun(TestDecorator.java:24)
        at junit.extensions.TestSetup$1.protect(TestSetup.java:21)
        at junit.extensions.TestSetup.run(TestSetup.java:25)
        at org.apache.derbyTesting.junit.BaseTestSetup.run(BaseTestSetup.java:51)
        at junit.extensions.TestDecorator.basicRun(TestDecorator.java:24)
        at junit.extensions.TestSetup$1.protect(TestSetup.java:21)
        at junit.extensions.TestSetup.run(TestSetup.java:18)
        at junit.extensions.TestDecorator.basicRun(TestDecorator.java:24)
        at junit.extensions.TestSetup$1.protect(TestSetup.java:21)
        at junit.extensions.TestSetup.run(TestSetup.java:25)
        at org.apache.derbyTesting.junit.BaseTestSetup.run(BaseTestSetup.java:51)
        at junit.extensions.TestDecorator.basicRun(TestDecorator.java:24)
        at junit.extensions.TestSetup$1.protect(TestSetup.java:21)
        at junit.extensions.TestSetup.run(TestSetup.java:18)
        at junit.extensions.TestDecorator.basicRun(TestDecorator.java:24)
        at junit.extensions.TestSetup$1.protect(TestSetup.java:21)
        at junit.extensions.TestSetup.run(TestSetup.java:25)
        at org.apache.derbyTesting.junit.BaseTestSetup.run(BaseTestSetup.java:51)
        at junit.extensions.TestDecorator.basicRun(TestDecorator.java:24)
        at junit.extensions.TestSetup$1.protect(TestSetup.java:21)
        at junit.extensions.TestSetup.run(TestSetup.java:18)
        at junit.extensions.TestDecorator.basicRun(TestDecorator.java:24)
        at junit.extensions.TestSetup$1.protect(TestSetup.java:21)
        at junit.extensions.TestSetup.run(TestSetup.java:25)
        at org.apache.derbyTesting.junit.BaseTestSetup.run(BaseTestSetup.java:51)
        at junit.extensions.TestDecorator.basicRun(TestDecorator.java:24)
        at junit.extensions.TestSetup$1.protect(TestSetup.java:21)
        at junit.extensions.TestSetup.run(TestSetup.java:18)
        at junit.extensions.TestDecorator.basicRun(TestDecorator.java:24)
        at junit.extensions.TestSetup$1.protect(TestSetup.java:21)
        at junit.extensions.TestSetup.run(TestSetup.java:25)
        at org.apache.derbyTesting.junit.BaseTestSetup.run(BaseTestSetup.java:51)
        at junit.extensions.TestDecorator.basicRun(TestDecorator.java:24)
        at junit.extensions.TestSetup$1.protect(TestSetup.java:21)
        at junit.extensions.TestSetup.run(TestSetup.java:18)
        at junit.extensions.TestDecorator.basicRun(TestDecorator.java:24)
        at junit.extensions.TestSetup$1.protect(TestSetup.java:21)
        at junit.extensions.TestSetup.run(TestSetup.java:25)
        at org.apache.derbyTesting.junit.BaseTestSetup.run(BaseTestSetup.java:51)
        at junit.extensions.TestDecorator.basicRun(TestDecorator.java:24)
        at junit.extensions.TestSetup$1.protect(TestSetup.java:21)
        at junit.extensions.TestSetup.run(TestSetup.java:18)
        at junit.extensions.TestDecorator.basicRun(TestDecorator.java:24)
        at junit.extensions.TestSetup$1.protect(TestSetup.java:21)
        at junit.extensions.TestSetup.run(TestSetup.java:18)
        at junit.extensions.TestDecorator.basicRun(TestDecorator.java:24)
        at junit.extensions.TestSetup$1.protect(TestSetup.java:21)
        at junit.extensions.TestSetup.run(TestSetup.java:18)
Caused by: java.sql.SQLException: 'C112' is not a column in table or VTI 'BKUP1_5044_5120'.
        at org.apache.derby.impl.jdbc.SQLExceptionFactory.getSQLException(Unknown Source)
        at org.apache.derby.impl.jdbc.SQLExceptionFactory40.wrapArgsForTransportAcrossDRDA(Unknown S
        ... 109 more
Caused by: ERROR 42X14: 'C112' is not a column in table or VTI 'BKUP1_5044_5120'.
        at org.apache.derby.iapi.error.StandardException.newException(Unknown Source)
        at org.apache.derby.impl.sql.compile.ModifyColumnNode.bindAndValidateDefault(Unknown Source)
        at org.apache.derby.impl.sql.compile.TableElementList.validate(Unknown Source)
        at org.apache.derby.impl.sql.compile.AlterTableNode.bindStatement(Unknown Source)
        at org.apache.derby.impl.sql.GenericStatement.prepMinion(Unknown Source)
        at org.apache.derby.impl.sql.GenericStatement.prepare(Unknown Source)
        at org.apache.derby.impl.sql.conn.GenericLanguageConnectionContext.prepareInternalStatement(
        ... 103 more
6) testDERBY5044AlterTableDropColumn(org.apache.derbyTesting.functionTests.tests.upgradeTests.BasicS
eption: Operation 'DROP COLUMN' cannot be performed on object 'C22' because TRIGGER 'ATDC_13_TAB1_TR
that object.
        at org.apache.derby.impl.jdbc.SQLExceptionFactory40.getSQLException(Unknown Source)
        at org.apache.derby.impl.jdbc.Util.generateCsSQLException(Unknown Source)
        at org.apache.derby.impl.jdbc.TransactionResourceImpl.wrapInSQLException(Unknown Source)
        at org.apache.derby.impl.jdbc.TransactionResourceImpl.handleException(Unknown Source)
        at org.apache.derby.impl.jdbc.EmbedConnection.handleException(Unknown Source)
        at org.apache.derby.impl.jdbc.ConnectionChild.handleException(Unknown Source)
        at org.apache.derby.impl.jdbc.EmbedStatement.executeStatement(Unknown Source)
        at org.apache.derby.impl.jdbc.EmbedStatement.execute(Unknown Source)
        at org.apache.derby.impl.jdbc.EmbedStatement.executeUpdate(Unknown Source)
        at org.apache.derbyTesting.functionTests.tests.upgradeTests.BasicSetup.testDERBY5044AlterTab
tup.java:733)
        at sun.reflect.NativeMethodAccessorImpl.invoke0(Native Method)
        at sun.reflect.NativeMethodAccessorImpl.invoke(NativeMethodAccessorImpl.java:60)
        at sun.reflect.DelegatingMethodAccessorImpl.invoke(DelegatingMethodAccessorImpl.java:37)
        at org.apache.derbyTesting.junit.BaseTestCase.runBare(BaseTestCase.java:116)
        at junit.extensions.TestDecorator.basicRun(TestDecorator.java:24)
        at junit.extensions.TestSetup$1.protect(TestSetup.java:21)
        at junit.extensions.TestSetup.run(TestSetup.java:18)
        at junit.extensions.TestDecorator.basicRun(TestDecorator.java:24)
        at junit.extensions.TestSetup$1.protect(TestSetup.java:21)
        at junit.extensions.TestSetup.run(TestSetup.java:25)
        at org.apache.derbyTesting.junit.BaseTestSetup.run(BaseTestSetup.java:51)
        at junit.extensions.TestDecorator.basicRun(TestDecorator.java:24)
        at junit.extensions.TestSetup$1.protect(TestSetup.java:21)
        at junit.extensions.TestSetup.run(TestSetup.java:25)
        at org.apache.derbyTesting.junit.BaseTestSetup.run(BaseTestSetup.java:51)
        at junit.extensions.TestDecorator.basicRun(TestDecorator.java:24)
        at junit.extensions.TestSetup$1.protect(TestSetup.java:21)
        at junit.extensions.TestSetup.run(TestSetup.java:18)
        at junit.extensions.TestDecorator.basicRun(TestDecorator.java:24)
        at junit.extensions.TestSetup$1.protect(TestSetup.java:21)
        at junit.extensions.TestSetup.run(TestSetup.java:25)
        at org.apache.derbyTesting.junit.BaseTestSetup.run(BaseTestSetup.java:51)
        at junit.extensions.TestDecorator.basicRun(TestDecorator.java:24)
        at junit.extensions.TestSetup$1.protect(TestSetup.java:21)
        at junit.extensions.TestSetup.run(TestSetup.java:18)
        at junit.extensions.TestDecorator.basicRun(TestDecorator.java:24)
        at junit.extensions.TestSetup$1.protect(TestSetup.java:21)
        at junit.extensions.TestSetup.run(TestSetup.java:25)
        at org.apache.derbyTesting.junit.BaseTestSetup.run(BaseTestSetup.java:51)
        at junit.extensions.TestDecorator.basicRun(TestDecorator.java:24)
        at junit.extensions.TestSetup$1.protect(TestSetup.java:21)
        at junit.extensions.TestSetup.run(TestSetup.java:18)
        at junit.extensions.TestDecorator.basicRun(TestDecorator.java:24)
        at junit.extensions.TestSetup$1.protect(TestSetup.java:21)
        at junit.extensions.TestSetup.run(TestSetup.java:25)
        at org.apache.derbyTesting.junit.BaseTestSetup.run(BaseTestSetup.java:51)
        at junit.extensions.TestDecorator.basicRun(TestDecorator.java:24)
        at junit.extensions.TestSetup$1.protect(TestSetup.java:21)
        at junit.extensions.TestSetup.run(TestSetup.java:18)
        at junit.extensions.TestDecorator.basicRun(TestDecorator.java:24)
        at junit.extensions.TestSetup$1.protect(TestSetup.java:21)
        at junit.extensions.TestSetup.run(TestSetup.java:25)
        at org.apache.derbyTesting.junit.BaseTestSetup.run(BaseTestSetup.java:51)
        at junit.extensions.TestDecorator.basicRun(TestDecorator.java:24)
        at junit.extensions.TestSetup$1.protect(TestSetup.java:21)
        at junit.extensions.TestSetup.run(TestSetup.java:18)
        at junit.extensions.TestDecorator.basicRun(TestDecorator.java:24)
        at junit.extensions.TestSetup$1.protect(TestSetup.java:21)
        at junit.extensions.TestSetup.run(TestSetup.java:25)
        at org.apache.derbyTesting.junit.BaseTestSetup.run(BaseTestSetup.java:51)
        at junit.extensions.TestDecorator.basicRun(TestDecorator.java:24)
        at junit.extensions.TestSetup$1.protect(TestSetup.java:21)
        at junit.extensions.TestSetup.run(TestSetup.java:18)
        at junit.extensions.TestDecorator.basicRun(TestDecorator.java:24)
        at junit.extensions.TestSetup$1.protect(TestSetup.java:21)
        at junit.extensions.TestSetup.run(TestSetup.java:18)
        at junit.extensions.TestDecorator.basicRun(TestDecorator.java:24)
        at junit.extensions.TestSetup$1.protect(TestSetup.java:21)
        at junit.extensions.TestSetup.run(TestSetup.java:18)
Caused by: java.sql.SQLException: Operation 'DROP COLUMN' cannot be performed on object 'C22' becaus
AB1_TRG2' is dependent on that object.
        at org.apache.derby.impl.jdbc.SQLExceptionFactory.getSQLException(Unknown Source)
        at org.apache.derby.impl.jdbc.SQLExceptionFactory40.wrapArgsForTransportAcrossDRDA(Unknown S
        ... 109 more
Caused by: ERROR X0Y25: Operation 'DROP COLUMN' cannot be performed on object 'C22' because TRIGGER
is dependent on that object.
        at org.apache.derby.iapi.error.StandardException.newException(Unknown Source)
        at org.apache.derby.impl.sql.execute.AlterTableConstantAction.columnDroppedAndTriggerDepende
)
        at org.apache.derby.impl.sql.execute.AlterTableConstantAction.dropColumnFromTable(Unknown So
        at org.apache.derby.impl.sql.execute.AlterTableConstantAction.executeConstantActionBody(Unkn
        at org.apache.derby.impl.sql.execute.AlterTableConstantAction.executeConstantAction(Unknown
        at org.apache.derby.impl.sql.execute.MiscResultSet.open(Unknown Source)
        at org.apache.derby.impl.sql.GenericPreparedStatement.executeStmt(Unknown Source)
        at org.apache.derby.impl.sql.GenericPreparedStatement.execute(Unknown Source)
        ... 103 more
7) testDERBY5044_And_DERBY5120_DropColumn(org.apache.derbyTesting.functionTests.tests.upgradeTests.B
QLSyntaxErrorException: 'C112' is not a column in table or VTI 'BKUP1_5044_5120'.
        at java.lang.Throwable.<init>(Throwable.java:80)
        at java.sql.SQLException.<init>(SQLException.java:153)
        at java.sql.SQLException.<init>(SQLException.java:176)
        at org.apache.derby.impl.jdbc.SQLExceptionFactory40.getSQLException(SQLExceptionFactory40.ja
        at org.apache.derby.impl.jdbc.Util.generateCsSQLException(Util.java:256)
        at org.apache.derby.impl.jdbc.TransactionResourceImpl.wrapInSQLException(TransactionResource
        at org.apache.derby.impl.jdbc.TransactionResourceImpl.handleException(TransactionResourceImp
        at org.apache.derby.impl.jdbc.EmbedConnection.handleException(EmbedConnection.java:2290)
        at org.apache.derby.impl.jdbc.ConnectionChild.handleException(ConnectionChild.java:82)
        at org.apache.derby.impl.jdbc.EmbedStatement.execute(EmbedStatement.java:619)
        at org.apache.derby.impl.jdbc.EmbedStatement.executeUpdate(EmbedStatement.java:179)
        at org.apache.derbyTesting.functionTests.tests.upgradeTests.BasicSetup.dropColumn_triggersql
5120(BasicSetup.java:613)
        at org.apache.derbyTesting.functionTests.tests.upgradeTests.BasicSetup.testDERBY5044_And_DER
sicSetup.java:544)
        at sun.reflect.NativeMethodAccessorImpl.invoke0(Native Method)
        at sun.reflect.NativeMethodAccessorImpl.invoke(NativeMethodAccessorImpl.java:60)
        at sun.reflect.DelegatingMethodAccessorImpl.invoke(DelegatingMethodAccessorImpl.java:37)
        at org.apache.derbyTesting.junit.BaseTestCase.runBare(BaseTestCase.java:116)
        at junit.extensions.TestDecorator.basicRun(TestDecorator.java:24)
        at junit.extensions.TestSetup$1.protect(TestSetup.java:21)
        at junit.extensions.TestSetup.run(TestSetup.java:18)
        at junit.extensions.TestDecorator.basicRun(TestDecorator.java:24)
        at junit.extensions.TestSetup$1.protect(TestSetup.java:21)
        at junit.extensions.TestSetup.run(TestSetup.java:25)
        at org.apache.derbyTesting.junit.BaseTestSetup.run(BaseTestSetup.java:51)
        at junit.extensions.TestDecorator.basicRun(TestDecorator.java:24)
        at junit.extensions.TestSetup$1.protect(TestSetup.java:21)
        at junit.extensions.TestSetup.run(TestSetup.java:25)
        at org.apache.derbyTesting.junit.BaseTestSetup.run(BaseTestSetup.java:51)
        at junit.extensions.TestDecorator.basicRun(TestDecorator.java:24)
        at junit.extensions.TestSetup$1.protect(TestSetup.java:21)
        at junit.extensions.TestSetup.run(TestSetup.java:18)
        at junit.extensions.TestDecorator.basicRun(TestDecorator.java:24)
        at junit.extensions.TestSetup$1.protect(TestSetup.java:21)
        at junit.extensions.TestSetup.run(TestSetup.java:25)
        at org.apache.derbyTesting.junit.BaseTestSetup.run(BaseTestSetup.java:51)
        at junit.extensions.TestDecorator.basicRun(TestDecorator.java:24)
        at junit.extensions.TestSetup$1.protect(TestSetup.java:21)
        at junit.extensions.TestSetup.run(TestSetup.java:18)
        at junit.extensions.TestDecorator.basicRun(TestDecorator.java:24)
        at junit.extensions.TestSetup$1.protect(TestSetup.java:21)
        at junit.extensions.TestSetup.run(TestSetup.java:25)
        at org.apache.derbyTesting.junit.BaseTestSetup.run(BaseTestSetup.java:51)
        at junit.extensions.TestDecorator.basicRun(TestDecorator.java:24)
        at junit.extensions.TestSetup$1.protect(TestSetup.java:21)
        at junit.extensions.TestSetup.run(TestSetup.java:18)
        at junit.extensions.TestDecorator.basicRun(TestDecorator.java:24)
        at junit.extensions.TestSetup$1.protect(TestSetup.java:21)
        at junit.extensions.TestSetup.run(TestSetup.java:25)
        at org.apache.derbyTesting.junit.BaseTestSetup.run(BaseTestSetup.java:51)
        at junit.extensions.TestDecorator.basicRun(TestDecorator.java:24)
        at junit.extensions.TestSetup$1.protect(TestSetup.java:21)
        at junit.extensions.TestSetup.run(TestSetup.java:18)
        at junit.extensions.TestDecorator.basicRun(TestDecorator.java:24)
        at junit.extensions.TestSetup$1.protect(TestSetup.java:21)
        at junit.extensions.TestSetup.run(TestSetup.java:25)
        at org.apache.derbyTesting.junit.BaseTestSetup.run(BaseTestSetup.java:51)
        at junit.extensions.TestDecorator.basicRun(TestDecorator.java:24)
        at junit.extensions.TestSetup$1.protect(TestSetup.java:21)
        at junit.extensions.TestSetup.run(TestSetup.java:18)
        at junit.extensions.TestDecorator.basicRun(TestDecorator.java:24)
        at junit.extensions.TestSetup$1.protect(TestSetup.java:21)
        at junit.extensions.TestSetup.run(TestSetup.java:25)
        at org.apache.derbyTesting.junit.BaseTestSetup.run(BaseTestSetup.java:51)
        at junit.extensions.TestDecorator.basicRun(TestDecorator.java:24)
        at junit.extensions.TestSetup$1.protect(TestSetup.java:21)
        at junit.extensions.TestSetup.run(TestSetup.java:18)
        at junit.extensions.TestDecorator.basicRun(TestDecorator.java:24)
        at junit.extensions.TestSetup$1.protect(TestSetup.java:21)
        at junit.extensions.TestSetup.run(TestSetup.java:18)
        at junit.extensions.TestDecorator.basicRun(TestDecorator.java:24)
        at junit.extensions.TestSetup$1.protect(TestSetup.java:21)
        at junit.extensions.TestSetup.run(TestSetup.java:18)
Caused by: java.sql.SQLException: 'C112' is not a column in table or VTI 'BKUP1_5044_5120'.
        at org.apache.derby.impl.jdbc.SQLExceptionFactory.getSQLException(SQLExceptionFactory.java:4
        at org.apache.derby.impl.jdbc.SQLExceptionFactory40.wrapArgsForTransportAcrossDRDA(SQLExcept
2)
        at org.apache.derby.impl.jdbc.SQLExceptionFactory40.getSQLException(SQLExceptionFactory40.ja
        ... 108 more
Caused by: ERROR 42X14: 'C112' is not a column in table or VTI 'BKUP1_5044_5120'.
        at org.apache.derby.iapi.error.StandardException.newException(StandardException.java:295)
        at org.apache.derby.impl.sql.compile.ModifyColumnNode.bindAndValidateDefault(ModifyColumnNod
        at org.apache.derby.impl.sql.compile.TableElementList.validate(TableElementList.java:218)
        at org.apache.derby.impl.sql.compile.AlterTableNode.bindStatement(AlterTableNode.java:376)
        at org.apache.derby.impl.sql.GenericStatement.prepMinion(GenericStatement.java:373)
        at org.apache.derby.impl.sql.GenericStatement.prepare(GenericStatement.java:97)
        at org.apache.derby.impl.sql.conn.GenericLanguageConnectionContext.prepareInternalStatement(
ctionContext.java:1103)
        at org.apache.derby.impl.jdbc.EmbedStatement.execute(EmbedStatement.java:610)
        ... 102 more
There were 2 failures:
1) test_notBooted(org.apache.derbyTesting.functionTests.tests.jdbc4.Driver40UnbootedTest)junit.frame
Error: expected:<0> but was:<1>
        at org.apache.derbyTesting.functionTests.tests.jdbc4.Driver40UnbootedTest.test_notBooted(Dri
va:159)
        at sun.reflect.NativeMethodAccessorImpl.invoke0(Native Method)
        at sun.reflect.NativeMethodAccessorImpl.invoke(NativeMethodAccessorImpl.java:60)
        at sun.reflect.DelegatingMethodAccessorImpl.invoke(DelegatingMethodAccessorImpl.java:37)
        at org.apache.derbyTesting.junit.BaseTestCase.runBare(BaseTestCase.java:116)
        at junit.extensions.TestDecorator.basicRun(TestDecorator.java:24)
        at junit.extensions.TestSetup$1.protect(TestSetup.java:21)
        at junit.extensions.TestSetup.run(TestSetup.java:18)
2) testDERBY5044_And_DERBY5120_DropColumn(org.apache.derbyTesting.functionTests.tests.upgradeTests.B
ework.AssertionFailedError: Expected error(s) ' 42802' but no error was thrown.
        at org.apache.derbyTesting.junit.BaseJDBCTestCase.assertStatementErrorMinion(BaseJDBCTestCas
        at org.apache.derbyTesting.junit.BaseJDBCTestCase.assertStatementError(BaseJDBCTestCase.java
        at org.apache.derbyTesting.junit.BaseJDBCTestCase.assertStatementError(BaseJDBCTestCase.java
        at org.apache.derbyTesting.functionTests.tests.upgradeTests.BasicSetup.dropColumn_triggersql
5120(BasicSetup.java:597)
        at org.apache.derbyTesting.functionTests.tests.upgradeTests.BasicSetup.testDERBY5044_And_DER
sicSetup.java:558)
        at sun.reflect.NativeMethodAccessorImpl.invoke0(Native Method)
        at sun.reflect.NativeMethodAccessorImpl.invoke(NativeMethodAccessorImpl.java:60)
        at sun.reflect.DelegatingMethodAccessorImpl.invoke(DelegatingMethodAccessorImpl.java:37)
        at org.apache.derbyTesting.junit.BaseTestCase.runBare(BaseTestCase.java:116)
        at junit.extensions.TestDecorator.basicRun(TestDecorator.java:24)
        at junit.extensions.TestSetup$1.protect(TestSetup.java:21)
        at junit.extensions.TestSetup.run(TestSetup.java:18)
        at junit.extensions.TestDecorator.basicRun(TestDecorator.java:24)
        at junit.extensions.TestSetup$1.protect(TestSetup.java:21)
        at junit.extensions.TestSetup.run(TestSetup.java:25)
        at org.apache.derbyTesting.junit.BaseTestSetup.run(BaseTestSetup.java:51)
        at junit.extensions.TestDecorator.basicRun(TestDecorator.java:24)
        at junit.extensions.TestSetup$1.protect(TestSetup.java:21)
        at junit.extensions.TestSetup.run(TestSetup.java:25)
        at org.apache.derbyTesting.junit.BaseTestSetup.run(BaseTestSetup.java:51)
        at junit.extensions.TestDecorator.basicRun(TestDecorator.java:24)
        at junit.extensions.TestSetup$1.protect(TestSetup.java:21)
        at junit.extensions.TestSetup.run(TestSetup.java:18)
        at junit.extensions.TestDecorator.basicRun(TestDecorator.java:24)
        at junit.extensions.TestSetup$1.protect(TestSetup.java:21)
        at junit.extensions.TestSetup.run(TestSetup.java:25)
        at org.apache.derbyTesting.junit.BaseTestSetup.run(BaseTestSetup.java:51)
        at junit.extensions.TestDecorator.basicRun(TestDecorator.java:24)
        at junit.extensions.TestSetup$1.protect(TestSetup.java:21)
        at junit.extensions.TestSetup.run(TestSetup.java:18)
        at junit.extensions.TestDecorator.basicRun(TestDecorator.java:24)
        at junit.extensions.TestSetup$1.protect(TestSetup.java:21)
        at junit.extensions.TestSetup.run(TestSetup.java:25)
        at org.apache.derbyTesting.junit.BaseTestSetup.run(BaseTestSetup.java:51)
        at junit.extensions.TestDecorator.basicRun(TestDecorator.java:24)
        at junit.extensions.TestSetup$1.protect(TestSetup.java:21)
        at junit.extensions.TestSetup.run(TestSetup.java:18)
        at junit.extensions.TestDecorator.basicRun(TestDecorator.java:24)
        at junit.extensions.TestSetup$1.protect(TestSetup.java:21)
        at junit.extensions.TestSetup.run(TestSetup.java:25)
        at org.apache.derbyTesting.junit.BaseTestSetup.run(BaseTestSetup.java:51)
        at junit.extensions.TestDecorator.basicRun(TestDecorator.java:24)
        at junit.extensions.TestSetup$1.protect(TestSetup.java:21)
        at junit.extensions.TestSetup.run(TestSetup.java:18)
        at junit.extensions.TestDecorator.basicRun(TestDecorator.java:24)
        at junit.extensions.TestSetup$1.protect(TestSetup.java:21)
        at junit.extensions.TestSetup.run(TestSetup.java:25)
        at org.apache.derbyTesting.junit.BaseTestSetup.run(BaseTestSetup.java:51)
        at junit.extensions.TestDecorator.basicRun(TestDecorator.java:24)
        at junit.extensions.TestSetup$1.protect(TestSetup.java:21)
        at junit.extensions.TestSetup.run(TestSetup.java:18)
        at junit.extensions.TestDecorator.basicRun(TestDecorator.java:24)
        at junit.extensions.TestSetup$1.protect(TestSetup.java:21)
        at junit.extensions.TestSetup.run(TestSetup.java:25)
        at org.apache.derbyTesting.junit.BaseTestSetup.run(BaseTestSetup.java:51)
        at junit.extensions.TestDecorator.basicRun(TestDecorator.java:24)
        at junit.extensions.TestSetup$1.protect(TestSetup.java:21)
        at junit.extensions.TestSetup.run(TestSetup.java:18)
        at junit.extensions.TestDecorator.basicRun(TestDecorator.java:24)
        at junit.extensions.TestSetup$1.protect(TestSetup.java:21)
        at junit.extensions.TestSetup.run(TestSetup.java:18)
        at junit.extensions.TestDecorator.basicRun(TestDecorator.java:24)
        at junit.extensions.TestSetup$1.protect(TestSetup.java:21)
        at junit.extensions.TestSetup.run(TestSetup.java:18)

FAILURES!!!
Tests run: 14497,  Failures: 2,  Errors: 7


                
> testDERBY5120NumRowsInSydependsForTrigger - The number of values assigned is not the same as the number of specified or implied columns.
> ----------------------------------------------------------------------------------------------------------------------------------------
>
>                 Key: DERBY-5379
>                 URL: https://issues.apache.org/jira/browse/DERBY-5379
>             Project: Derby
>          Issue Type: Bug
>          Components: SQL
>    Affects Versions: 10.9.0.0
>         Environment: Vista, Sun Java 1.5
>            Reporter: Dag H. Wanvik
>            Assignee: Jayaram Subramanian
>
> Cf. nightly here: http://dbtg.foundry.sun.com/derby/test/Daily/jvm1.5/testing/testlog/vista/1154999-derbyall_diff.txt
> 1) testDERBY5120NumRowsInSydependsForTrigger(org.apache.derbyTesting.functionTests.tests.upgradeTests.BasicSetup)java.sql.SQLException: The number of values assigned is not the same as the number of specified or implied columns.
> 	at org.apache.derby.impl.jdbc.SQLExceptionFactory.getSQLException(Unknown Source)
> 	at org.apache.derby.impl.jdbc.Util.generateCsSQLException(Unknown Source)
> 	at org.apache.derby.impl.jdbc.TransactionResourceImpl.wrapInSQLException(Unknown Source)
> 	at org.apache.derby.impl.jdbc.TransactionResourceImpl.handleException(Unknown Source)
> 	at org.apache.derby.impl.jdbc.EmbedConnection.handleException(Unknown Source)
> 	at org.apache.derby.impl.jdbc.ConnectionChild.handleException(Unknown Source)
> 	at org.apache.derby.impl.jdbc.EmbedStatement.executeStatement(Unknown Source)
> 	at org.apache.derby.impl.jdbc.EmbedStatement.execute(Unknown Source)
> 	at org.apache.derby.impl.jdbc.EmbedStatement.execute(Unknown Source)
> 	at org.apache.derbyTesting.functionTests.tests.upgradeTests.BasicSetup.testDERBY5120NumRowsInSydependsForTrigger(BasicSetup.java:455)
> 	at sun.reflect.NativeMethodAccessorImpl.invoke0(Native Method)
> 	at sun.reflect.NativeMethodAccessorImpl.invoke(NativeMethodAccessorImpl.java:39)
> 	at sun.reflect.DelegatingMethodAccessorImpl.invoke(DelegatingMethodAccessorImpl.java:25)
> 	at org.apache.derbyTesting.junit.BaseTestCase.runBare(BaseTestCase.java:112)
> 	at junit.extensions.TestDecorator.basicRun(TestDecorator.java:24)
> 	at junit.extensions.TestSetup$1.protect(TestSetup.java:21)
> 	at junit.extensions.TestSetup.run(TestSetup.java:25)
> 	at junit.extensions.TestDecorator.basicRun(TestDecorator.java:24)
> 	at junit.extensions.TestSetup$1.protect(TestSetup.java:21)
> 	at junit.extensions.TestSetup.run(TestSetup.java:25)
> 	at org.apache.derbyTesting.junit.BaseTestSetup.run(BaseTestSetup.java:57)
> 	at junit.extensions.TestDecorator.basicRun(TestDecorator.java:24)
> 	at junit.extensions.TestSetup$1.protect(TestSetup.java:21)
> 	at junit.extensions.TestSetup.run(TestSetup.java:25)
> 	at org.apache.derbyTesting.junit.BaseTestSetup.run(BaseTestSetup.java:57)
> 	at junit.extensions.TestDecorator.basicRun(TestDecorator.java:24)
> 	at junit.extensions.TestSetup$1.protect(TestSetup.java:21)
> 	at junit.extensions.TestSetup.run(TestSetup.java:25)
> 	at junit.extensions.TestDecorator.basicRun(TestDecorator.java:24)
> 	at junit.extensions.TestSetup$1.protect(TestSetup.java:21)
> 	at junit.extensions.TestSetup.run(TestSetup.java:25)
> 	at org.apache.derbyTesting.junit.BaseTestSetup.run(BaseTestSetup.java:57)
> 	at junit.extensions.TestDecorator.basicRun(TestDecorator.java:24)
> 	at junit.extensions.TestSetup$1.protect(TestSetup.java:21)
> 	at junit.extensions.TestSetup.run(TestSetup.java:25)
> 	at junit.extensions.TestDecorator.basicRun(TestDecorator.java:24)
> 	at junit.extensions.TestSetup$1.protect(TestSetup.java:21)
> 	at junit.extensions.TestSetup.run(TestSetup.java:25)
> 	at org.apache.derbyTesting.junit.BaseTestSetup.run(BaseTestSetup.java:57)
> 	at junit.extensions.TestDecorator.basicRun(TestDecorator.java:24)
> 	at junit.extensions.TestSetup$1.protect(TestSetup.java:21)
> 	at junit.extensions.TestSetup.run(TestSetup.java:25)
> 	at junit.extensions.TestDecorator.basicRun(TestDecorator.java:24)
> 	at junit.extensions.TestSetup$1.protect(TestSetup.java:21)
> 	at junit.extensions.TestSetup.run(TestSetup.java:25)
> 	at org.apache.derbyTesting.junit.BaseTestSetup.run(BaseTestSetup.java:57)
> 	at junit.extensions.TestDecorator.basicRun(TestDecorator.java:24)
> 	at junit.extensions.TestSetup$1.protect(TestSetup.java:21)
> 	at junit.extensions.TestSetup.run(TestSetup.java:25)
> 	at junit.extensions.TestDecorator.basicRun(TestDecorator.java:24)
> 	at junit.extensions.TestSetup$1.protect(TestSetup.java:21)
> 	at junit.extensions.TestSetup.run(TestSetup.java:25)
> 	at org.apache.derbyTesting.junit.BaseTestSetup.run(BaseTestSetup.java:57)
> 	at junit.extensions.TestDecorator.basicRun(TestDecorator.java:24)
> 	at junit.extensions.TestSetup$1.protect(TestSetup.java:21)
> 	at junit.extensions.TestSetup.run(TestSetup.java:25)
> 	at junit.extensions.TestDecorator.basicRun(TestDecorator.java:24)
> 	at junit.extensions.TestSetup$1.protect(TestSetup.java:21)
> 	at junit.extensions.TestSetup.run(TestSetup.java:25)
> 	at org.apache.derbyTesting.junit.BaseTestSetup.run(BaseTestSetup.java:57)
> 	at junit.extensions.TestDecorator.basicRun(TestDecorator.java:24)
> 	at junit.extensions.TestSetup$1.protect(TestSetup.java:21)
> 	at junit.extensions.TestSetup.run(TestSetup.java:25)
> 	at junit.extensions.TestDecorator.basicRun(TestDecorator.java:24)
> 	at junit.extensions.TestSetup$1.protect(TestSetup.java:21)
> 	at junit.extensions.TestSetup.run(TestSetup.java:25)
> 	at junit.extensions.TestDecorator.basicRun(TestDecorator.java:24)
> 	at junit.extensions.TestSetup$1.protect(TestSetup.java:21)
> 	at junit.extensions.TestSetup.run(TestSetup.java:25)
> Caused by: ERROR 42802: The number of values assigned is not the same as the number of specified or implied columns.
> 	at org.apache.derby.iapi.error.StandardException.newException(Unknown Source)
> 	at org.apache.derby.impl.sql.compile.InsertNode.bindStatement(Unknown Source)
> 	at org.apache.derby.impl.sql.GenericStatement.prepMinion(Unknown Source)
> 	at org.apache.derby.impl.sql.GenericStatement.prepareStorable(Unknown Source)
> 	at org.apache.derby.iapi.sql.dictionary.SPSDescriptor.compileStatement(Unknown Source)
> 	at org.apache.derby.iapi.sql.dictionary.SPSDescriptor.prepareAndRelease(Unknown Source)
> 	at org.apache.derby.iapi.sql.dictionary.SPSDescriptor.getPreparedStatement(Unknown Source)
> 	at org.apache.derby.iapi.sql.dictionary.SPSDescriptor.getPreparedStatement(Unknown Source)
> 	at org.apache.derby.impl.sql.execute.GenericTriggerExecutor.executeSPS(Unknown Source)
> 	at org.apache.derby.impl.sql.execute.StatementTriggerExecutor.fireTrigger(Unknown Source)
> 	at org.apache.derby.impl.sql.execute.TriggerEventActivator.notifyEvent(Unknown Source)
> 	at org.apache.derby.impl.sql.execute.UpdateResultSet.fireAfterTriggers(Unknown Source)
> 	at org.apache.derby.impl.sql.execute.UpdateResultSet.open(Unknown Source)
> 	at org.apache.derby.impl.sql.GenericPreparedStatement.executeStmt(Unknown Source)
> 	at org.apache.derby.impl.sql.GenericPreparedStatement.execute(Unknown Source)
> 	... 103 more

--
This message is automatically generated by JIRA.
If you think it was sent incorrectly, please contact your JIRA administrators: https://issues.apache.org/jira/secure/ContactAdministrators!default.jspa
For more information on JIRA, see: http://www.atlassian.com/software/jira

        

Mime
View raw message