db-derby-dev mailing list archives: September 2011

Site index · List index
Message list« Previous · 1 · 2 · 3 · 4 · 5 · 6 · 7 · 8 · 9 · Next »Thread · Author · Date
Ole.Solb...@oracle.com Regression Test Report - Daily 1173737 - Sun DBTG Thu, 22 Sep, 15:55
Kathey Marsden (JIRA) [jira] [Created] (DERBY-5427) Unauthorized shutdown should not generate thread dump and javacore. AuthenticationTest dumps over 20 javacores with IBM JVM for normal user errors Thu, 22 Sep, 17:31
Kathey Marsden (JIRA) [jira] [Updated] (DERBY-5427) Unauthorized shutdown should not generate thread dump and javacore. AuthenticationTest dumps over 20 javacores with IBM JVM for normal user errors Thu, 22 Sep, 17:45
[jira] [Reopened] (DERBY-5426) Improve the error raised by too much contention on a sequence/identity.
Rick Hillegas (JIRA)   [jira] [Reopened] (DERBY-5426) Improve the error raised by too much contention on a sequence/identity. Thu, 22 Sep, 18:13
Mamta A. Satoor (JIRA)   [jira] [Reopened] (DERBY-5426) Improve the error raised by too much contention on a sequence/identity. Fri, 23 Sep, 19:51
[jira] [Resolved] (DERBY-5426) Improve the error raised by too much contention on a sequence/identity.
Rick Hillegas (JIRA)   [jira] [Resolved] (DERBY-5426) Improve the error raised by too much contention on a sequence/identity. Thu, 22 Sep, 18:13
Rick Hillegas (JIRA)   [jira] [Resolved] (DERBY-5426) Improve the error raised by too much contention on a sequence/identity. Thu, 22 Sep, 18:13
Mamta A. Satoor (Resolved) (JIRA)   [jira] [Resolved] (DERBY-5426) Improve the error raised by too much contention on a sequence/identity. Thu, 29 Sep, 19:57
[jira] [Closed] (DERBY-5426) Improve the error raised by too much contention on a sequence/identity.
Rick Hillegas (JIRA)   [jira] [Closed] (DERBY-5426) Improve the error raised by too much contention on a sequence/identity. Thu, 22 Sep, 18:13
Rick Hillegas (JIRA)   [jira] [Closed] (DERBY-5426) Improve the error raised by too much contention on a sequence/identity. Thu, 22 Sep, 18:13
[jira] [Commented] (DERBY-5209) 10.8 upgrade and compatibility testing
Kathey Marsden (JIRA)   [jira] [Commented] (DERBY-5209) 10.8 upgrade and compatibility testing Thu, 22 Sep, 18:15
Kathey Marsden (JIRA)   [jira] [Commented] (DERBY-5209) 10.8 upgrade and compatibility testing Fri, 23 Sep, 00:23
[jira] [Updated] (DERBY-5209) 10.8 upgrade and compatibility testing
Kathey Marsden (JIRA)   [jira] [Updated] (DERBY-5209) 10.8 upgrade and compatibility testing Thu, 22 Sep, 18:17
Kathey Marsden (JIRA)   [jira] [Updated] (DERBY-5209) 10.8 upgrade and compatibility testing Fri, 23 Sep, 00:25
Rick Hillegas (JIRA) [jira] [Resolved] (DERBY-5389) SequenceGeneratorTest failures with weme 6.2 sane build ASSERT FAILED Identity being changed on a live cacheable Thu, 22 Sep, 19:35
[jira] [Issue Comment Edited] (DERBY-5420) TableLockBasicTest is locale sensitive: failed with Norwegian locale on Windows.
Dag H. Wanvik (JIRA)   [jira] [Issue Comment Edited] (DERBY-5420) TableLockBasicTest is locale sensitive: failed with Norwegian locale on Windows. Thu, 22 Sep, 21:47
Dag H. Wanvik (JIRA)   [jira] [Issue Comment Edited] (DERBY-5420) TableLockBasicTest is locale sensitive: failed with Norwegian locale on Windows. Thu, 22 Sep, 21:51
Myrna van Lunteren (JIRA) [jira] [Created] (DERBY-5428) org.a Thu, 22 Sep, 22:57
Myrna van Lunteren (JIRA) [jira] [Updated] (DERBY-5428) ns test error: ERROR 38000: The exception 'org.apache.derby.shared.common.sanity.AssertFailure: ASSERT FAILED Identity being changed on a live cacheable. Old uuidString = 846c00a0-0132-88d8-fec0-000000080920' was thrown while evaluating an expression Thu, 22 Sep, 23:13
Kristian Waagan DERBY-5367 and the next 10.8.2 RC Thu, 22 Sep, 23:17
Myrna van Lunteren   Re: DERBY-5367 and the next 10.8.2 RC Thu, 22 Sep, 23:41
Kristian Waagan     Re: DERBY-5367 and the next 10.8.2 RC Fri, 23 Sep, 08:00
Kathey Marsden (JIRA) [jira] [Created] (DERBY-5429) With mixed jar versions the error java.lang.NoSuchMethodError: org/apache/derby/iapi/services/info/JVMInfo.javaDump() can occur because JVMInfo is in both derby.jar and derbyclient.jar Thu, 22 Sep, 23:47
Kathey Marsden (JIRA) [jira] [Assigned] (DERBY-5209) 10.8 upgrade and compatibility testing Fri, 23 Sep, 00:09
[jira] [Commented] (DERBY-5427) Unauthorized shutdown should not generate thread dump and javacore. AuthenticationTest dumps over 20 javacores with IBM JVM for normal user errors
Lily Wei (JIRA)   [jira] [Commented] (DERBY-5427) Unauthorized shutdown should not generate thread dump and javacore. AuthenticationTest dumps over 20 javacores with IBM JVM for normal user errors Fri, 23 Sep, 05:13
Kathey Marsden (JIRA)   [jira] [Commented] (DERBY-5427) Unauthorized shutdown should not generate thread dump and javacore. AuthenticationTest dumps over 20 javacores with IBM JVM for normal user errors Mon, 26 Sep, 16:13
Knut Anders Hatlen (JIRA) [jira] [Resolved] (DERBY-5419) Make Derby run on Oracle Java ME Embedded Client Fri, 23 Sep, 11:34
[jira] [Commented] (DERBY-5428) ns test error: ERROR 38000: The exception 'org.apache.derby.shared.common.sanity.AssertFailure: ASSERT FAILED Identity being changed on a live cacheable. Old uuidString = 846c00a0-0132-88d8-fec0-000000080920' was thrown while evaluating an expression
Rick Hillegas (JIRA)   [jira] [Commented] (DERBY-5428) ns test error: ERROR 38000: The exception 'org.apache.derby.shared.common.sanity.AssertFailure: ASSERT FAILED Identity being changed on a live cacheable. Old uuidString = 846c00a0-0132-88d8-fec0-000000080920' was thrown while evaluating an expression Fri, 23 Sep, 13:36
Rick Hillegas (JIRA)   [jira] [Commented] (DERBY-5428) ns test error: ERROR 38000: The exception 'org.apache.derby.shared.common.sanity.AssertFailure: ASSERT FAILED Identity being changed on a live cacheable. Old uuidString = 846c00a0-0132-88d8-fec0-000000080920' was thrown while evaluating an expression Fri, 23 Sep, 14:06
Myrna van Lunteren (JIRA)   [jira] [Commented] (DERBY-5428) ns test error: ERROR 38000: The exception 'org.apache.derby.shared.common.sanity.AssertFailure: ASSERT FAILED Identity being changed on a live cacheable. Old uuidString = 846c00a0-0132-88d8-fec0-000000080920' was thrown while evaluating an expression Fri, 23 Sep, 16:48
Rick Hillegas (JIRA)   [jira] [Commented] (DERBY-5428) ns test error: ERROR 38000: The exception 'org.apache.derby.shared.common.sanity.AssertFailure: ASSERT FAILED Identity being changed on a live cacheable. Old uuidString = 846c00a0-0132-88d8-fec0-000000080920' was thrown while evaluating an expression Fri, 23 Sep, 17:34
Katherine Marsden More. Trouble with JVMInfo Fri, 23 Sep, 14:26
Rick Hillegas   Re: More. Trouble with JVMInfo Fri, 23 Sep, 15:02
Knut Anders Hatlen     Re: More. Trouble with JVMInfo Fri, 23 Sep, 20:31
Rick Hillegas       Re: More. Trouble with JVMInfo Mon, 26 Sep, 13:34
Kathey Marsden         Re: More. Trouble with JVMInfo Mon, 26 Sep, 16:32
Kathey Marsden           Re: More. Trouble with JVMInfo Mon, 26 Sep, 16:54
Rick Hillegas           Re: More. Trouble with JVMInfo Mon, 26 Sep, 18:13
Rick Hillegas             Re: More. Trouble with JVMInfo Mon, 26 Sep, 19:41
Kathey Marsden             Re: More. Trouble with JVMInfo Mon, 26 Sep, 21:22
Rick Hillegas               Re: More. Trouble with JVMInfo Tue, 27 Sep, 12:21
Kathey Marsden                 Re: More. Trouble with JVMInfo Tue, 27 Sep, 13:05
Rick Hillegas                   Re: More. Trouble with JVMInfo Tue, 27 Sep, 14:25
Kathey Marsden                     Re: More. Trouble with JVMInfo Tue, 27 Sep, 16:17
Rick Hillegas                       Re: More. Trouble with JVMInfo Tue, 27 Sep, 16:50
Knut Anders Hatlen                   Re: More. Trouble with JVMInfo Tue, 27 Sep, 14:26
Kathey Marsden                     Re: More. Trouble with JVMInfo Tue, 27 Sep, 16:46
Knut Anders Hatlen                       Re: More. Trouble with JVMInfo Tue, 27 Sep, 20:09
Regression Test Report - Daily 1174232 - Sun DBTG
Ole.Solb...@Oracle.COM   Regression Test Report - Daily 1174232 - Sun DBTG Fri, 23 Sep, 15:55
Ole.Solb...@ORACLE.COM   Regression Test Report - Daily 1174232 - Sun DBTG Sat, 24 Sep, 15:55
Ole.Solb...@Oracle.COM   Regression Test Report - Daily 1174232 - Sun DBTG Sun, 25 Sep, 15:55
Ole.Solb...@Oracle.COM   Regression Test Report - Daily 1174232 - Sun DBTG Mon, 26 Sep, 15:55
[jira] [Commented] (DERBY-5419) Make Derby run on Oracle Java ME Embedded Client
Myrna van Lunteren (JIRA)   [jira] [Commented] (DERBY-5419) Make Derby run on Oracle Java ME Embedded Client Fri, 23 Sep, 16:16
Knut Anders Hatlen (JIRA)   [jira] [Commented] (DERBY-5419) Make Derby run on Oracle Java ME Embedded Client Fri, 23 Sep, 20:53
[jira] [Updated] (DERBY-5420) TableLockBasicTest is locale sensitive: failed with Norwegian locale on Windows.
Dag H. Wanvik (JIRA)   [jira] [Updated] (DERBY-5420) TableLockBasicTest is locale sensitive: failed with Norwegian locale on Windows. Fri, 23 Sep, 20:05
Dag H. Wanvik (JIRA)   [jira] [Updated] (DERBY-5420) TableLockBasicTest is locale sensitive: failed with Norwegian locale on Windows. Fri, 23 Sep, 20:43
Dag H. Wanvik (JIRA) [jira] [Updated] (DERBY-5420) Regression suite is locale sensitive: failed in TableLockBasicTest with Norwegian locale on Windows. Fri, 23 Sep, 20:47
[jira] [Commented] (DERBY-5420) Regression suite is locale sensitive: failed in TableLockBasicTest with Norwegian locale on Windows.
Knut Anders Hatlen (JIRA)   [jira] [Commented] (DERBY-5420) Regression suite is locale sensitive: failed in TableLockBasicTest with Norwegian locale on Windows. Sat, 24 Sep, 07:53
Dag H. Wanvik (Commented) (JIRA)   [jira] [Commented] (DERBY-5420) Regression suite is locale sensitive: failed in TableLockBasicTest with Norwegian locale on Windows. Mon, 26 Sep, 22:07
Dag H. Wanvik (Commented) (JIRA)   [jira] [Commented] (DERBY-5420) Regression suite is locale sensitive: failed in TableLockBasicTest with Norwegian locale on Windows. Mon, 26 Sep, 22:09
Kristian Waagan (JIRA) [jira] [Resolved] (DERBY-5367) Stale data retrieved when using new collation=TERRITORY_BASED:PRIMARY feature Sat, 24 Sep, 14:25
Myrna van Lunteren (JIRA) [jira] [Created] (DERBY-5430) Embedded nstest shows ERROR 40001: A lock could not be obtained due to a deadlock, in nstest Mon, 26 Sep, 17:15
Kathey Marsden (JIRA) [jira] [Reopened] (DERBY-1046) JVMInfo is duplicated in derbyclient.jar Mon, 26 Sep, 17:15
[jira] [Commented] (DERBY-1046) JVMInfo is duplicated in derbyclient.jar
Kathey Marsden (JIRA)   [jira] [Commented] (DERBY-1046) JVMInfo is duplicated in derbyclient.jar Mon, 26 Sep, 17:17
Knut Anders Hatlen (Commented) (JIRA)   [jira] [Commented] (DERBY-1046) JVMInfo is duplicated in derbyclient.jar Wed, 28 Sep, 13:03
Rick Hillegas (Commented) (JIRA)   [jira] [Commented] (DERBY-1046) JVMInfo is duplicated in derbyclient.jar Wed, 28 Sep, 13:11
Rick Hillegas (Commented) (JIRA)   [jira] [Commented] (DERBY-1046) JVMInfo is duplicated in derbyclient.jar Wed, 28 Sep, 13:19
Kathey Marsden (Commented) (JIRA)   [jira] [Commented] (DERBY-1046) JVMInfo is duplicated in derbyclient.jar Wed, 28 Sep, 15:44
Knut Anders Hatlen (Commented) (JIRA)   [jira] [Commented] (DERBY-1046) JVMInfo is duplicated in derbyclient.jar Thu, 29 Sep, 07:54
[jira] [Updated] (DERBY-5420) Regression suite appears locale sensitive: failed in TableLockBasicTest: bug in RealBasicNoPutResultSetStatistics
Dag H. Wanvik (Updated) (JIRA)   [jira] [Updated] (DERBY-5420) Regression suite appears locale sensitive: failed in TableLockBasicTest: bug in RealBasicNoPutResultSetStatistics Mon, 26 Sep, 22:13
Dag H. Wanvik (Updated) (JIRA)   [jira] [Updated] (DERBY-5420) Regression suite appears locale sensitive: failed in TableLockBasicTest: bug in RealBasicNoPutResultSetStatistics Tue, 27 Sep, 01:16
Dag H. Wanvik (Updated) (JIRA)   [jira] [Updated] (DERBY-5420) Regression suite appears locale sensitive: failed in TableLockBasicTest: bug in RealBasicNoPutResultSetStatistics Tue, 27 Sep, 21:56
Kathey Marsden (Created) (JIRA) [jira] [Created] (DERBY-5431) If 10.7 or greater derbyclient.jar is in the classpath before an older release's server jars, derby fails to boot with NoSuchFieldError for JVMInfo.JAVA_SQL_TYPES_BOOLEAN Mon, 26 Sep, 23:35
Timothy Miller (Created) (JIRA) [jira] [Created] (DERBY-5432) Space in default installation directory makes tools (e.g. dblook) unrunnable Tue, 27 Sep, 00:25
Myrna van Lunteren (Created) (JIRA) [jira] [Created] (DERBY-5433) testOSReadOnly(org.apache.derbyTesting.functionTests.tests.store.OSReadOnlyTest)junit.framework.AssertionFailedError: expected an error indicating the db is readonly Tue, 27 Sep, 00:55
Myrna van Lunteren (Updated) (JIRA) [jira] [Updated] (DERBY-5433) testOSReadOnly(org.apache.derbyTesting.functionTests.tests.store.OSReadOnlyTest)junit.framework.AssertionFailedError: expected an error indicating the db is readonly Tue, 27 Sep, 00:59
Knut Anders Hatlen (Commented) (JIRA) [jira] [Commented] (DERBY-5432) Space in default installation directory makes tools (e.g. dblook) unrunnable Tue, 27 Sep, 08:32
[jira] [Commented] (DERBY-5420) Regression suite appears locale sensitive: failed in TableLockBasicTest: bug in RealBasicNoPutResultSetStatistics
Knut Anders Hatlen (Commented) (JIRA)   [jira] [Commented] (DERBY-5420) Regression suite appears locale sensitive: failed in TableLockBasicTest: bug in RealBasicNoPutResultSetStatistics Tue, 27 Sep, 09:38
Dag H. Wanvik (Commented) (JIRA)   [jira] [Commented] (DERBY-5420) Regression suite appears locale sensitive: failed in TableLockBasicTest: bug in RealBasicNoPutResultSetStatistics Tue, 27 Sep, 21:54
Dag H. Wanvik (Commented) (JIRA)   [jira] [Commented] (DERBY-5420) Regression suite appears locale sensitive: failed in TableLockBasicTest: bug in RealBasicNoPutResultSetStatistics Wed, 28 Sep, 16:10
Rick Hillegas (Commented) (JIRA) [jira] [Commented] (DERBY-5431) If 10.7 or greater derbyclient.jar is in the classpath before an older release's server jars, derby fails to boot with NoSuchFieldError for JVMInfo.JAVA_SQL_TYPES_BOOLEAN Tue, 27 Sep, 12:29
Ole.Solb...@Oracle.COM Regression Test Report - Daily 1175918 - Sun DBTG Tue, 27 Sep, 15:55
Kathey Marsden (Assigned) (JIRA) [jira] [Assigned] (DERBY-1046) JVMInfo is duplicated in derbyclient.jar Tue, 27 Sep, 17:33
[jira] [Commented] (DERBY-5430) Embedded nstest shows ERROR 40001: A lock could not be obtained due to a deadlock, in nstest
Rick Hillegas (Commented) (JIRA)   [jira] [Commented] (DERBY-5430) Embedded nstest shows ERROR 40001: A lock could not be obtained due to a deadlock, in nstest Tue, 27 Sep, 17:45
Rick Hillegas (Commented) (JIRA)   [jira] [Commented] (DERBY-5430) Embedded nstest shows ERROR 40001: A lock could not be obtained due to a deadlock, in nstest Tue, 27 Sep, 19:39
Myrna van Lunteren (Commented) (JIRA)   [jira] [Commented] (DERBY-5430) Embedded nstest shows ERROR 40001: A lock could not be obtained due to a deadlock, in nstest Tue, 27 Sep, 20:30
Knut Anders Hatlen (Commented) (JIRA)   [jira] [Commented] (DERBY-5430) Embedded nstest shows ERROR 40001: A lock could not be obtained due to a deadlock, in nstest Wed, 28 Sep, 08:26
Rick Hillegas (Commented) (JIRA)   [jira] [Commented] (DERBY-5430) Embedded nstest shows ERROR 40001: A lock could not be obtained due to a deadlock, in nstest Wed, 28 Sep, 13:36
Rick Hillegas (Commented) (JIRA)   [jira] [Commented] (DERBY-5430) Embedded nstest shows ERROR 40001: A lock could not be obtained due to a deadlock, in nstest Wed, 28 Sep, 13:46
Kathey Marsden (Commented) (JIRA)   [jira] [Commented] (DERBY-5430) Embedded nstest shows ERROR 40001: A lock could not be obtained due to a deadlock, in nstest Wed, 28 Sep, 17:10
Dag H. Wanvik known error in tools/derbyrunjartest.java? Tue, 27 Sep, 19:37
Knut Anders Hatlen   Re: known error in tools/derbyrunjartest.java? Tue, 27 Sep, 20:32
Dag H. Wanvik     Re: known error in tools/derbyrunjartest.java? Tue, 27 Sep, 23:12
Message list« Previous · 1 · 2 · 3 · 4 · 5 · 6 · 7 · 8 · 9 · Next »Thread · Author · Date
Box list
Aug 2014500
Jul 2014570
Jun 2014712
May 2014698
Apr 2014464
Mar 2014895
Feb 2014630
Jan 2014475
Dec 2013329
Nov 2013524
Oct 2013875
Sep 2013562
Aug 2013618
Jul 2013657
Jun 20131166
May 2013788
Apr 20131185
Mar 2013588
Feb 2013664
Jan 2013538
Dec 2012331
Nov 2012446
Oct 2012636
Sep 2012663
Aug 2012384
Jul 2012481
Jun 2012586
May 2012900
Apr 2012709
Mar 2012767
Feb 2012897
Jan 2012391
Dec 2011478
Nov 2011444
Oct 2011576
Sep 2011744
Aug 2011684
Jul 2011722
Jun 2011804
May 2011605
Apr 2011574
Mar 20111193
Feb 20111393
Jan 2011834
Dec 2010535
Nov 2010595
Oct 2010703
Sep 2010673
Aug 2010657
Jul 2010848
Jun 2010929
May 2010709
Apr 2010885
Mar 2010673
Feb 2010646
Jan 2010638
Dec 2009566
Nov 2009660
Oct 2009604
Sep 2009505
Aug 2009921
Jul 20091312
Jun 20091035
May 2009835
Apr 20091088
Mar 2009884
Feb 2009541
Jan 2009692
Dec 2008522
Nov 2008616
Oct 2008723
Sep 2008455
Aug 2008754
Jul 2008988
Jun 2008871
May 2008842
Apr 20081384
Mar 20081904
Feb 20082074
Jan 20081539
Dec 2007852
Nov 20071273
Oct 20071391
Sep 2007911
Aug 2007908
Jul 20071492
Jun 20072222
May 20072295
Apr 20071394
Mar 20072200
Feb 20071383
Jan 20071360
Dec 20061026
Nov 20061413
Oct 20061324
Sep 20062319
Aug 20063287
Jul 20062434
Jun 20061712
May 20061602
Apr 20061694
Mar 20061985
Feb 20062535
Jan 20061640
Dec 2005741
Nov 20051157
Oct 20051185
Sep 2005783
Aug 2005896
Jul 2005652
Jun 20051494
May 20051323
Apr 2005684
Mar 2005612
Feb 2005351
Jan 2005438
Dec 2004435
Nov 2004274
Oct 2004281
Sep 2004388
Aug 2004160