db-derby-dev mailing list archives

Site index · List index
Message view « Date » · « Thread »
Top « Date » · « Thread »
From "Knut Anders Hatlen (JIRA)" <j...@apache.org>
Subject [jira] [Commented] (DERBY-5263) xmlTestTriggerWithXMLOperators(org.apache.derbyTesting.functionTests.tests.upgradeTests.BasicSetup) fails with java.lang.NoSuchMethodError
Date Tue, 07 Jun 2011 08:29:59 GMT

    [ https://issues.apache.org/jira/browse/DERBY-5263?page=com.atlassian.jira.plugin.system.issuetabpanels:comment-tabpanel&focusedCommentId=13045321#comment-13045321
] 

Knut Anders Hatlen commented on DERBY-5263:
-------------------------------------------

I am able to reproduce this on both trunk and 10.8 if I run the tests with java.endorsed.dirs
pointing to a directory containing the Xalan jars. The errors happen in the post soft upgrade
phase with the 10.5.x and 10.6.x versions. Upgrade from earlier or later versions than 10.5/10.6
seems to work fine. Given that it only seems to be a problem with 10.5 and 10.6, I suspect
that the root cause is similar to or somehow related to DERBY-4835, which was a problem with
trigger plans not getting recompiled after upgrade from 10.5/10.6.

> xmlTestTriggerWithXMLOperators(org.apache.derbyTesting.functionTests.tests.upgradeTests.BasicSetup)
fails with java.lang.NoSuchMethodError
> ------------------------------------------------------------------------------------------------------------------------------------------
>
>                 Key: DERBY-5263
>                 URL: https://issues.apache.org/jira/browse/DERBY-5263
>             Project: Derby
>          Issue Type: Bug
>          Components: SQL
>    Affects Versions: 10.8.1.2
>            Reporter: Kathey Marsden
>            Assignee: Knut Anders Hatlen
>
> On the 10.8 branch, xmlTestTriggerWithXMLOperators is failing with revision 1132702 possibly
after the following checkin:
> DERBY-3870: Concurrent Inserts of rows with XML data results in an exception
> Merged fix from trunk (revisions 1101839, 1125305, 1126358, 1127883
> and 1132546).
> Bumped last digit in version number on the branch so that stored
> prepared statements will be invalidated (needed in case they use XML
> operators since the format of query plans using those operators has
> changed).
> It looks like the behavior if the version were not bumped, but it actually was, so not
sure what the issue is.
> There were 4 errors:
> 1) xmlTestTriggerWithXMLOperators(org.apache.derbyTesting.functionTests.tests.upgradeTests.BasicSetup)java.sql.SQLException:
Java exception: 'org/apache/derby/iapi/sql/execute/ResultSetFactory.getBulkTableScanResultSet(Lorg/apache/derby/iapi/sql/Activation;JILorg/apache/derby/iapi/services/loader/GeneratedMethod;ILorg/apache/derby/iapi/services/loader/GeneratedMethod;ILorg/apache/derby/iapi/services/loader/GeneratedMethod;IZ[[Lorg/apache/derby/iapi/store/access/Qualifier;Ljava/lang/String;Ljava/lang/String;Ljava/lang/String;ZZIIIZIIZZDD)Lorg/apache/derby/iapi/sql/execute/NoPutResultSet;:
java.lang.NoSuchMethodError'.
>     at org.apache.derby.impl.jdbc.SQLExceptionFactory40.getSQLException(Unknown Source)
>     at org.apache.derby.impl.jdbc.Util.newEmbedSQLException(Unknown Source)
>     at org.apache.derby.impl.jdbc.Util.javaException(Unknown Source)
>     at org.apache.derby.impl.jdbc.TransactionResourceImpl.wrapInSQLException(Unknown
Source)
>     at org.apache.derby.impl.jdbc.TransactionResourceImpl.handleException(Unknown Source)
>     at org.apache.derby.impl.jdbc.EmbedConnection.handleException(Unknown Source)
>     at org.apache.derby.impl.jdbc.ConnectionChild.handleException(Unknown Source)
>     at org.apache.derby.impl.jdbc.EmbedStatement.executeStatement(Unknown Source)
>     at org.apache.derby.impl.jdbc.EmbedStatement.execute(Unknown Source)
>     at org.apache.derby.impl.jdbc.EmbedStatement.execute(Unknown Source)
>     at org.apache.derbyTesting.functionTests.tests.upgradeTests.BasicSetup.xmlTestTriggerWithXMLOperators(BasicSetup.java:832)
>     at sun.reflect.GeneratedMethodAccessor1855.invoke(Unknown Source)
>     at sun.reflect.DelegatingMethodAccessorImpl.invoke(DelegatingMethodAccessorImpl.java:37)
>     at org.apache.derbyTesting.junit.BaseTestCase.runBare(BaseTestCase.java:112)
>     at junit.extensions.TestDecorator.basicRun(TestDecorator.java:22)
>     at junit.extensions.TestSetup$1.protect(TestSetup.java:19)
>     at junit.extensions.TestSetup.run(TestSetup.java:23)
>     at junit.extensions.TestDecorator.basicRun(TestDecorator.java:22)
>     at junit.extensions.TestSetup$1.protect(TestSetup.java:19)
>     at junit.extensions.TestSetup.run(TestSetup.java:23)
>     at org.apache.derbyTesting.junit.BaseTestSetup.run(BaseTestSetup.java:57)
>     at junit.extensions.TestDecorator.basicRun(TestDecorator.java:22)
>     at junit.extensions.TestSetup$1.protect(TestSetup.java:19)
>     at junit.extensions.TestSetup.run(TestSetup.java:23)
>     at org.apache.derbyTesting.junit.BaseTestSetup.run(BaseTestSetup.java:57)
>     at junit.extensions.TestDecorator.basicRun(TestDecorator.java:22)
>     at junit.extensions.TestSetup$1.protect(TestSetup.java:19)
>     at junit.extensions.TestSetup.run(TestSetup.java:23)
>     at junit.extensions.TestDecorator.basicRun(TestDecorator.java:22)
>     at junit.extensions.TestSetup$1.protect(TestSetup.java:19)
>     at junit.extensions.TestSetup.run(TestSetup.java:23)
>     at org.apache.derbyTesting.junit.BaseTestSetup.run(BaseTestSetup.java:57)
>     at junit.extensions.TestDecorator.basicRun(TestDecorator.java:22)
>     at junit.extensions.TestSetup$1.protect(TestSetup.java:19)
>     at junit.extensions.TestSetup.run(TestSetup.java:23)
>     at junit.extensions.TestDecorator.basicRun(TestDecorator.java:22)
>     at junit.extensions.TestSetup$1.protect(TestSetup.java:19)
>     at junit.extensions.TestSetup.run(TestSetup.java:23)
>     at org.apache.derbyTesting.junit.BaseTestSetup.run(BaseTestSetup.java:57)
>     at junit.extensions.TestDecorator.basicRun(TestDecorator.java:22)
>     at junit.extensions.TestSetup$1.protect(TestSetup.java:19)
>     at junit.extensions.TestSetup.run(TestSetup.java:23)
>     at junit.extensions.TestDecorator.basicRun(TestDecorator.java:22)
>     at junit.extensions.TestSetup$1.protect(TestSetup.java:19)
>     at junit.extensions.TestSetup.run(TestSetup.java:23)
>     at org.apache.derbyTesting.junit.BaseTestSetup.run(BaseTestSetup.java:57)
>     at junit.extensions.TestDecorator.basicRun(TestDecorator.java:22)
>     at junit.extensions.TestSetup$1.protect(TestSetup.java:19)
>     at junit.extensions.TestSetup.run(TestSetup.java:23)
>     at junit.extensions.TestDecorator.basicRun(TestDecorator.java:22)
>     at junit.extensions.TestSetup$1.protect(TestSetup.java:19)
>     at junit.extensions.TestSetup.run(TestSetup.java:23)
>     at org.apache.derbyTesting.junit.BaseTestSetup.run(BaseTestSetup.java:57)
>     at junit.extensions.TestDecorator.basicRun(TestDecorator.java:22)
>     at junit.extensions.TestSetup$1.protect(TestSetup.java:19)
>     at junit.extensions.TestSetup.run(TestSetup.java:23)
>     at junit.extensions.TestDecorator.basicRun(TestDecorator.java:22)
>     at junit.extensions.TestSetup$1.protect(TestSetup.java:19)
>     at junit.extensions.TestSetup.run(TestSetup.java:23)
>     at org.apache.derbyTesting.junit.BaseTestSetup.run(BaseTestSetup.java:57)
>     at junit.extensions.TestDecorator.basicRun(TestDecorator.java:22)
>     at junit.extensions.TestSetup$1.protect(TestSetup.java:19)
>     at junit.extensions.TestSetup.run(TestSetup.java:23)
>     at junit.extensions.TestDecorator.basicRun(TestDecorator.java:22)
>     at junit.extensions.TestSetup$1.protect(TestSetup.java:19)
>     at junit.extensions.TestSetup.run(TestSetup.java:23)
>     at junit.extensions.TestDecorator.basicRun(TestDecorator.java:22)
>     at junit.extensions.TestSetup$1.protect(TestSetup.java:19)
>     at junit.extensions.TestSetup.run(TestSetup.java:23)
> Caused by: java.sql.SQLException: Java exception: 'org/apache/derby/iapi/sql/execute/ResultSetFactory.getBulkTableScanResultSet(Lorg/apache/derby/iapi/sql/Activation;JILorg/apache/derby/iapi/services/loader/GeneratedMethod;ILorg/apache/derby/iapi/services/loader/GeneratedMethod;ILorg/apache/derby/iapi/services/loader/GeneratedMethod;IZ[[Lorg/apache/derby/iapi/store/access/Qualifier;Ljava/lang/String;Ljava/lang/String;Ljava/lang/String;ZZIIIZIIZZDD)Lorg/apache/derby/iapi/sql/execute/NoPutResultSet;:
java.lang.NoSuchMethodError'.
>     at org.apache.derby.impl.jdbc.SQLExceptionFactory.getSQLException(Unknown Source)
>     at org.apache.derby.impl.jdbc.SQLExceptionFactory40.wrapArgsForTransportAcrossDRDA(Unknown
Source)
>     ... 103 more
> Caused by: java.lang.NoSuchMethodError: org/apache/derby/iapi/sql/execute/ResultSetFactory.getBulkTableScanResultSet(Lorg/apache/derby/iapi/sql/Activation;JILorg/apache/derby/iapi/services/loader/GeneratedMethod;ILorg/apache/derby/iapi/services/loader/GeneratedMethod;ILorg/apache/derby/iapi/services/loader/GeneratedMethod;IZ[[Lorg/apache/derby/iapi/store/access/Qualifier;Ljava/lang/String;Ljava/lang/String;Ljava/lang/String;ZZIIIZIIZZDD)Lorg/apache/derby/iapi/sql/execute/NoPutResultSet;
>     at org.apache.derby.exe.aca44f56b0x0130x65f4xef99x0000549f72364.fillResultSet(Unknown
Source)
>     at org.apache.derby.exe.aca44f56b0x0130x65f4xef99x0000549f72364.execute(Unknown Source)
>     at org.apache.derby.impl.sql.GenericActivationHolder.execute(Unknown Source)
>     at org.apache.derby.impl.sql.GenericPreparedStatement.executeStmt(Unknown Source)
>     at org.apache.derby.impl.sql.GenericPreparedStatement.executeSubStatement(Unknown
Source)
>     at org.apache.derby.impl.sql.execute.GenericTriggerExecutor.executeSPS(Unknown Source)
>     at org.apache.derby.impl.sql.execute.StatementTriggerExecutor.fireTrigger(Unknown
Source)
>     at org.apache.derby.impl.sql.execute.TriggerEventActivator.notifyEvent(Unknown Source)
>     at org.apache.derby.impl.sql.execute.InsertResultSet.normalInsertCore(Unknown Source)
>     at org.apache.derby.impl.sql.execute.InsertResultSet.open(Unknown Source)
>     at org.apache.derby.impl.sql.GenericPreparedStatement.executeStmt(Unknown Source)
>     at org.apache.derby.impl.sql.GenericPreparedStatement.execute(Unknown Source)
>     ... 96 more
> 2) xmlTestTriggerWithXMLOperators(org.apache.derbyTesting.functionTests.tests.upgradeTests.BasicSetup)java.sql.SQLException:
Java exception: 'org/apache/derby/iapi/sql/execute/ResultSetFactory.getBulkTableScanResultSet(Lorg/apache/derby/iapi/sql/Activation;JILorg/apache/derby/iapi/services/loader/GeneratedMethod;ILorg/apache/derby/iapi/services/loader/GeneratedMethod;ILorg/apache/derby/iapi/services/loader/GeneratedMethod;IZ[[Lorg/apache/derby/iapi/store/access/Qualifier;Ljava/lang/String;Ljava/lang/String;Ljava/lang/String;ZZIIIZIIZZDD)Lorg/apache/derby/iapi/sql/execute/NoPutResultSet;:
java.lang.NoSuchMethodError'.
>     at org.apache.derby.impl.jdbc.SQLExceptionFactory40.getSQLException(Unknown Source)
>     at org.apache.derby.impl.jdbc.Util.newEmbedSQLException(Unknown Source)
>     at org.apache.derby.impl.jdbc.Util.javaException(Unknown Source)
>     at org.apache.derby.impl.jdbc.TransactionResourceImpl.wrapInSQLException(Unknown
Source)
>     at org.apache.derby.impl.jdbc.TransactionResourceImpl.handleException(Unknown Source)
>     at org.apache.derby.impl.jdbc.EmbedConnection.handleException(Unknown Source)
>     at org.apache.derby.impl.jdbc.ConnectionChild.handleException(Unknown Source)
>     at org.apache.derby.impl.jdbc.EmbedStatement.executeStatement(Unknown Source)
>     at org.apache.derby.impl.jdbc.EmbedStatement.execute(Unknown Source)
>     at org.apache.derby.impl.jdbc.EmbedStatement.execute(Unknown Source)
>     at org.apache.derbyTesting.functionTests.tests.upgradeTests.BasicSetup.xmlTestTriggerWithXMLOperators(BasicSetup.java:832)
>     at sun.reflect.GeneratedMethodAccessor1855.invoke(Unknown Source)
>     at sun.reflect.DelegatingMethodAccessorImpl.invoke(DelegatingMethodAccessorImpl.java:37)
>     at org.apache.derbyTesting.junit.BaseTestCase.runBare(BaseTestCase.java:112)
>     at junit.extensions.TestDecorator.basicRun(TestDecorator.java:22)
>     at junit.extensions.TestSetup$1.protect(TestSetup.java:19)
>     at junit.extensions.TestSetup.run(TestSetup.java:23)
>     at junit.extensions.TestDecorator.basicRun(TestDecorator.java:22)
>     at junit.extensions.TestSetup$1.protect(TestSetup.java:19)
>     at junit.extensions.TestSetup.run(TestSetup.java:23)
>     at org.apache.derbyTesting.junit.BaseTestSetup.run(BaseTestSetup.java:57)
>     at junit.extensions.TestDecorator.basicRun(TestDecorator.java:22)
>     at junit.extensions.TestSetup$1.protect(TestSetup.java:19)
>     at junit.extensions.TestSetup.run(TestSetup.java:23)
>     at org.apache.derbyTesting.junit.BaseTestSetup.run(BaseTestSetup.java:57)
>     at junit.extensions.TestDecorator.basicRun(TestDecorator.java:22)
>     at junit.extensions.TestSetup$1.protect(TestSetup.java:19)
>     at junit.extensions.TestSetup.run(TestSetup.java:23)
>     at junit.extensions.TestDecorator.basicRun(TestDecorator.java:22)
>     at junit.extensions.TestSetup$1.protect(TestSetup.java:19)
>     at junit.extensions.TestSetup.run(TestSetup.java:23)
>     at org.apache.derbyTesting.junit.BaseTestSetup.run(BaseTestSetup.java:57)
>     at junit.extensions.TestDecorator.basicRun(TestDecorator.java:22)
>     at junit.extensions.TestSetup$1.protect(TestSetup.java:19)
>     at junit.extensions.TestSetup.run(TestSetup.java:23)
>     at junit.extensions.TestDecorator.basicRun(TestDecorator.java:22)
>     at junit.extensions.TestSetup$1.protect(TestSetup.java:19)
>     at junit.extensions.TestSetup.run(TestSetup.java:23)
>     at org.apache.derbyTesting.junit.BaseTestSetup.run(BaseTestSetup.java:57)
>     at junit.extensions.TestDecorator.basicRun(TestDecorator.java:22)
>     at junit.extensions.TestSetup$1.protect(TestSetup.java:19)
>     at junit.extensions.TestSetup.run(TestSetup.java:23)
>     at junit.extensions.TestDecorator.basicRun(TestDecorator.java:22)
>     at junit.extensions.TestSetup$1.protect(TestSetup.java:19)
>     at junit.extensions.TestSetup.run(TestSetup.java:23)
>     at org.apache.derbyTesting.junit.BaseTestSetup.run(BaseTestSetup.java:57)
>     at junit.extensions.TestDecorator.basicRun(TestDecorator.java:22)
>     at junit.extensions.TestSetup$1.protect(TestSetup.java:19)
>     at junit.extensions.TestSetup.run(TestSetup.java:23)
>     at junit.extensions.TestDecorator.basicRun(TestDecorator.java:22)
>     at junit.extensions.TestSetup$1.protect(TestSetup.java:19)
>     at junit.extensions.TestSetup.run(TestSetup.java:23)
>     at org.apache.derbyTesting.junit.BaseTestSetup.run(BaseTestSetup.java:57)
>     at junit.extensions.TestDecorator.basicRun(TestDecorator.java:22)
>     at junit.extensions.TestSetup$1.protect(TestSetup.java:19)
>     at junit.extensions.TestSetup.run(TestSetup.java:23)
>     at junit.extensions.TestDecorator.basicRun(TestDecorator.java:22)
>     at junit.extensions.TestSetup$1.protect(TestSetup.java:19)
>     at junit.extensions.TestSetup.run(TestSetup.java:23)
>     at org.apache.derbyTesting.junit.BaseTestSetup.run(BaseTestSetup.java:57)
>     at junit.extensions.TestDecorator.basicRun(TestDecorator.java:22)
>     at junit.extensions.TestSetup$1.protect(TestSetup.java:19)
>     at junit.extensions.TestSetup.run(TestSetup.java:23)
>     at junit.extensions.TestDecorator.basicRun(TestDecorator.java:22)
>     at junit.extensions.TestSetup$1.protect(TestSetup.java:19)
>     at junit.extensions.TestSetup.run(TestSetup.java:23)
>     at junit.extensions.TestDecorator.basicRun(TestDecorator.java:22)
>     at junit.extensions.TestSetup$1.protect(TestSetup.java:19)
>     at junit.extensions.TestSetup.run(TestSetup.java:23)
> Caused by: java.sql.SQLException: Java exception: 'org/apache/derby/iapi/sql/execute/ResultSetFactory.getBulkTableScanResultSet(Lorg/apache/derby/iapi/sql/Activation;JILorg/apache/derby/iapi/services/loader/GeneratedMethod;ILorg/apache/derby/iapi/services/loader/GeneratedMethod;ILorg/apache/derby/iapi/services/loader/GeneratedMethod;IZ[[Lorg/apache/derby/iapi/store/access/Qualifier;Ljava/lang/String;Ljava/lang/String;Ljava/lang/String;ZZIIIZIIZZDD)Lorg/apache/derby/iapi/sql/execute/NoPutResultSet;:
java.lang.NoSuchMethodError'.
>     at org.apache.derby.impl.jdbc.SQLExceptionFactory.getSQLException(Unknown Source)
>     at org.apache.derby.impl.jdbc.SQLExceptionFactory40.wrapArgsForTransportAcrossDRDA(Unknown
Source)
>     ... 103 more
> Caused by: java.lang.NoSuchMethodError: org/apache/derby/iapi/sql/execute/ResultSetFactory.getBulkTableScanResultSet(Lorg/apache/derby/iapi/sql/Activation;JILorg/apache/derby/iapi/services/loader/GeneratedMethod;ILorg/apache/derby/iapi/services/loader/GeneratedMethod;ILorg/apache/derby/iapi/services/loader/GeneratedMethod;IZ[[Lorg/apache/derby/iapi/store/access/Qualifier;Ljava/lang/String;Ljava/lang/String;Ljava/lang/String;ZZIIIZIIZZDD)Lorg/apache/derby/iapi/sql/execute/NoPutResultSet;
>     at org.apache.derby.exe.ac83e5596dx0130x65f4xef99x0000549f72364.fillResultSet(Unknown
Source)
>     at org.apache.derby.exe.ac83e5596dx0130x65f4xef99x0000549f72364.execute(Unknown Source)
>     at org.apache.derby.impl.sql.GenericActivationHolder.execute(Unknown Source)
>     at org.apache.derby.impl.sql.GenericPreparedStatement.executeStmt(Unknown Source)
>     at org.apache.derby.impl.sql.GenericPreparedStatement.executeSubStatement(Unknown
Source)
>     at org.apache.derby.impl.sql.execute.GenericTriggerExecutor.executeSPS(Unknown Source)
>     at org.apache.derby.impl.sql.execute.StatementTriggerExecutor.fireTrigger(Unknown
Source)
>     at org.apache.derby.impl.sql.execute.TriggerEventActivator.notifyEvent(Unknown Source)
>     at org.apache.derby.impl.sql.execute.InsertResultSet.normalInsertCore(Unknown Source)
>     at org.apache.derby.impl.sql.execute.InsertResultSet.open(Unknown Source)
>     at org.apache.derby.impl.sql.GenericPreparedStatement.executeStmt(Unknown Source)
>     at org.apache.derby.impl.sql.GenericPreparedStatement.execute(Unknown Source)
>     ... 96 more
> 3) xmlTestTriggerWithXMLOperators(org.apache.derbyTesting.functionTests.tests.upgradeTests.BasicSetup)java.sql.SQLException:
Java exception: 'org/apache/derby/iapi/sql/execute/ResultSetFactory.getBulkTableScanResultSet(Lorg/apache/derby/iapi/sql/Activation;JILorg/apache/derby/iapi/services/loader/GeneratedMethod;ILorg/apache/derby/iapi/services/loader/GeneratedMethod;ILorg/apache/derby/iapi/services/loader/GeneratedMethod;IZ[[Lorg/apache/derby/iapi/store/access/Qualifier;Ljava/lang/String;Ljava/lang/String;Ljava/lang/String;ZZIIIZIIZZDD)Lorg/apache/derby/iapi/sql/execute/NoPutResultSet;:
java.lang.NoSuchMethodError'.
>     at org.apache.derby.impl.jdbc.SQLExceptionFactory40.getSQLException(Unknown Source)
>     at org.apache.derby.impl.jdbc.Util.newEmbedSQLException(Unknown Source)
>     at org.apache.derby.impl.jdbc.Util.javaException(Unknown Source)
>     at org.apache.derby.impl.jdbc.TransactionResourceImpl.wrapInSQLException(Unknown
Source)
>     at org.apache.derby.impl.jdbc.TransactionResourceImpl.handleException(Unknown Source)
>     at org.apache.derby.impl.jdbc.EmbedConnection.handleException(Unknown Source)
>     at org.apache.derby.impl.jdbc.ConnectionChild.handleException(Unknown Source)
>     at org.apache.derby.impl.jdbc.EmbedStatement.executeStatement(Unknown Source)
>     at org.apache.derby.impl.jdbc.EmbedStatement.execute(Unknown Source)
>     at org.apache.derby.impl.jdbc.EmbedStatement.execute(Unknown Source)
>     at org.apache.derbyTesting.functionTests.tests.upgradeTests.BasicSetup.xmlTestTriggerWithXMLOperators(BasicSetup.java:832)
>     at sun.reflect.GeneratedMethodAccessor1855.invoke(Unknown Source)
>     at sun.reflect.DelegatingMethodAccessorImpl.invoke(DelegatingMethodAccessorImpl.java:37)
>     at org.apache.derbyTesting.junit.BaseTestCase.runBare(BaseTestCase.java:112)
>     at junit.extensions.TestDecorator.basicRun(TestDecorator.java:22)
>     at junit.extensions.TestSetup$1.protect(TestSetup.java:19)
>     at junit.extensions.TestSetup.run(TestSetup.java:23)
>     at junit.extensions.TestDecorator.basicRun(TestDecorator.java:22)
>     at junit.extensions.TestSetup$1.protect(TestSetup.java:19)
>     at junit.extensions.TestSetup.run(TestSetup.java:23)
>     at org.apache.derbyTesting.junit.BaseTestSetup.run(BaseTestSetup.java:57)
>     at junit.extensions.TestDecorator.basicRun(TestDecorator.java:22)
>     at junit.extensions.TestSetup$1.protect(TestSetup.java:19)
>     at junit.extensions.TestSetup.run(TestSetup.java:23)
>     at org.apache.derbyTesting.junit.BaseTestSetup.run(BaseTestSetup.java:57)
>     at junit.extensions.TestDecorator.basicRun(TestDecorator.java:22)
>     at junit.extensions.TestSetup$1.protect(TestSetup.java:19)
>     at junit.extensions.TestSetup.run(TestSetup.java:23)
>     at junit.extensions.TestDecorator.basicRun(TestDecorator.java:22)
>     at junit.extensions.TestSetup$1.protect(TestSetup.java:19)
>     at junit.extensions.TestSetup.run(TestSetup.java:23)
>     at org.apache.derbyTesting.junit.BaseTestSetup.run(BaseTestSetup.java:57)
>     at junit.extensions.TestDecorator.basicRun(TestDecorator.java:22)
>     at junit.extensions.TestSetup$1.protect(TestSetup.java:19)
>     at junit.extensions.TestSetup.run(TestSetup.java:23)
>     at junit.extensions.TestDecorator.basicRun(TestDecorator.java:22)
>     at junit.extensions.TestSetup$1.protect(TestSetup.java:19)
>     at junit.extensions.TestSetup.run(TestSetup.java:23)
>     at org.apache.derbyTesting.junit.BaseTestSetup.run(BaseTestSetup.java:57)
>     at junit.extensions.TestDecorator.basicRun(TestDecorator.java:22)
>     at junit.extensions.TestSetup$1.protect(TestSetup.java:19)
>     at junit.extensions.TestSetup.run(TestSetup.java:23)
>     at junit.extensions.TestDecorator.basicRun(TestDecorator.java:22)
>     at junit.extensions.TestSetup$1.protect(TestSetup.java:19)
>     at junit.extensions.TestSetup.run(TestSetup.java:23)
>     at org.apache.derbyTesting.junit.BaseTestSetup.run(BaseTestSetup.java:57)
>     at junit.extensions.TestDecorator.basicRun(TestDecorator.java:22)
>     at junit.extensions.TestSetup$1.protect(TestSetup.java:19)
>     at junit.extensions.TestSetup.run(TestSetup.java:23)
>     at junit.extensions.TestDecorator.basicRun(TestDecorator.java:22)
>     at junit.extensions.TestSetup$1.protect(TestSetup.java:19)
>     at junit.extensions.TestSetup.run(TestSetup.java:23)
>     at org.apache.derbyTesting.junit.BaseTestSetup.run(BaseTestSetup.java:57)
>     at junit.extensions.TestDecorator.basicRun(TestDecorator.java:22)
>     at junit.extensions.TestSetup$1.protect(TestSetup.java:19)
>     at junit.extensions.TestSetup.run(TestSetup.java:23)
>     at junit.extensions.TestDecorator.basicRun(TestDecorator.java:22)
>     at junit.extensions.TestSetup$1.protect(TestSetup.java:19)
>     at junit.extensions.TestSetup.run(TestSetup.java:23)
>     at org.apache.derbyTesting.junit.BaseTestSetup.run(BaseTestSetup.java:57)
>     at junit.extensions.TestDecorator.basicRun(TestDecorator.java:22)
>     at junit.extensions.TestSetup$1.protect(TestSetup.java:19)
>     at junit.extensions.TestSetup.run(TestSetup.java:23)
>     at junit.extensions.TestDecorator.basicRun(TestDecorator.java:22)
>     at junit.extensions.TestSetup$1.protect(TestSetup.java:19)
>     at junit.extensions.TestSetup.run(TestSetup.java:23)
>     at junit.extensions.TestDecorator.basicRun(TestDecorator.java:22)
>     at junit.extensions.TestSetup$1.protect(TestSetup.java:19)
>     at junit.extensions.TestSetup.run(TestSetup.java:23)
> Caused by: java.sql.SQLException: Java exception: 'org/apache/derby/iapi/sql/execute/ResultSetFactory.getBulkTableScanResultSet(Lorg/apache/derby/iapi/sql/Activation;JILorg/apache/derby/iapi/services/loader/GeneratedMethod;ILorg/apache/derby/iapi/services/loader/GeneratedMethod;ILorg/apache/derby/iapi/services/loader/GeneratedMethod;IZ[[Lorg/apache/derby/iapi/store/access/Qualifier;Ljava/lang/String;Ljava/lang/String;Ljava/lang/String;ZZIIIZIIZZDD)Lorg/apache/derby/iapi/sql/execute/NoPutResultSet;:
java.lang.NoSuchMethodError'.
>     at org.apache.derby.impl.jdbc.SQLExceptionFactory.getSQLException(Unknown Source)
>     at org.apache.derby.impl.jdbc.SQLExceptionFactory40.wrapArgsForTransportAcrossDRDA(Unknown
Source)
>     ... 103 more
> Caused by: java.lang.NoSuchMethodError: org/apache/derby/iapi/sql/execute/ResultSetFactory.getBulkTableScanResultSet(Lorg/apache/derby/iapi/sql/Activation;JILorg/apache/derby/iapi/services/loader/GeneratedMethod;ILorg/apache/derby/iapi/services/loader/GeneratedMethod;ILorg/apache/derby/iapi/services/loader/GeneratedMethod;IZ[[Lorg/apache/derby/iapi/store/access/Qualifier;Ljava/lang/String;Ljava/lang/String;Ljava/lang/String;ZZIIIZIIZZDD)Lorg/apache/derby/iapi/sql/execute/NoPutResultSet;
>     at org.apache.derby.exe.acb1601b16x0130x65f4xef99x0000549f72364.fillResultSet(Unknown
Source)
>     at org.apache.derby.exe.acb1601b16x0130x65f4xef99x0000549f72364.execute(Unknown Source)
>     at org.apache.derby.impl.sql.GenericActivationHolder.execute(Unknown Source)
>     at org.apache.derby.impl.sql.GenericPreparedStatement.executeStmt(Unknown Source)
>     at org.apache.derby.impl.sql.GenericPreparedStatement.executeSubStatement(Unknown
Source)
>     at org.apache.derby.impl.sql.execute.GenericTriggerExecutor.executeSPS(Unknown Source)
>     at org.apache.derby.impl.sql.execute.StatementTriggerExecutor.fireTrigger(Unknown
Source)
>     at org.apache.derby.impl.sql.execute.TriggerEventActivator.notifyEvent(Unknown Source)
>     at org.apache.derby.impl.sql.execute.InsertResultSet.normalInsertCore(Unknown Source)
>     at org.apache.derby.impl.sql.execute.InsertResultSet.open(Unknown Source)
>     at org.apache.derby.impl.sql.GenericPreparedStatement.executeStmt(Unknown Source)
>     at org.apache.derby.impl.sql.GenericPreparedStatement.execute(Unknown Source)
>     ... 96 more
> 4) xmlTestTriggerWithXMLOperators(org.apache.derbyTesting.functionTests.tests.upgradeTests.BasicSetup)java.sql.SQLException:
Java exception: 'org/apache/derby/iapi/sql/execute/ResultSetFactory.getBulkTableScanResultSet(Lorg/apache/derby/iapi/sql/Activation;JILorg/apache/derby/iapi/services/loader/GeneratedMethod;ILorg/apache/derby/iapi/services/loader/GeneratedMethod;ILorg/apache/derby/iapi/services/loader/GeneratedMethod;IZ[[Lorg/apache/derby/iapi/store/access/Qualifier;Ljava/lang/String;Ljava/lang/String;Ljava/lang/String;ZZIIIZIIZZDD)Lorg/apache/derby/iapi/sql/execute/NoPutResultSet;:
java.lang.NoSuchMethodError'.
>     at org.apache.derby.impl.jdbc.SQLExceptionFactory40.getSQLException(Unknown Source)
>     at org.apache.derby.impl.jdbc.Util.newEmbedSQLException(Unknown Source)
>     at org.apache.derby.impl.jdbc.Util.javaException(Unknown Source)
>     at org.apache.derby.impl.jdbc.TransactionResourceImpl.wrapInSQLException(Unknown
Source)
>     at org.apache.derby.impl.jdbc.TransactionResourceImpl.handleException(Unknown Source)
>     at org.apache.derby.impl.jdbc.EmbedConnection.handleException(Unknown Source)
>     at org.apache.derby.impl.jdbc.ConnectionChild.handleException(Unknown Source)
>     at org.apache.derby.impl.jdbc.EmbedStatement.executeStatement(Unknown Source)
>     at org.apache.derby.impl.jdbc.EmbedStatement.execute(Unknown Source)
>     at org.apache.derby.impl.jdbc.EmbedStatement.execute(Unknown Source)
>     at org.apache.derbyTesting.functionTests.tests.upgradeTests.BasicSetup.xmlTestTriggerWithXMLOperators(BasicSetup.java:832)
>     at sun.reflect.GeneratedMethodAccessor1855.invoke(Unknown Source)
>     at sun.reflect.DelegatingMethodAccessorImpl.invoke(DelegatingMethodAccessorImpl.java:37)
>     at org.apache.derbyTesting.junit.BaseTestCase.runBare(BaseTestCase.java:112)
>     at junit.extensions.TestDecorator.basicRun(TestDecorator.java:22)
>     at junit.extensions.TestSetup$1.protect(TestSetup.java:19)
>     at junit.extensions.TestSetup.run(TestSetup.java:23)
>     at junit.extensions.TestDecorator.basicRun(TestDecorator.java:22)
>     at junit.extensions.TestSetup$1.protect(TestSetup.java:19)
>     at junit.extensions.TestSetup.run(TestSetup.java:23)
>     at org.apache.derbyTesting.junit.BaseTestSetup.run(BaseTestSetup.java:57)
>     at junit.extensions.TestDecorator.basicRun(TestDecorator.java:22)
>     at junit.extensions.TestSetup$1.protect(TestSetup.java:19)
>     at junit.extensions.TestSetup.run(TestSetup.java:23)
>     at org.apache.derbyTesting.junit.BaseTestSetup.run(BaseTestSetup.java:57)
>     at junit.extensions.TestDecorator.basicRun(TestDecorator.java:22)
>     at junit.extensions.TestSetup$1.protect(TestSetup.java:19)
>     at junit.extensions.TestSetup.run(TestSetup.java:23)
>     at junit.extensions.TestDecorator.basicRun(TestDecorator.java:22)
>     at junit.extensions.TestSetup$1.protect(TestSetup.java:19)
>     at junit.extensions.TestSetup.run(TestSetup.java:23)
>     at org.apache.derbyTesting.junit.BaseTestSetup.run(BaseTestSetup.java:57)
>     at junit.extensions.TestDecorator.basicRun(TestDecorator.java:22)
>     at junit.extensions.TestSetup$1.protect(TestSetup.java:19)
>     at junit.extensions.TestSetup.run(TestSetup.java:23)
>     at junit.extensions.TestDecorator.basicRun(TestDecorator.java:22)
>     at junit.extensions.TestSetup$1.protect(TestSetup.java:19)
>     at junit.extensions.TestSetup.run(TestSetup.java:23)
>     at org.apache.derbyTesting.junit.BaseTestSetup.run(BaseTestSetup.java:57)
>     at junit.extensions.TestDecorator.basicRun(TestDecorator.java:22)
>     at junit.extensions.TestSetup$1.protect(TestSetup.java:19)
>     at junit.extensions.TestSetup.run(TestSetup.java:23)
>     at junit.extensions.TestDecorator.basicRun(TestDecorator.java:22)
>     at junit.extensions.TestSetup$1.protect(TestSetup.java:19)
>     at junit.extensions.TestSetup.run(TestSetup.java:23)
>     at org.apache.derbyTesting.junit.BaseTestSetup.run(BaseTestSetup.java:57)
>     at junit.extensions.TestDecorator.basicRun(TestDecorator.java:22)
>     at junit.extensions.TestSetup$1.protect(TestSetup.java:19)
>     at junit.extensions.TestSetup.run(TestSetup.java:23)
>     at junit.extensions.TestDecorator.basicRun(TestDecorator.java:22)
>     at junit.extensions.TestSetup$1.protect(TestSetup.java:19)
>     at junit.extensions.TestSetup.run(TestSetup.java:23)
>     at org.apache.derbyTesting.junit.BaseTestSetup.run(BaseTestSetup.java:57)
>     at junit.extensions.TestDecorator.basicRun(TestDecorator.java:22)
>     at junit.extensions.TestSetup$1.protect(TestSetup.java:19)
>     at junit.extensions.TestSetup.run(TestSetup.java:23)
>     at junit.extensions.TestDecorator.basicRun(TestDecorator.java:22)
>     at junit.extensions.TestSetup$1.protect(TestSetup.java:19)
>     at junit.extensions.TestSetup.run(TestSetup.java:23)
>     at org.apache.derbyTesting.junit.BaseTestSetup.run(BaseTestSetup.java:57)
>     at junit.extensions.TestDecorator.basicRun(TestDecorator.java:22)
>     at junit.extensions.TestSetup$1.protect(TestSetup.java:19)
>     at junit.extensions.TestSetup.run(TestSetup.java:23)
>     at junit.extensions.TestDecorator.basicRun(TestDecorator.java:22)
>     at junit.extensions.TestSetup$1.protect(TestSetup.java:19)
>     at junit.extensions.TestSetup.run(TestSetup.java:23)
>     at junit.extensions.TestDecorator.basicRun(TestDecorator.java:22)
>     at junit.extensions.TestSetup$1.protect(TestSetup.java:19)
>     at junit.extensions.TestSetup.run(TestSetup.java:23)
> Caused by: java.sql.SQLException: Java exception: 'org/apache/derby/iapi/sql/execute/ResultSetFactory.getBulkTableScanResultSet(Lorg/apache/derby/iapi/sql/Activation;JILorg/apache/derby/iapi/services/loader/GeneratedMethod;ILorg/apache/derby/iapi/services/loader/GeneratedMethod;ILorg/apache/derby/iapi/services/loader/GeneratedMethod;IZ[[Lorg/apache/derby/iapi/store/access/Qualifier;Ljava/lang/String;Ljava/lang/String;Ljava/lang/String;ZZIIIZIIZZDD)Lorg/apache/derby/iapi/sql/execute/NoPutResultSet;:
java.lang.NoSuchMethodError'.
>     at org.apache.derby.impl.jdbc.SQLExceptionFactory.getSQLException(Unknown Source)
>     at org.apache.derby.impl.jdbc.SQLExceptionFactory40.wrapArgsForTransportAcrossDRDA(Unknown
Source)
>     ... 103 more
> Caused by: java.lang.NoSuchMethodError: org/apache/derby/iapi/sql/execute/ResultSetFactory.getBulkTableScanResultSet(Lorg/apache/derby/iapi/sql/Activation;JILorg/apache/derby/iapi/services/loader/GeneratedMethod;ILorg/apache/derby/iapi/services/loader/GeneratedMethod;ILorg/apache/derby/iapi/services/loader/GeneratedMethod;IZ[[Lorg/apache/derby/iapi/store/access/Qualifier;Ljava/lang/String;Ljava/lang/String;Ljava/lang/String;ZZIIIZIIZZDD)Lorg/apache/derby/iapi/sql/execute/NoPutResultSet;
>     at org.apache.derby.exe.acd6c75975x0130x65f4xef99x0000549f72364.fillResultSet(Unknown
Source)
>     at org.apache.derby.exe.acd6c75975x0130x65f4xef99x0000549f72364.execute(Unknown Source)
>     at org.apache.derby.impl.sql.GenericActivationHolder.execute(Unknown Source)
>     at org.apache.derby.impl.sql.GenericPreparedStatement.executeStmt(Unknown Source)
>     at org.apache.derby.impl.sql.GenericPreparedStatement.executeSubStatement(Unknown
Source)
>     at org.apache.derby.impl.sql.execute.GenericTriggerExecutor.executeSPS(Unknown Source)
>     at org.apache.derby.impl.sql.execute.StatementTriggerExecutor.fireTrigger(Unknown
Source)
>     at org.apache.derby.impl.sql.execute.TriggerEventActivator.notifyEvent(Unknown Source)
>     at org.apache.derby.impl.sql.execute.InsertResultSet.normalInsertCore(Unknown Source)
>     at org.apache.derby.impl.sql.execute.InsertResultSet.open(Unknown Source)
>     at org.apache.derby.impl.sql.GenericPreparedStatement.executeStmt(Unknown Source)
>     at org.apache.derby.impl.sql.GenericPreparedStatement.execute(Unknown Source)
>     ... 96 more
> FAILURES!!!
> Tests run: 3005,  Failures: 0,  Errors: 4

--
This message is automatically generated by JIRA.
For more information on JIRA, see: http://www.atlassian.com/software/jira

Mime
View raw message