db-derby-dev mailing list archives

Site index · List index
Message view « Date » · « Thread »
Top « Date » · « Thread »
From Kathey Marsden <kmarsdende...@sbcglobal.net>
Subject 10.8 upgrade test failures java.lang.NoSuchMethodError'
Date Mon, 06 Jun 2011 18:15:58 GMT
I am running tests after porting the DERBY-5249 fix to the 10.8 branch 
but am seeing the failures below.
My version is version: 10.8.1.4 - (1132702M)
So I think I am syched up to include revision 113626 for DERBY-3870 
which bumped the last digit.
Any idea what the problem might be?

Thanks

Kathey

There were 4 errors:
1) 
xmlTestTriggerWithXMLOperators(org.apache.derbyTesting.functionTests.tests.upgradeTests.BasicSetup)java.sql.SQLException:

Java exception: 
'org/apache/derby/iapi/sql/execute/ResultSetFactory.getBulkTableScanResultSet(Lorg/apache/derby/iapi/sql/Activation;JILorg/apache/derby/iapi/services/loader/GeneratedMethod;ILorg/apache/derby/iapi/services/loader/GeneratedMethod;ILorg/apache/derby/iapi/services/loader/GeneratedMethod;IZ[[Lorg/apache/derby/iapi/store/access/Qualifier;Ljava/lang/String;Ljava/lang/String;Ljava/lang/String;ZZIIIZIIZZDD)Lorg/apache/derby/iapi/sql/execute/NoPutResultSet;:

java.lang.NoSuchMethodError'.
     at 
org.apache.derby.impl.jdbc.SQLExceptionFactory40.getSQLException(Unknown 
Source)
     at org.apache.derby.impl.jdbc.Util.newEmbedSQLException(Unknown Source)
     at org.apache.derby.impl.jdbc.Util.javaException(Unknown Source)
     at 
org.apache.derby.impl.jdbc.TransactionResourceImpl.wrapInSQLException(Unknown 
Source)
     at 
org.apache.derby.impl.jdbc.TransactionResourceImpl.handleException(Unknown 
Source)
     at 
org.apache.derby.impl.jdbc.EmbedConnection.handleException(Unknown Source)
     at 
org.apache.derby.impl.jdbc.ConnectionChild.handleException(Unknown Source)
     at 
org.apache.derby.impl.jdbc.EmbedStatement.executeStatement(Unknown Source)
     at org.apache.derby.impl.jdbc.EmbedStatement.execute(Unknown Source)
     at org.apache.derby.impl.jdbc.EmbedStatement.execute(Unknown Source)
     at 
org.apache.derbyTesting.functionTests.tests.upgradeTests.BasicSetup.xmlTestTriggerWithXMLOperators(BasicSetup.java:832)
     at sun.reflect.GeneratedMethodAccessor1855.invoke(Unknown Source)
     at 
sun.reflect.DelegatingMethodAccessorImpl.invoke(DelegatingMethodAccessorImpl.java:37)
     at 
org.apache.derbyTesting.junit.BaseTestCase.runBare(BaseTestCase.java:112)
     at junit.extensions.TestDecorator.basicRun(TestDecorator.java:22)
     at junit.extensions.TestSetup$1.protect(TestSetup.java:19)
     at junit.extensions.TestSetup.run(TestSetup.java:23)
     at junit.extensions.TestDecorator.basicRun(TestDecorator.java:22)
     at junit.extensions.TestSetup$1.protect(TestSetup.java:19)
     at junit.extensions.TestSetup.run(TestSetup.java:23)
     at 
org.apache.derbyTesting.junit.BaseTestSetup.run(BaseTestSetup.java:57)
     at junit.extensions.TestDecorator.basicRun(TestDecorator.java:22)
     at junit.extensions.TestSetup$1.protect(TestSetup.java:19)
     at junit.extensions.TestSetup.run(TestSetup.java:23)
     at 
org.apache.derbyTesting.junit.BaseTestSetup.run(BaseTestSetup.java:57)
     at junit.extensions.TestDecorator.basicRun(TestDecorator.java:22)
     at junit.extensions.TestSetup$1.protect(TestSetup.java:19)
     at junit.extensions.TestSetup.run(TestSetup.java:23)
     at junit.extensions.TestDecorator.basicRun(TestDecorator.java:22)
     at junit.extensions.TestSetup$1.protect(TestSetup.java:19)
     at junit.extensions.TestSetup.run(TestSetup.java:23)
     at 
org.apache.derbyTesting.junit.BaseTestSetup.run(BaseTestSetup.java:57)
     at junit.extensions.TestDecorator.basicRun(TestDecorator.java:22)
     at junit.extensions.TestSetup$1.protect(TestSetup.java:19)
     at junit.extensions.TestSetup.run(TestSetup.java:23)
     at junit.extensions.TestDecorator.basicRun(TestDecorator.java:22)
     at junit.extensions.TestSetup$1.protect(TestSetup.java:19)
     at junit.extensions.TestSetup.run(TestSetup.java:23)
     at 
org.apache.derbyTesting.junit.BaseTestSetup.run(BaseTestSetup.java:57)
     at junit.extensions.TestDecorator.basicRun(TestDecorator.java:22)
     at junit.extensions.TestSetup$1.protect(TestSetup.java:19)
     at junit.extensions.TestSetup.run(TestSetup.java:23)
     at junit.extensions.TestDecorator.basicRun(TestDecorator.java:22)
     at junit.extensions.TestSetup$1.protect(TestSetup.java:19)
     at junit.extensions.TestSetup.run(TestSetup.java:23)
     at 
org.apache.derbyTesting.junit.BaseTestSetup.run(BaseTestSetup.java:57)
     at junit.extensions.TestDecorator.basicRun(TestDecorator.java:22)
     at junit.extensions.TestSetup$1.protect(TestSetup.java:19)
     at junit.extensions.TestSetup.run(TestSetup.java:23)
     at junit.extensions.TestDecorator.basicRun(TestDecorator.java:22)
     at junit.extensions.TestSetup$1.protect(TestSetup.java:19)
     at junit.extensions.TestSetup.run(TestSetup.java:23)
     at 
org.apache.derbyTesting.junit.BaseTestSetup.run(BaseTestSetup.java:57)
     at junit.extensions.TestDecorator.basicRun(TestDecorator.java:22)
     at junit.extensions.TestSetup$1.protect(TestSetup.java:19)
     at junit.extensions.TestSetup.run(TestSetup.java:23)
     at junit.extensions.TestDecorator.basicRun(TestDecorator.java:22)
     at junit.extensions.TestSetup$1.protect(TestSetup.java:19)
     at junit.extensions.TestSetup.run(TestSetup.java:23)
     at 
org.apache.derbyTesting.junit.BaseTestSetup.run(BaseTestSetup.java:57)
     at junit.extensions.TestDecorator.basicRun(TestDecorator.java:22)
     at junit.extensions.TestSetup$1.protect(TestSetup.java:19)
     at junit.extensions.TestSetup.run(TestSetup.java:23)
     at junit.extensions.TestDecorator.basicRun(TestDecorator.java:22)
     at junit.extensions.TestSetup$1.protect(TestSetup.java:19)
     at junit.extensions.TestSetup.run(TestSetup.java:23)
     at junit.extensions.TestDecorator.basicRun(TestDecorator.java:22)
     at junit.extensions.TestSetup$1.protect(TestSetup.java:19)
     at junit.extensions.TestSetup.run(TestSetup.java:23)
Caused by: java.sql.SQLException: Java exception: 
'org/apache/derby/iapi/sql/execute/ResultSetFactory.getBulkTableScanResultSet(Lorg/apache/derby/iapi/sql/Activation;JILorg/apache/derby/iapi/services/loader/GeneratedMethod;ILorg/apache/derby/iapi/services/loader/GeneratedMethod;ILorg/apache/derby/iapi/services/loader/GeneratedMethod;IZ[[Lorg/apache/derby/iapi/store/access/Qualifier;Ljava/lang/String;Ljava/lang/String;Ljava/lang/String;ZZIIIZIIZZDD)Lorg/apache/derby/iapi/sql/execute/NoPutResultSet;:

java.lang.NoSuchMethodError'.
     at 
org.apache.derby.impl.jdbc.SQLExceptionFactory.getSQLException(Unknown 
Source)
     at 
org.apache.derby.impl.jdbc.SQLExceptionFactory40.wrapArgsForTransportAcrossDRDA(Unknown 
Source)
     ... 103 more
Caused by: java.lang.NoSuchMethodError: 
org/apache/derby/iapi/sql/execute/ResultSetFactory.getBulkTableScanResultSet(Lorg/apache/derby/iapi/sql/Activation;JILorg/apache/derby/iapi/services/loader/GeneratedMethod;ILorg/apache/derby/iapi/services/loader/GeneratedMethod;ILorg/apache/derby/iapi/services/loader/GeneratedMethod;IZ[[Lorg/apache/derby/iapi/store/access/Qualifier;Ljava/lang/String;Ljava/lang/String;Ljava/lang/String;ZZIIIZIIZZDD)Lorg/apache/derby/iapi/sql/execute/NoPutResultSet;
     at 
org.apache.derby.exe.aca44f56b0x0130x65f4xef99x0000549f72364.fillResultSet(Unknown 
Source)
     at 
org.apache.derby.exe.aca44f56b0x0130x65f4xef99x0000549f72364.execute(Unknown 
Source)
     at 
org.apache.derby.impl.sql.GenericActivationHolder.execute(Unknown Source)
     at 
org.apache.derby.impl.sql.GenericPreparedStatement.executeStmt(Unknown 
Source)
     at 
org.apache.derby.impl.sql.GenericPreparedStatement.executeSubStatement(Unknown 
Source)
     at 
org.apache.derby.impl.sql.execute.GenericTriggerExecutor.executeSPS(Unknown 
Source)
     at 
org.apache.derby.impl.sql.execute.StatementTriggerExecutor.fireTrigger(Unknown 
Source)
     at 
org.apache.derby.impl.sql.execute.TriggerEventActivator.notifyEvent(Unknown 
Source)
     at 
org.apache.derby.impl.sql.execute.InsertResultSet.normalInsertCore(Unknown 
Source)
     at org.apache.derby.impl.sql.execute.InsertResultSet.open(Unknown 
Source)
     at 
org.apache.derby.impl.sql.GenericPreparedStatement.executeStmt(Unknown 
Source)
     at 
org.apache.derby.impl.sql.GenericPreparedStatement.execute(Unknown Source)
     ... 96 more
2) 
xmlTestTriggerWithXMLOperators(org.apache.derbyTesting.functionTests.tests.upgradeTests.BasicSetup)java.sql.SQLException:

Java exception: 
'org/apache/derby/iapi/sql/execute/ResultSetFactory.getBulkTableScanResultSet(Lorg/apache/derby/iapi/sql/Activation;JILorg/apache/derby/iapi/services/loader/GeneratedMethod;ILorg/apache/derby/iapi/services/loader/GeneratedMethod;ILorg/apache/derby/iapi/services/loader/GeneratedMethod;IZ[[Lorg/apache/derby/iapi/store/access/Qualifier;Ljava/lang/String;Ljava/lang/String;Ljava/lang/String;ZZIIIZIIZZDD)Lorg/apache/derby/iapi/sql/execute/NoPutResultSet;:

java.lang.NoSuchMethodError'.
     at 
org.apache.derby.impl.jdbc.SQLExceptionFactory40.getSQLException(Unknown 
Source)
     at org.apache.derby.impl.jdbc.Util.newEmbedSQLException(Unknown Source)
     at org.apache.derby.impl.jdbc.Util.javaException(Unknown Source)
     at 
org.apache.derby.impl.jdbc.TransactionResourceImpl.wrapInSQLException(Unknown 
Source)
     at 
org.apache.derby.impl.jdbc.TransactionResourceImpl.handleException(Unknown 
Source)
     at 
org.apache.derby.impl.jdbc.EmbedConnection.handleException(Unknown Source)
     at 
org.apache.derby.impl.jdbc.ConnectionChild.handleException(Unknown Source)
     at 
org.apache.derby.impl.jdbc.EmbedStatement.executeStatement(Unknown Source)
     at org.apache.derby.impl.jdbc.EmbedStatement.execute(Unknown Source)
     at org.apache.derby.impl.jdbc.EmbedStatement.execute(Unknown Source)
     at 
org.apache.derbyTesting.functionTests.tests.upgradeTests.BasicSetup.xmlTestTriggerWithXMLOperators(BasicSetup.java:832)
     at sun.reflect.GeneratedMethodAccessor1855.invoke(Unknown Source)
     at 
sun.reflect.DelegatingMethodAccessorImpl.invoke(DelegatingMethodAccessorImpl.java:37)
     at 
org.apache.derbyTesting.junit.BaseTestCase.runBare(BaseTestCase.java:112)
     at junit.extensions.TestDecorator.basicRun(TestDecorator.java:22)
     at junit.extensions.TestSetup$1.protect(TestSetup.java:19)
     at junit.extensions.TestSetup.run(TestSetup.java:23)
     at junit.extensions.TestDecorator.basicRun(TestDecorator.java:22)
     at junit.extensions.TestSetup$1.protect(TestSetup.java:19)
     at junit.extensions.TestSetup.run(TestSetup.java:23)
     at 
org.apache.derbyTesting.junit.BaseTestSetup.run(BaseTestSetup.java:57)
     at junit.extensions.TestDecorator.basicRun(TestDecorator.java:22)
     at junit.extensions.TestSetup$1.protect(TestSetup.java:19)
     at junit.extensions.TestSetup.run(TestSetup.java:23)
     at 
org.apache.derbyTesting.junit.BaseTestSetup.run(BaseTestSetup.java:57)
     at junit.extensions.TestDecorator.basicRun(TestDecorator.java:22)
     at junit.extensions.TestSetup$1.protect(TestSetup.java:19)
     at junit.extensions.TestSetup.run(TestSetup.java:23)
     at junit.extensions.TestDecorator.basicRun(TestDecorator.java:22)
     at junit.extensions.TestSetup$1.protect(TestSetup.java:19)
     at junit.extensions.TestSetup.run(TestSetup.java:23)
     at 
org.apache.derbyTesting.junit.BaseTestSetup.run(BaseTestSetup.java:57)
     at junit.extensions.TestDecorator.basicRun(TestDecorator.java:22)
     at junit.extensions.TestSetup$1.protect(TestSetup.java:19)
     at junit.extensions.TestSetup.run(TestSetup.java:23)
     at junit.extensions.TestDecorator.basicRun(TestDecorator.java:22)
     at junit.extensions.TestSetup$1.protect(TestSetup.java:19)
     at junit.extensions.TestSetup.run(TestSetup.java:23)
     at 
org.apache.derbyTesting.junit.BaseTestSetup.run(BaseTestSetup.java:57)
     at junit.extensions.TestDecorator.basicRun(TestDecorator.java:22)
     at junit.extensions.TestSetup$1.protect(TestSetup.java:19)
     at junit.extensions.TestSetup.run(TestSetup.java:23)
     at junit.extensions.TestDecorator.basicRun(TestDecorator.java:22)
     at junit.extensions.TestSetup$1.protect(TestSetup.java:19)
     at junit.extensions.TestSetup.run(TestSetup.java:23)
     at 
org.apache.derbyTesting.junit.BaseTestSetup.run(BaseTestSetup.java:57)
     at junit.extensions.TestDecorator.basicRun(TestDecorator.java:22)
     at junit.extensions.TestSetup$1.protect(TestSetup.java:19)
     at junit.extensions.TestSetup.run(TestSetup.java:23)
     at junit.extensions.TestDecorator.basicRun(TestDecorator.java:22)
     at junit.extensions.TestSetup$1.protect(TestSetup.java:19)
     at junit.extensions.TestSetup.run(TestSetup.java:23)
     at 
org.apache.derbyTesting.junit.BaseTestSetup.run(BaseTestSetup.java:57)
     at junit.extensions.TestDecorator.basicRun(TestDecorator.java:22)
     at junit.extensions.TestSetup$1.protect(TestSetup.java:19)
     at junit.extensions.TestSetup.run(TestSetup.java:23)
     at junit.extensions.TestDecorator.basicRun(TestDecorator.java:22)
     at junit.extensions.TestSetup$1.protect(TestSetup.java:19)
     at junit.extensions.TestSetup.run(TestSetup.java:23)
     at 
org.apache.derbyTesting.junit.BaseTestSetup.run(BaseTestSetup.java:57)
     at junit.extensions.TestDecorator.basicRun(TestDecorator.java:22)
     at junit.extensions.TestSetup$1.protect(TestSetup.java:19)
     at junit.extensions.TestSetup.run(TestSetup.java:23)
     at junit.extensions.TestDecorator.basicRun(TestDecorator.java:22)
     at junit.extensions.TestSetup$1.protect(TestSetup.java:19)
     at junit.extensions.TestSetup.run(TestSetup.java:23)
     at junit.extensions.TestDecorator.basicRun(TestDecorator.java:22)
     at junit.extensions.TestSetup$1.protect(TestSetup.java:19)
     at junit.extensions.TestSetup.run(TestSetup.java:23)
Caused by: java.sql.SQLException: Java exception: 
'org/apache/derby/iapi/sql/execute/ResultSetFactory.getBulkTableScanResultSet(Lorg/apache/derby/iapi/sql/Activation;JILorg/apache/derby/iapi/services/loader/GeneratedMethod;ILorg/apache/derby/iapi/services/loader/GeneratedMethod;ILorg/apache/derby/iapi/services/loader/GeneratedMethod;IZ[[Lorg/apache/derby/iapi/store/access/Qualifier;Ljava/lang/String;Ljava/lang/String;Ljava/lang/String;ZZIIIZIIZZDD)Lorg/apache/derby/iapi/sql/execute/NoPutResultSet;:

java.lang.NoSuchMethodError'.
     at 
org.apache.derby.impl.jdbc.SQLExceptionFactory.getSQLException(Unknown 
Source)
     at 
org.apache.derby.impl.jdbc.SQLExceptionFactory40.wrapArgsForTransportAcrossDRDA(Unknown 
Source)
     ... 103 more
Caused by: java.lang.NoSuchMethodError: 
org/apache/derby/iapi/sql/execute/ResultSetFactory.getBulkTableScanResultSet(Lorg/apache/derby/iapi/sql/Activation;JILorg/apache/derby/iapi/services/loader/GeneratedMethod;ILorg/apache/derby/iapi/services/loader/GeneratedMethod;ILorg/apache/derby/iapi/services/loader/GeneratedMethod;IZ[[Lorg/apache/derby/iapi/store/access/Qualifier;Ljava/lang/String;Ljava/lang/String;Ljava/lang/String;ZZIIIZIIZZDD)Lorg/apache/derby/iapi/sql/execute/NoPutResultSet;
     at 
org.apache.derby.exe.ac83e5596dx0130x65f4xef99x0000549f72364.fillResultSet(Unknown 
Source)
     at 
org.apache.derby.exe.ac83e5596dx0130x65f4xef99x0000549f72364.execute(Unknown 
Source)
     at 
org.apache.derby.impl.sql.GenericActivationHolder.execute(Unknown Source)
     at 
org.apache.derby.impl.sql.GenericPreparedStatement.executeStmt(Unknown 
Source)
     at 
org.apache.derby.impl.sql.GenericPreparedStatement.executeSubStatement(Unknown 
Source)
     at 
org.apache.derby.impl.sql.execute.GenericTriggerExecutor.executeSPS(Unknown 
Source)
     at 
org.apache.derby.impl.sql.execute.StatementTriggerExecutor.fireTrigger(Unknown 
Source)
     at 
org.apache.derby.impl.sql.execute.TriggerEventActivator.notifyEvent(Unknown 
Source)
     at 
org.apache.derby.impl.sql.execute.InsertResultSet.normalInsertCore(Unknown 
Source)
     at org.apache.derby.impl.sql.execute.InsertResultSet.open(Unknown 
Source)
     at 
org.apache.derby.impl.sql.GenericPreparedStatement.executeStmt(Unknown 
Source)
     at 
org.apache.derby.impl.sql.GenericPreparedStatement.execute(Unknown Source)
     ... 96 more
3) 
xmlTestTriggerWithXMLOperators(org.apache.derbyTesting.functionTests.tests.upgradeTests.BasicSetup)java.sql.SQLException:

Java exception: 
'org/apache/derby/iapi/sql/execute/ResultSetFactory.getBulkTableScanResultSet(Lorg/apache/derby/iapi/sql/Activation;JILorg/apache/derby/iapi/services/loader/GeneratedMethod;ILorg/apache/derby/iapi/services/loader/GeneratedMethod;ILorg/apache/derby/iapi/services/loader/GeneratedMethod;IZ[[Lorg/apache/derby/iapi/store/access/Qualifier;Ljava/lang/String;Ljava/lang/String;Ljava/lang/String;ZZIIIZIIZZDD)Lorg/apache/derby/iapi/sql/execute/NoPutResultSet;:

java.lang.NoSuchMethodError'.
     at 
org.apache.derby.impl.jdbc.SQLExceptionFactory40.getSQLException(Unknown 
Source)
     at org.apache.derby.impl.jdbc.Util.newEmbedSQLException(Unknown Source)
     at org.apache.derby.impl.jdbc.Util.javaException(Unknown Source)
     at 
org.apache.derby.impl.jdbc.TransactionResourceImpl.wrapInSQLException(Unknown 
Source)
     at 
org.apache.derby.impl.jdbc.TransactionResourceImpl.handleException(Unknown 
Source)
     at 
org.apache.derby.impl.jdbc.EmbedConnection.handleException(Unknown Source)
     at 
org.apache.derby.impl.jdbc.ConnectionChild.handleException(Unknown Source)
     at 
org.apache.derby.impl.jdbc.EmbedStatement.executeStatement(Unknown Source)
     at org.apache.derby.impl.jdbc.EmbedStatement.execute(Unknown Source)
     at org.apache.derby.impl.jdbc.EmbedStatement.execute(Unknown Source)
     at 
org.apache.derbyTesting.functionTests.tests.upgradeTests.BasicSetup.xmlTestTriggerWithXMLOperators(BasicSetup.java:832)
     at sun.reflect.GeneratedMethodAccessor1855.invoke(Unknown Source)
     at 
sun.reflect.DelegatingMethodAccessorImpl.invoke(DelegatingMethodAccessorImpl.java:37)
     at 
org.apache.derbyTesting.junit.BaseTestCase.runBare(BaseTestCase.java:112)
     at junit.extensions.TestDecorator.basicRun(TestDecorator.java:22)
     at junit.extensions.TestSetup$1.protect(TestSetup.java:19)
     at junit.extensions.TestSetup.run(TestSetup.java:23)
     at junit.extensions.TestDecorator.basicRun(TestDecorator.java:22)
     at junit.extensions.TestSetup$1.protect(TestSetup.java:19)
     at junit.extensions.TestSetup.run(TestSetup.java:23)
     at 
org.apache.derbyTesting.junit.BaseTestSetup.run(BaseTestSetup.java:57)
     at junit.extensions.TestDecorator.basicRun(TestDecorator.java:22)
     at junit.extensions.TestSetup$1.protect(TestSetup.java:19)
     at junit.extensions.TestSetup.run(TestSetup.java:23)
     at 
org.apache.derbyTesting.junit.BaseTestSetup.run(BaseTestSetup.java:57)
     at junit.extensions.TestDecorator.basicRun(TestDecorator.java:22)
     at junit.extensions.TestSetup$1.protect(TestSetup.java:19)
     at junit.extensions.TestSetup.run(TestSetup.java:23)
     at junit.extensions.TestDecorator.basicRun(TestDecorator.java:22)
     at junit.extensions.TestSetup$1.protect(TestSetup.java:19)
     at junit.extensions.TestSetup.run(TestSetup.java:23)
     at 
org.apache.derbyTesting.junit.BaseTestSetup.run(BaseTestSetup.java:57)
     at junit.extensions.TestDecorator.basicRun(TestDecorator.java:22)
     at junit.extensions.TestSetup$1.protect(TestSetup.java:19)
     at junit.extensions.TestSetup.run(TestSetup.java:23)
     at junit.extensions.TestDecorator.basicRun(TestDecorator.java:22)
     at junit.extensions.TestSetup$1.protect(TestSetup.java:19)
     at junit.extensions.TestSetup.run(TestSetup.java:23)
     at 
org.apache.derbyTesting.junit.BaseTestSetup.run(BaseTestSetup.java:57)
     at junit.extensions.TestDecorator.basicRun(TestDecorator.java:22)
     at junit.extensions.TestSetup$1.protect(TestSetup.java:19)
     at junit.extensions.TestSetup.run(TestSetup.java:23)
     at junit.extensions.TestDecorator.basicRun(TestDecorator.java:22)
     at junit.extensions.TestSetup$1.protect(TestSetup.java:19)
     at junit.extensions.TestSetup.run(TestSetup.java:23)
     at 
org.apache.derbyTesting.junit.BaseTestSetup.run(BaseTestSetup.java:57)
     at junit.extensions.TestDecorator.basicRun(TestDecorator.java:22)
     at junit.extensions.TestSetup$1.protect(TestSetup.java:19)
     at junit.extensions.TestSetup.run(TestSetup.java:23)
     at junit.extensions.TestDecorator.basicRun(TestDecorator.java:22)
     at junit.extensions.TestSetup$1.protect(TestSetup.java:19)
     at junit.extensions.TestSetup.run(TestSetup.java:23)
     at 
org.apache.derbyTesting.junit.BaseTestSetup.run(BaseTestSetup.java:57)
     at junit.extensions.TestDecorator.basicRun(TestDecorator.java:22)
     at junit.extensions.TestSetup$1.protect(TestSetup.java:19)
     at junit.extensions.TestSetup.run(TestSetup.java:23)
     at junit.extensions.TestDecorator.basicRun(TestDecorator.java:22)
     at junit.extensions.TestSetup$1.protect(TestSetup.java:19)
     at junit.extensions.TestSetup.run(TestSetup.java:23)
     at 
org.apache.derbyTesting.junit.BaseTestSetup.run(BaseTestSetup.java:57)
     at junit.extensions.TestDecorator.basicRun(TestDecorator.java:22)
     at junit.extensions.TestSetup$1.protect(TestSetup.java:19)
     at junit.extensions.TestSetup.run(TestSetup.java:23)
     at junit.extensions.TestDecorator.basicRun(TestDecorator.java:22)
     at junit.extensions.TestSetup$1.protect(TestSetup.java:19)
     at junit.extensions.TestSetup.run(TestSetup.java:23)
     at junit.extensions.TestDecorator.basicRun(TestDecorator.java:22)
     at junit.extensions.TestSetup$1.protect(TestSetup.java:19)
     at junit.extensions.TestSetup.run(TestSetup.java:23)
Caused by: java.sql.SQLException: Java exception: 
'org/apache/derby/iapi/sql/execute/ResultSetFactory.getBulkTableScanResultSet(Lorg/apache/derby/iapi/sql/Activation;JILorg/apache/derby/iapi/services/loader/GeneratedMethod;ILorg/apache/derby/iapi/services/loader/GeneratedMethod;ILorg/apache/derby/iapi/services/loader/GeneratedMethod;IZ[[Lorg/apache/derby/iapi/store/access/Qualifier;Ljava/lang/String;Ljava/lang/String;Ljava/lang/String;ZZIIIZIIZZDD)Lorg/apache/derby/iapi/sql/execute/NoPutResultSet;:

java.lang.NoSuchMethodError'.
     at 
org.apache.derby.impl.jdbc.SQLExceptionFactory.getSQLException(Unknown 
Source)
     at 
org.apache.derby.impl.jdbc.SQLExceptionFactory40.wrapArgsForTransportAcrossDRDA(Unknown 
Source)
     ... 103 more
Caused by: java.lang.NoSuchMethodError: 
org/apache/derby/iapi/sql/execute/ResultSetFactory.getBulkTableScanResultSet(Lorg/apache/derby/iapi/sql/Activation;JILorg/apache/derby/iapi/services/loader/GeneratedMethod;ILorg/apache/derby/iapi/services/loader/GeneratedMethod;ILorg/apache/derby/iapi/services/loader/GeneratedMethod;IZ[[Lorg/apache/derby/iapi/store/access/Qualifier;Ljava/lang/String;Ljava/lang/String;Ljava/lang/String;ZZIIIZIIZZDD)Lorg/apache/derby/iapi/sql/execute/NoPutResultSet;
     at 
org.apache.derby.exe.acb1601b16x0130x65f4xef99x0000549f72364.fillResultSet(Unknown 
Source)
     at 
org.apache.derby.exe.acb1601b16x0130x65f4xef99x0000549f72364.execute(Unknown 
Source)
     at 
org.apache.derby.impl.sql.GenericActivationHolder.execute(Unknown Source)
     at 
org.apache.derby.impl.sql.GenericPreparedStatement.executeStmt(Unknown 
Source)
     at 
org.apache.derby.impl.sql.GenericPreparedStatement.executeSubStatement(Unknown 
Source)
     at 
org.apache.derby.impl.sql.execute.GenericTriggerExecutor.executeSPS(Unknown 
Source)
     at 
org.apache.derby.impl.sql.execute.StatementTriggerExecutor.fireTrigger(Unknown 
Source)
     at 
org.apache.derby.impl.sql.execute.TriggerEventActivator.notifyEvent(Unknown 
Source)
     at 
org.apache.derby.impl.sql.execute.InsertResultSet.normalInsertCore(Unknown 
Source)
     at org.apache.derby.impl.sql.execute.InsertResultSet.open(Unknown 
Source)
     at 
org.apache.derby.impl.sql.GenericPreparedStatement.executeStmt(Unknown 
Source)
     at 
org.apache.derby.impl.sql.GenericPreparedStatement.execute(Unknown Source)
     ... 96 more
4) 
xmlTestTriggerWithXMLOperators(org.apache.derbyTesting.functionTests.tests.upgradeTests.BasicSetup)java.sql.SQLException:

Java exception: 
'org/apache/derby/iapi/sql/execute/ResultSetFactory.getBulkTableScanResultSet(Lorg/apache/derby/iapi/sql/Activation;JILorg/apache/derby/iapi/services/loader/GeneratedMethod;ILorg/apache/derby/iapi/services/loader/GeneratedMethod;ILorg/apache/derby/iapi/services/loader/GeneratedMethod;IZ[[Lorg/apache/derby/iapi/store/access/Qualifier;Ljava/lang/String;Ljava/lang/String;Ljava/lang/String;ZZIIIZIIZZDD)Lorg/apache/derby/iapi/sql/execute/NoPutResultSet;:

java.lang.NoSuchMethodError'.
     at 
org.apache.derby.impl.jdbc.SQLExceptionFactory40.getSQLException(Unknown 
Source)
     at org.apache.derby.impl.jdbc.Util.newEmbedSQLException(Unknown Source)
     at org.apache.derby.impl.jdbc.Util.javaException(Unknown Source)
     at 
org.apache.derby.impl.jdbc.TransactionResourceImpl.wrapInSQLException(Unknown 
Source)
     at 
org.apache.derby.impl.jdbc.TransactionResourceImpl.handleException(Unknown 
Source)
     at 
org.apache.derby.impl.jdbc.EmbedConnection.handleException(Unknown Source)
     at 
org.apache.derby.impl.jdbc.ConnectionChild.handleException(Unknown Source)
     at 
org.apache.derby.impl.jdbc.EmbedStatement.executeStatement(Unknown Source)
     at org.apache.derby.impl.jdbc.EmbedStatement.execute(Unknown Source)
     at org.apache.derby.impl.jdbc.EmbedStatement.execute(Unknown Source)
     at 
org.apache.derbyTesting.functionTests.tests.upgradeTests.BasicSetup.xmlTestTriggerWithXMLOperators(BasicSetup.java:832)
     at sun.reflect.GeneratedMethodAccessor1855.invoke(Unknown Source)
     at 
sun.reflect.DelegatingMethodAccessorImpl.invoke(DelegatingMethodAccessorImpl.java:37)
     at 
org.apache.derbyTesting.junit.BaseTestCase.runBare(BaseTestCase.java:112)
     at junit.extensions.TestDecorator.basicRun(TestDecorator.java:22)
     at junit.extensions.TestSetup$1.protect(TestSetup.java:19)
     at junit.extensions.TestSetup.run(TestSetup.java:23)
     at junit.extensions.TestDecorator.basicRun(TestDecorator.java:22)
     at junit.extensions.TestSetup$1.protect(TestSetup.java:19)
     at junit.extensions.TestSetup.run(TestSetup.java:23)
     at 
org.apache.derbyTesting.junit.BaseTestSetup.run(BaseTestSetup.java:57)
     at junit.extensions.TestDecorator.basicRun(TestDecorator.java:22)
     at junit.extensions.TestSetup$1.protect(TestSetup.java:19)
     at junit.extensions.TestSetup.run(TestSetup.java:23)
     at 
org.apache.derbyTesting.junit.BaseTestSetup.run(BaseTestSetup.java:57)
     at junit.extensions.TestDecorator.basicRun(TestDecorator.java:22)
     at junit.extensions.TestSetup$1.protect(TestSetup.java:19)
     at junit.extensions.TestSetup.run(TestSetup.java:23)
     at junit.extensions.TestDecorator.basicRun(TestDecorator.java:22)
     at junit.extensions.TestSetup$1.protect(TestSetup.java:19)
     at junit.extensions.TestSetup.run(TestSetup.java:23)
     at 
org.apache.derbyTesting.junit.BaseTestSetup.run(BaseTestSetup.java:57)
     at junit.extensions.TestDecorator.basicRun(TestDecorator.java:22)
     at junit.extensions.TestSetup$1.protect(TestSetup.java:19)
     at junit.extensions.TestSetup.run(TestSetup.java:23)
     at junit.extensions.TestDecorator.basicRun(TestDecorator.java:22)
     at junit.extensions.TestSetup$1.protect(TestSetup.java:19)
     at junit.extensions.TestSetup.run(TestSetup.java:23)
     at 
org.apache.derbyTesting.junit.BaseTestSetup.run(BaseTestSetup.java:57)
     at junit.extensions.TestDecorator.basicRun(TestDecorator.java:22)
     at junit.extensions.TestSetup$1.protect(TestSetup.java:19)
     at junit.extensions.TestSetup.run(TestSetup.java:23)
     at junit.extensions.TestDecorator.basicRun(TestDecorator.java:22)
     at junit.extensions.TestSetup$1.protect(TestSetup.java:19)
     at junit.extensions.TestSetup.run(TestSetup.java:23)
     at 
org.apache.derbyTesting.junit.BaseTestSetup.run(BaseTestSetup.java:57)
     at junit.extensions.TestDecorator.basicRun(TestDecorator.java:22)
     at junit.extensions.TestSetup$1.protect(TestSetup.java:19)
     at junit.extensions.TestSetup.run(TestSetup.java:23)
     at junit.extensions.TestDecorator.basicRun(TestDecorator.java:22)
     at junit.extensions.TestSetup$1.protect(TestSetup.java:19)
     at junit.extensions.TestSetup.run(TestSetup.java:23)
     at 
org.apache.derbyTesting.junit.BaseTestSetup.run(BaseTestSetup.java:57)
     at junit.extensions.TestDecorator.basicRun(TestDecorator.java:22)
     at junit.extensions.TestSetup$1.protect(TestSetup.java:19)
     at junit.extensions.TestSetup.run(TestSetup.java:23)
     at junit.extensions.TestDecorator.basicRun(TestDecorator.java:22)
     at junit.extensions.TestSetup$1.protect(TestSetup.java:19)
     at junit.extensions.TestSetup.run(TestSetup.java:23)
     at 
org.apache.derbyTesting.junit.BaseTestSetup.run(BaseTestSetup.java:57)
     at junit.extensions.TestDecorator.basicRun(TestDecorator.java:22)
     at junit.extensions.TestSetup$1.protect(TestSetup.java:19)
     at junit.extensions.TestSetup.run(TestSetup.java:23)
     at junit.extensions.TestDecorator.basicRun(TestDecorator.java:22)
     at junit.extensions.TestSetup$1.protect(TestSetup.java:19)
     at junit.extensions.TestSetup.run(TestSetup.java:23)
     at junit.extensions.TestDecorator.basicRun(TestDecorator.java:22)
     at junit.extensions.TestSetup$1.protect(TestSetup.java:19)
     at junit.extensions.TestSetup.run(TestSetup.java:23)
Caused by: java.sql.SQLException: Java exception: 
'org/apache/derby/iapi/sql/execute/ResultSetFactory.getBulkTableScanResultSet(Lorg/apache/derby/iapi/sql/Activation;JILorg/apache/derby/iapi/services/loader/GeneratedMethod;ILorg/apache/derby/iapi/services/loader/GeneratedMethod;ILorg/apache/derby/iapi/services/loader/GeneratedMethod;IZ[[Lorg/apache/derby/iapi/store/access/Qualifier;Ljava/lang/String;Ljava/lang/String;Ljava/lang/String;ZZIIIZIIZZDD)Lorg/apache/derby/iapi/sql/execute/NoPutResultSet;:

java.lang.NoSuchMethodError'.
     at 
org.apache.derby.impl.jdbc.SQLExceptionFactory.getSQLException(Unknown 
Source)
     at 
org.apache.derby.impl.jdbc.SQLExceptionFactory40.wrapArgsForTransportAcrossDRDA(Unknown 
Source)
     ... 103 more
Caused by: java.lang.NoSuchMethodError: 
org/apache/derby/iapi/sql/execute/ResultSetFactory.getBulkTableScanResultSet(Lorg/apache/derby/iapi/sql/Activation;JILorg/apache/derby/iapi/services/loader/GeneratedMethod;ILorg/apache/derby/iapi/services/loader/GeneratedMethod;ILorg/apache/derby/iapi/services/loader/GeneratedMethod;IZ[[Lorg/apache/derby/iapi/store/access/Qualifier;Ljava/lang/String;Ljava/lang/String;Ljava/lang/String;ZZIIIZIIZZDD)Lorg/apache/derby/iapi/sql/execute/NoPutResultSet;
     at 
org.apache.derby.exe.acd6c75975x0130x65f4xef99x0000549f72364.fillResultSet(Unknown 
Source)
     at 
org.apache.derby.exe.acd6c75975x0130x65f4xef99x0000549f72364.execute(Unknown 
Source)
     at 
org.apache.derby.impl.sql.GenericActivationHolder.execute(Unknown Source)
     at 
org.apache.derby.impl.sql.GenericPreparedStatement.executeStmt(Unknown 
Source)
     at 
org.apache.derby.impl.sql.GenericPreparedStatement.executeSubStatement(Unknown 
Source)
     at 
org.apache.derby.impl.sql.execute.GenericTriggerExecutor.executeSPS(Unknown 
Source)
     at 
org.apache.derby.impl.sql.execute.StatementTriggerExecutor.fireTrigger(Unknown 
Source)
     at 
org.apache.derby.impl.sql.execute.TriggerEventActivator.notifyEvent(Unknown 
Source)
     at 
org.apache.derby.impl.sql.execute.InsertResultSet.normalInsertCore(Unknown 
Source)
     at org.apache.derby.impl.sql.execute.InsertResultSet.open(Unknown 
Source)
     at 
org.apache.derby.impl.sql.GenericPreparedStatement.executeStmt(Unknown 
Source)
     at 
org.apache.derby.impl.sql.GenericPreparedStatement.execute(Unknown Source)
     ... 96 more

FAILURES!!!
Tests run: 3005,  Failures: 0,  Errors: 4



Mime
View raw message