db-derby-dev mailing list archives

Site index · List index
Message view « Date » · « Thread »
Top « Date » · « Thread »
From "Knut Anders Hatlen (JIRA)" <j...@apache.org>
Subject [jira] [Resolved] (DERBY-3689) 'PrivilegedActionException: javax.management.InstanceNotFoundException' in '*(VersionMBeanTest / NetworkServerMBeanTest)'
Date Wed, 29 Jun 2011 14:42:28 GMT

     [ https://issues.apache.org/jira/browse/DERBY-3689?page=com.atlassian.jira.plugin.system.issuetabpanels:all-tabpanel
]

Knut Anders Hatlen resolved DERBY-3689.
---------------------------------------

       Resolution: Fixed
    Fix Version/s: 10.8.1.5

Merged to 10.8 and committed revision 1141116.

> 'PrivilegedActionException: javax.management.InstanceNotFoundException' in '*(VersionMBeanTest
/ NetworkServerMBeanTest)'
> -------------------------------------------------------------------------------------------------------------------------
>
>                 Key: DERBY-3689
>                 URL: https://issues.apache.org/jira/browse/DERBY-3689
>             Project: Derby
>          Issue Type: Bug
>          Components: JMX, Test
>    Affects Versions: 10.4.1.3, 10.5.1.1, 10.7.1.1, 10.8.1.2
>         Environment: HW: 2 X sun4u sparcv9 (UltraSPARC-IIIi (portid 1 impl 0x16 ver 0x24
clock 1002 MHz)): 1002 MHz, unknown cache.  2048 Megabytes Total Memory.
> 2 X i86pc i386 (	AMD Opteron(tm) Processor 250): 2393 MHz, unknown cache.  2048 Megabytes
Total Memory.
> OS: Solaris 10 8/07 s10s_u4wos_12b SPARC 64bits - SunOS 5.10 Generic_120011-14
> Solaris 10 8/07 s10x_u4wos_12b X86 64bits - SunOS 5.10 Generic_127112-11
> JVM: Sun 1.6.0_10-beta
> Sun 1.5.0_14
>            Reporter: Ole Solberg
>            Assignee: Knut Anders Hatlen
>            Priority: Minor
>              Labels: derby_triage10_5_2
>             Fix For: 10.8.1.5, 10.9.0.0
>
>         Attachments: d3689-1a.diff
>
>
> suitesAll fail *************************************************************
> 1) testDerbynetJarAttributeAlpha(org.apache.derbyTesting.functionTests.tests.management.VersionMBeanTest)java.security.PrivilegedActionException:
javax.management.InstanceNotFoundException: org.apache.derby:type=Version,system=c013800d-011a-02c6-d312-0000600c993a,jar=derbynet.jar
> suitesAll fail *************************************************************
> .........................................
> .
> .
> .........................................
> .............................
> Time: 8,078.973
> There was 1 error:
> 1) testDerbynetJarAttributeAlpha(org.apache.derbyTesting.functionTests.tests.management.VersionMBeanTest)java.security.PrivilegedActionException:
javax.management.InstanceNotFoundException: org.apache.derby:type=Version,system=c013800d-011a-02c6-d312-0000600c993a,jar=derbynet.jar
> 	at java.security.AccessController.doPrivileged(Native Method)
> 	at org.apache.derbyTesting.functionTests.tests.management.MBeanTest.getAttribute(MBeanTest.java:379)
> 	at org.apache.derbyTesting.functionTests.tests.management.MBeanTest.checkBooleanAttributeValue(MBeanTest.java:431)
> 	at org.apache.derbyTesting.functionTests.tests.management.VersionMBeanTest.testDerbynetJarAttributeAlpha(VersionMBeanTest.java:124)
> 	at sun.reflect.NativeMethodAccessorImpl.invoke0(Native Method)
> 	at sun.reflect.NativeMethodAccessorImpl.invoke(NativeMethodAccessorImpl.java:39)
> 	at sun.reflect.DelegatingMethodAccessorImpl.invoke(DelegatingMethodAccessorImpl.java:25)
> 	at org.apache.derbyTesting.junit.BaseTestCase.runBare(BaseTestCase.java:101)
> 	at junit.extensions.TestDecorator.basicRun(TestDecorator.java:24)
> 	at junit.extensions.TestSetup$1.protect(TestSetup.java:21)
> 	at junit.extensions.TestSetup.run(TestSetup.java:25)
> 	at org.apache.derbyTesting.junit.BaseTestSetup.run(BaseTestSetup.java:57)
> 	at junit.extensions.TestDecorator.basicRun(TestDecorator.java:24)
> 	at junit.extensions.TestSetup$1.protect(TestSetup.java:21)
> 	at junit.extensions.TestSetup.run(TestSetup.java:25)
> 	at junit.extensions.TestDecorator.basicRun(TestDecorator.java:24)
> 	at junit.extensions.TestSetup$1.protect(TestSetup.java:21)
> 	at junit.extensions.TestSetup.run(TestSetup.java:25)
> 	at org.apache.derbyTesting.junit.BaseTestSetup.run(BaseTestSetup.java:57)
> Caused by: javax.management.InstanceNotFoundException: org.apache.derby:type=Version,system=c013800d-011a-02c6-d312-0000600c993a,jar=derbynet.jar
> 	at com.sun.jmx.interceptor.DefaultMBeanServerInterceptor.getMBean(DefaultMBeanServerInterceptor.java:1094)
> 	at com.sun.jmx.interceptor.DefaultMBeanServerInterceptor.getAttribute(DefaultMBeanServerInterceptor.java:662)
> 	at com.sun.jmx.mbeanserver.JmxMBeanServer.getAttribute(JmxMBeanServer.java:638)
> 	at org.apache.derbyTesting.functionTests.tests.management.MBeanTest$4.run(MBeanTest.java:382)
> 	... 42 more
> FAILURES!!!
> Tests run: 10443,  Failures: 0,  Errors: 1
> http://dbtg.thresher.com/derby/test/trunk15/jvm1.5/testing/testlog/SunOS-5.10_i86pc-i386/660248-org.apache.derbyTesting.functionTests.suites.All_diff.txt
:
> org.apache.derbyTesting.functionTests.suites.All fail *************************************************************
> 1) testAttributeAccumulatedConnectionCount(org.apache.derbyTesting.functionTests.tests.management.NetworkServerMBeanTest)java.security.PrivilegedActionException:
javax.management.InstanceNotFoundException: org.apache.derby:type=NetworkServer,system=c013800d-011a-2687-5555-ffffe3512519
> 2) testAttributeActiveConnectionCount(org.apache.derbyTesting.functionTests.tests.management.NetworkServerMBeanTest)java.security.PrivilegedActionException:
javax.management.InstanceNotFoundException: org.apache.derby:type=NetworkServer,system=c013800d-011a-2687-5555-ffffe3512519
> 3) testAttributeBytesReceived(org.apache.derbyTesting.functionTests.tests.management.NetworkServerMBeanTest)java.security.PrivilegedActionException:
javax.management.InstanceNotFoundException: org.apache.derby:type=NetworkServer,system=c013800d-011a-2687-5555-ffffe3512519
> 4) testAttributeBytesReceivedPerSecond(org.apache.derbyTesting.functionTests.tests.management.NetworkServerMBeanTest)java.security.PrivilegedActionException:
javax.management.InstanceNotFoundException: org.apache.derby:type=NetworkServer,system=c013800d-011a-2687-5555-ffffe3512519
> 5) testAttributeBytesSent(org.apache.derbyTesting.functionTests.tests.management.NetworkServerMBeanTest)java.security.PrivilegedActionException:
javax.management.InstanceNotFoundException: org.apache.derby:type=NetworkServer,system=c013800d-011a-2687-5555-ffffe3512519
> 6) testAttributeBytesSentPerSecond(org.apache.derbyTesting.functionTests.tests.management.NetworkServerMBeanTest)java.security.PrivilegedActionException:
javax.management.InstanceNotFoundException: org.apache.derby:type=NetworkServer,system=c013800d-011a-2687-5555-ffffe3512519
> 7) testAttributeConnectionCount(org.apache.derbyTesting.functionTests.tests.management.NetworkServerMBeanTest)java.security.PrivilegedActionException:
javax.management.InstanceNotFoundException: org.apache.derby:type=NetworkServer,system=c013800d-011a-2687-5555-ffffe3512519
> 8) testAttributeConnectionThreadPoolSize(org.apache.derbyTesting.functionTests.tests.management.NetworkServerMBeanTest)java.security.PrivilegedActionException:
javax.management.InstanceNotFoundException: org.apache.derby:type=NetworkServer,system=c013800d-011a-2687-5555-ffffe3512519
> 9) testAttributeDrdaHost(org.apache.derbyTesting.functionTests.tests.management.NetworkServerMBeanTest)java.security.PrivilegedActionException:
javax.management.InstanceNotFoundException: org.apache.derby:type=NetworkServer,system=c013800d-011a-2687-5555-ffffe3512519
> .
> .
> Time: 4,047.235
> There were 9 errors:
> 1) testAttributeAccumulatedConnectionCount(org.apache.derbyTesting.functionTests.tests.management.NetworkServerMBeanTest)java.security.PrivilegedActionException:
javax.management.InstanceNotFoundException: org.apache.derby:type=NetworkServer,system=c013800d-011a-2687-5555-ffffe3512519
> 	at java.security.AccessController.doPrivileged(Native Method)
> 	at org.apache.derbyTesting.functionTests.tests.management.MBeanTest.getAttribute(MBeanTest.java:379)
> 	at org.apache.derbyTesting.functionTests.tests.management.NetworkServerMBeanTest.testAttributeAccumulatedConnectionCount(NetworkServerMBeanTest.java:93)
> 	at sun.reflect.NativeMethodAccessorImpl.invoke0(Native Method)
> 	at sun.reflect.NativeMethodAccessorImpl.invoke(NativeMethodAccessorImpl.java:39)
> 	at sun.reflect.DelegatingMethodAccessorImpl.invoke(DelegatingMethodAccessorImpl.java:25)
> 	at org.apache.derbyTesting.junit.BaseTestCase.runBare(BaseTestCase.java:103)
> 	at junit.extensions.TestDecorator.basicRun(TestDecorator.java:24)
> 	at junit.extensions.TestSetup$1.protect(TestSetup.java:21)
> 	at junit.extensions.TestSetup.run(TestSetup.java:25)
> 	at org.apache.derbyTesting.junit.BaseTestSetup.run(BaseTestSetup.java:57)
> 	at junit.extensions.TestDecorator.basicRun(TestDecorator.java:24)
> 	at junit.extensions.TestSetup$1.protect(TestSetup.java:21)
> 	at junit.extensions.TestSetup.run(TestSetup.java:25)
> 	at org.apache.derbyTesting.junit.BaseTestSetup.run(BaseTestSetup.java:57)
> 	at junit.extensions.TestDecorator.basicRun(TestDecorator.java:24)
> 	at junit.extensions.TestSetup$1.protect(TestSetup.java:21)
> 	at junit.extensions.TestSetup.run(TestSetup.java:25)
> 	at junit.extensions.TestDecorator.basicRun(TestDecorator.java:24)
> 	at junit.extensions.TestSetup$1.protect(TestSetup.java:21)
> 	at junit.extensions.TestSetup.run(TestSetup.java:25)
> Caused by: javax.management.InstanceNotFoundException: org.apache.derby:type=NetworkServer,system=c013800d-011a-2687-5555-ffffe3512519
> 	at com.sun.jmx.interceptor.DefaultMBeanServerInterceptor.getMBean(DefaultMBeanServerInterceptor.java:1010)
> 	at com.sun.jmx.interceptor.DefaultMBeanServerInterceptor.getAttribute(DefaultMBeanServerInterceptor.java:627)
> 	at com.sun.jmx.mbeanserver.JmxMBeanServer.getAttribute(JmxMBeanServer.java:659)
> 	at javax.management.remote.rmi.RMIConnectionImpl.doOperation(RMIConnectionImpl.java:1387)
> 	at javax.management.remote.rmi.RMIConnectionImpl.access$100(RMIConnectionImpl.java:81)
> 	at javax.management.remote.rmi.RMIConnectionImpl$PrivilegedOperation.run(RMIConnectionImpl.java:1247)
> 	at javax.management.remote.rmi.RMIConnectionImpl.doPrivilegedOperation(RMIConnectionImpl.java:1343)
> 	at javax.management.remote.rmi.RMIConnectionImpl.getAttribute(RMIConnectionImpl.java:599)
> 	at sun.reflect.NativeMethodAccessorImpl.invoke0(Native Method)
> 	at sun.reflect.NativeMethodAccessorImpl.invoke(NativeMethodAccessorImpl.java:39)
> 	at sun.reflect.DelegatingMethodAccessorImpl.invoke(DelegatingMethodAccessorImpl.java:25)
> 	at sun.rmi.server.UnicastServerRef.dispatch(UnicastServerRef.java:294)
> 	at sun.rmi.transport.Transport$1.run(Transport.java:153)
> 	at java.security.AccessController.doPrivileged(Native Method)
> 	at sun.rmi.transport.Transport.serviceCall(Transport.java:149)
> 	at sun.rmi.transport.tcp.TCPTransport.handleMessages(TCPTransport.java:466)
> 	at sun.rmi.transport.tcp.TCPTransport$ConnectionHandler.run(TCPTransport.java:707)
> 	at java.lang.Thread.run(Thread.java:595)
> 	at sun.rmi.transport.StreamRemoteCall.exceptionReceivedFromServer(StreamRemoteCall.java:247)
> 	at sun.rmi.transport.StreamRemoteCall.executeCall(StreamRemoteCall.java:223)
> 	at sun.rmi.server.UnicastRef.invoke(UnicastRef.java:126)
> 	at com.sun.jmx.remote.internal.PRef.invoke(Unknown Source)
> 	at javax.management.remote.rmi.RMIConnectionImpl_Stub.getAttribute(Unknown Source)
> 	at javax.management.remote.rmi.RMIConnector$RemoteMBeanServerConnection.getAttribute(RMIConnector.java:857)
> 	at org.apache.derbyTesting.functionTests.tests.management.MBeanTest$4.run(MBeanTest.java:382)
> 	... 45 more
> .
> .
> FAILURES!!!
> Tests run: 8262,  Failures: 0,  Errors: 9

--
This message is automatically generated by JIRA.
For more information on JIRA, see: http://www.atlassian.com/software/jira

        

Mime
View raw message