db-derby-dev mailing list archives

Site index · List index
Message view « Date » · « Thread »
Top « Date » · « Thread »
From Apache Jenkins Server <hud...@hudson.apache.org>
Subject Build failed in Jenkins: Derby-branch-10.7 #46
Date Thu, 26 May 2011 10:04:36 GMT
See <https://builds.apache.org/hudson/job/Derby-branch-10.7/46/changes>

Changes:

[kristwaa] DERBY-5098: embedded/in-memory: SQLNonTransientConnectionException: No current
connection due to invalid page format

Merged fix from trunk (r1103681,1103718).

------------------------------------------
[...truncated 4793 lines...]
AU        tools/release/templates/releaseSummaryTemplate.xml
A         tools/ide
A         tools/ide/netbeans
A         tools/ide/netbeans/6.0
A         tools/ide/netbeans/6.0/nbproject
A         tools/ide/netbeans/6.0/nbproject/project.xml
A         tools/ide/netbeans/5.5
A         tools/ide/netbeans/5.5/nbproject
A         tools/ide/netbeans/5.5/nbproject/project.xml
A         tools/ide/netbeans/README.txt
A         tools/java
AU        tools/java/javacc.jar
AU        tools/java/serializer.jar
AU        tools/java/xercesImpl.jar
AU        tools/java/jakarta-oro-2.0.8.jar
AU        tools/java/geronimo-spec-servlet-2.4-rc4.jar
AU        tools/java/xalan.jar
A         tools/ant
A         tools/ant/xsl
AU        tools/ant/xsl/sysinfo_junitreport.xsl
A         tools/ant/properties
AU        tools/ant/properties/modern.properties
AU        tools/ant/properties/packaging.tmpl
AU        tools/ant/properties/compilepath.properties
AU        tools/ant/properties/sanetrue.properties
AU        tools/ant/properties/defaultcompiler.properties
AU        tools/ant/properties/extrapath.properties
AU        tools/ant/properties/release.properties
AU        tools/ant/properties/dirs.properties
AU        tools/ant/properties/sanefalse.properties
A         tools/j2ee
A         tools/j2ee/derby
A         tools/j2ee/derby/WEB-INF
AU        tools/j2ee/derby/WEB-INF/web.xml
A         tools/javadoc
AU        tools/javadoc/publishedapi_jdbc3.ant
A         tools/javadoc/logo
AU        tools/javadoc/logo/derby_logo64.png
AU        tools/javadoc/logo/derby_logo32.png
AU        tools/javadoc/publishedapi_jdbc4.ant
AU        tools/javadoc/derbydocs_jdbc4_exclusions.ant
A         tools/javadoc/package-list
AU        tools/javadoc/publishedapi.ant
A         tools/javadoc/derbydocs_exclusions.ant
A         tools/l10n
AU        tools/l10n/LocCompare.java
AU        tools/l10n/README
AU        tools/l10n/build.xml
A         tools/jar
AU        tools/jar/dnc.properties
AU        tools/jar/net.properties
AU        tools/jar/extraDBMSclasses.properties
AU        tools/jar/DBMSnodes.properties
AU        tools/jar/extraDBMStypes.properties
AU        tools/jar/tools.properties
A         tools/testing
A         tools/testing/i18nTestGenerator
A         tools/testing/i18nTestGenerator/genClient1.sed
AU        tools/testing/i18nTestGenerator/genClient2.sed
AU        tools/testing/i18nTestGenerator/generateClientMessageTest.sh
AU        tools/testing/i18nTestGenerator/clientPrologue.txt
AU        tools/testing/i18nTestGenerator/README
A         tools/testing/reporting
A         tools/testing/reporting/scripts
AU        tools/testing/reporting/scripts/svnDiffToRev
AU        tools/testing/reporting/scripts/mkGNUplot
AU        tools/testing/reporting/scripts/cygwin-system
AU        tools/testing/reporting/scripts/system
AU        tools/testing/reporting/scripts/buildDerby
AU        tools/testing/reporting/scripts/textMail
AU        tools/testing/reporting/scripts/initDERBYDIR
AU        tools/testing/reporting/scripts/env
AU        tools/testing/reporting/scripts/updateBuildTestDerby
AU        tools/testing/reporting/scripts/createBaselineFiles
AU        tools/testing/reporting/scripts/platformsDurPrcnt
AU        tools/testing/reporting/scripts/testSummariesDerby
AU        tools/testing/reporting/scripts/README.1
AU        tools/testing/reporting/scripts/README.2
AU        tools/testing/reporting/scripts/mkJIRArefs
AU        tools/testing/reporting/scripts/mkAllPlotDataAndPlots
AU        tools/testing/reporting/scripts/solaris-cpu_mem
AU        tools/testing/reporting/scripts/scp_dummy
AU        tools/testing/reporting/scripts/createBaselineFilesOnePlatform
AU        tools/testing/reporting/scripts/toSeconds
AU        tools/testing/reporting/scripts/getBaselineTime
AU        tools/testing/reporting/scripts/cronCurrentTestInfoDerby
AU        tools/testing/reporting/scripts/updateDerby
AU        tools/testing/reporting/scripts/svnLogRevs
AU        tools/testing/reporting/scripts/cronUpdateBuildTestDerby
AU        tools/testing/reporting/scripts/platformsFailCount
AU        tools/testing/reporting/scripts/mkDerbyTestIndex_all
AU        tools/testing/reporting/scripts/mkJIRArefs.current
AU        tools/testing/reporting/scripts/mkAllDerbyTestInfo.public
AU        tools/testing/reporting/scripts/runAllTests
AU        tools/testing/reporting/scripts/cronMkAllPlotDataAndPlots
AU        tools/testing/reporting/scripts/linux-system
AU        tools/testing/reporting/scripts/linux-cpu_mem
AU        tools/testing/reporting/scripts/fromSeconds
AU        tools/testing/reporting/scripts/calcPercent
AU        tools/testing/reporting/scripts/cygwin-cpu_mem
AU        tools/testing/reporting/scripts/mkDerbyTestIndex
AU        tools/testing/reporting/scripts/cpu_mem
AU        tools/testing/reporting/scripts/mkPercentForTimeListVsBaseline
AU        tools/testing/reporting/scripts/mkUpdateInfo
A         tools/testing/reporting/scripts/gnuplot
AU        tools/testing/reporting/scripts/gnuplot/duration_all.gp
AU        tools/testing/reporting/scripts/gnuplot/duration.gp
AU        tools/testing/reporting/scripts/doplot_all
AU        tools/testing/reporting/scripts/testPlatformsDerby
AU        tools/testing/reporting/scripts/solaris-system
AU        tools/testing/reporting/scripts/mkGNUplot.recent
AU        tools/testing/reporting/scripts/cronMkDerbyTestIndex_all
AU        tools/testing/reporting/scripts/cronUpdateAllTestInfoDerby
AU        tools/testing/reporting/scripts/testHistoriesDerby
AU        tools/testing/reporting/scripts/svnLogRevs.new
AU        tools/testing/reporting/scripts/doplot
AU        tools/testing/reporting/scripts/mkAllDerbyTestInfo
AU        tools/testing/reporting/scripts/vsTimeBase
AU        tools/testing/reporting/scripts/calcJarFootprint
AU        tools/testing/reporting/scripts/mkSandBoxSummary
AU        tools/testing/reporting/scripts/TODO
AU        tools/testing/reporting/scripts/mkGNUplot_last20
AU        tools/testing/reporting/scripts/testDerby
AU        tools/testing/reporting/scripts/startDerbyTests
A         tools/testing/reporting/Failures
AU        tools/testing/reporting/Failures/JIRA_description.txt
A         tools/testing/reporting/TEMPLATES
AU        tools/testing/reporting/TEMPLATES/env.sh
AU        tools/testing/reporting/TEMPLATES/testenv.sh
AU        tools/testing/reporting/TEMPLATES/index.html
AU        tools/testing/reporting/TEMPLATES/index.shtml
AU        published_api_overview.html
A         bin
AU        bin/dblook.bat
AU        bin/setNetworkServerCP
AU        bin/sysinfo.bat
AU        bin/derby_common.bat
AU        bin/startNetworkServer.bat
AU        bin/setNetworkServerCP.bat
AU        bin/NetworkServerControl.bat
AU        bin/ij.bat
AU        bin/setNetworkClientCP
AU        bin/setEmbeddedCP
AU        bin/stopNetworkServer.bat
AU        bin/setNetworkClientCP.bat
AU        bin/setEmbeddedCP.bat
A         bin/templates
AU        bin/templates/NetworkServerControl
AU        bin/templates/ij
AU        bin/templates/derby_common.sh
AU        bin/templates/stopNetworkServer
AU        bin/templates/dblook
AU        bin/templates/sysinfo
AU        bin/templates/startNetworkServer
AU        RELEASE-NOTES.html
AU        index.html
AU        KEYS
 U        .
At revision 1127853
[Derby-branch-10.7] $ /bin/bash -xe /tmp/hudson2826293477962571075.sh
+ '[' '!' -e <https://builds.apache.org/hudson/job/Derby-branch-10.7/ws/junit.jar> ']'
+ WGET=wget
++ which wget
++ grep 'no wget'
+ '[' -n '' ']'
+ wget --no-check-certificate http://people.apache.org/~kristwaa/junit.jar
--2011-05-26 03:04:33--  http://people.apache.org/~kristwaa/junit.jar
Resolving people.apache.org... 140.211.11.9
Connecting to people.apache.org|140.211.11.9|:80... connected.
HTTP request sent, awaiting response... 200 OK
Length: 118932 (116K) [text/plain]
Saving to: `junit.jar'

     0K .......... .......... .......... .......... .......... 43%  505K 0s
    50K .......... .......... .......... .......... .......... 86% 1.47M 0s
   100K .......... ......                                     100% 52.5M=0.1s

2011-05-26 03:04:33 (877 KB/s) - `junit.jar' saved [118932/118932]

+ cp <https://builds.apache.org/hudson/job/Derby-branch-10.7/ws/junit.jar> <https://builds.apache.org/hudson/job/Derby-branch-10.7/ws/10.7-head/tools/java>
[10.7-head] $ /home/hudson/tools/ant/latest/bin/ant clobber all buildjars
Unable to locate tools.jar. Expected to find it in /usr/lib/jvm/java-6-openjdk/lib/tools.jar
Buildfile: <https://builds.apache.org/hudson/job/Derby-branch-10.7/ws/10.7-head/build.xml>

clean:

cleangenerated:

cleanstate:

cleanreleasefiles:

clobber:

checkCompilerLevel:
    [javac] <https://builds.apache.org/hudson/job/Derby-branch-10.7/ws/10.7-head/build.xml>:148:
warning: 'includeantruntime' was not set, defaulting to build.sysclasspath=last; set to false
for repeatable builds

setInitialProperties:

init:
    [mkdir] Created dir: <https://builds.apache.org/hudson/job/Derby-branch-10.7/ws/10.7-head/classes>

make-generated-dirs:
    [mkdir] Created dir: <https://builds.apache.org/hudson/job/Derby-branch-10.7/ws/10.7-head/generated>
    [mkdir] Created dir: <https://builds.apache.org/hudson/job/Derby-branch-10.7/ws/10.7-head/generated/bin>
    [mkdir] Created dir: <https://builds.apache.org/hudson/job/Derby-branch-10.7/ws/10.7-head/generated/java>
    [mkdir] Created dir: <https://builds.apache.org/hudson/job/Derby-branch-10.7/ws/10.7-head/generated/java/org/apache/derby/shared/common/sanity>
    [mkdir] Created dir: <https://builds.apache.org/hudson/job/Derby-branch-10.7/ws/10.7-head/generated/java/org/apache/derby/impl/tools/ij>
    [mkdir] Created dir: <https://builds.apache.org/hudson/job/Derby-branch-10.7/ws/10.7-head/generated/java/org/apache/derby/impl/sql/compile>
    [mkdir] Created dir: <https://builds.apache.org/hudson/job/Derby-branch-10.7/ws/10.7-head/generated/java/org/apache/derby/loc>
    [mkdir] Created dir: <https://builds.apache.org/hudson/job/Derby-branch-10.7/ws/10.7-head/generated/java/org/apache/derby/iapi/services/cache>
    [mkdir] Created dir: <https://builds.apache.org/hudson/job/Derby-branch-10.7/ws/10.7-head/generated/toursdb>

make-release-dirs:
    [mkdir] Created dir: <https://builds.apache.org/hudson/job/Derby-branch-10.7/ws/10.7-head/release>
    [mkdir] Created dir: <https://builds.apache.org/hudson/job/Derby-branch-10.7/ws/10.7-head/release/distributions>
    [mkdir] Created dir: <https://builds.apache.org/hudson/job/Derby-branch-10.7/ws/10.7-head/release/snapshot>
    [mkdir] Created dir: <https://builds.apache.org/hudson/job/Derby-branch-10.7/ws/10.7-head/classes/empty>

ensuresanitystate:

evaluate.sane:

ensuresanitystate.sane:

make-generated-dirs:

sane:
[propertyfile] Creating new property file: <https://builds.apache.org/hudson/job/Derby-branch-10.7/ws/10.7-head/generated/java/org/apache/derby/shared/common/sanity/state.properties>

ensuresanitystate.insane:

setissane:

prebuild:

compile:
    [javac] <https://builds.apache.org/hudson/job/Derby-branch-10.7/ws/10.7-head/java/build/org/apache/derbyPreBuild/build.xml>:44:
warning: 'includeantruntime' was not set, defaulting to build.sysclasspath=last; set to false
for repeatable builds
    [javac] Compiling 3 source files to <https://builds.apache.org/hudson/job/Derby-branch-10.7/ws/10.7-head/classes>

BUILD FAILED
<https://builds.apache.org/hudson/job/Derby-branch-10.7/ws/10.7-head/build.xml>:568:
The following error occurred while executing this line:
<https://builds.apache.org/hudson/job/Derby-branch-10.7/ws/10.7-head/java/build/org/apache/derbyPreBuild/build.xml>:44:
Unable to find a javac compiler;
com.sun.tools.javac.Main is not on the classpath.
Perhaps JAVA_HOME does not point to the JDK.
It is currently set to "/usr/lib/jvm/java-6-openjdk/jre"

Total time: 1 second
[WARNINGS] Skipping publisher since build result is FAILURE


Mime
View raw message