db-derby-dev mailing list archives: March 2011

Site index · List index
Message list« Previous · 1 · 2 · 3 · 4 · 5 · 6 · 7 · 8 · 9 · 10 · 11 · 12 · 13 · 14 · 15 · Next »Thread · Author · Date
Unai Vivi (JIRA) [jira] Updated: (DERBY-5118) Relational integrity Wed, 09 Mar, 18:30
[jira] Commented: (DERBY-4540) 'AssertionFailedError' in 'store.AccessTest.testCS4595B_UniqueIndex(AccessTest.java:1729)' on SUSE Linux / IBM JIT - r9
Kathey Marsden (JIRA)   [jira] Commented: (DERBY-4540) 'AssertionFailedError' in 'store.AccessTest.testCS4595B_UniqueIndex(AccessTest.java:1729)' on SUSE Linux / IBM JIT - r9 Wed, 09 Mar, 19:05
Kathey Marsden (JIRA)   [jira] Commented: (DERBY-4540) 'AssertionFailedError' in 'store.AccessTest.testCS4595B_UniqueIndex(AccessTest.java:1729)' on SUSE Linux / IBM JIT - r9 Mon, 14 Mar, 21:49
[jira] Commented: (DERBY-5118) Relational integrity
Rick Hillegas (JIRA)   [jira] Commented: (DERBY-5118) Relational integrity Wed, 09 Mar, 19:06
Unai Vivi (JIRA)   [jira] Commented: (DERBY-5118) Relational integrity Thu, 10 Mar, 10:19
Kathey Marsden (JIRA) [jira] Created: (DERBY-5119) testQualifiers(org.apache.derbyTesting.functionTests.tests.store.AccessTest)java.sql.SQLException: Table/View 'FOO' already exists in Schema 'APP'. Wed, 09 Mar, 19:10
Rick Hillegas (JIRA) [jira] Resolved: (DERBY-5118) Relational integrity Wed, 09 Mar, 19:10
[jira] Commented: (DERBY-5109) testRAFWriteInterupted fails with The exception 'junit.framework.AssertionFailedError: interrupt flag lost' was thrown while evaluating an expression
Kathey Marsden (JIRA)   [jira] Commented: (DERBY-5109) testRAFWriteInterupted fails with The exception 'junit.framework.AssertionFailedError: interrupt flag lost' was thrown while evaluating an expression Wed, 09 Mar, 19:14
Myrna van Lunteren (JIRA)   [jira] Commented: (DERBY-5109) testRAFWriteInterupted fails with The exception 'junit.framework.AssertionFailedError: interrupt flag lost' was thrown while evaluating an expression Tue, 15 Mar, 00:55
Dag H. Wanvik (JIRA)   [jira] Commented: (DERBY-5109) testRAFWriteInterupted fails with The exception 'junit.framework.AssertionFailedError: interrupt flag lost' was thrown while evaluating an expression Wed, 16 Mar, 13:29
Mamta A. Satoor (JIRA) [jira] Created: (DERBY-5120) Row from SYSDEPENDS gets deleted when a table has update triggers defined on it and an upate is made to the table Wed, 09 Mar, 20:42
Mike Matrigali will istats feature run in a soft upgraded database? Wed, 09 Mar, 21:19
Knut Anders Hatlen   Re: will istats feature run in a soft upgraded database? Wed, 09 Mar, 22:38
[jira] Updated: (DERBY-5108) Intermittent failure in AutomaticIndexStatisticsTest.testShutdownWhileScanningThenDelete on Windows
Mike Matrigali (JIRA)   [jira] Updated: (DERBY-5108) Intermittent failure in AutomaticIndexStatisticsTest.testShutdownWhileScanningThenDelete on Windows Wed, 09 Mar, 21:49
Mike Matrigali (JIRA)   [jira] Updated: (DERBY-5108) Intermittent failure in AutomaticIndexStatisticsTest.testShutdownWhileScanningThenDelete on Windows Thu, 10 Mar, 23:25
Rick Hillegas (JIRA)   [jira] Updated: (DERBY-5108) Intermittent failure in AutomaticIndexStatisticsTest.testShutdownWhileScanningThenDelete on Windows Fri, 11 Mar, 14:55
Knut Anders Hatlen (JIRA)   [jira] Updated: (DERBY-5108) Intermittent failure in AutomaticIndexStatisticsTest.testShutdownWhileScanningThenDelete on Windows Mon, 14 Mar, 14:48
Rick Hillegas (JIRA)   [jira] Updated: (DERBY-5108) Intermittent failure in AutomaticIndexStatisticsTest.testShutdownWhileScanningThenDelete on Windows Mon, 14 Mar, 19:59
Dag H. Wanvik (JIRA)   [jira] Updated: (DERBY-5108) Intermittent failure in AutomaticIndexStatisticsTest.testShutdownWhileScanningThenDelete on Windows Thu, 17 Mar, 18:04
Rick Hillegas (JIRA) [jira] Created: (DERBY-5121) Problem mapping column to procedure arg when executing an UPDATE trigger Thu, 10 Mar, 02:41
[jira] Updated: (DERBY-5121) Problem mapping column to procedure arg when executing an UPDATE trigger
Rick Hillegas (JIRA)   [jira] Updated: (DERBY-5121) Problem mapping column to procedure arg when executing an UPDATE trigger Thu, 10 Mar, 02:43
Rick Hillegas (JIRA)   [jira] Updated: (DERBY-5121) Problem mapping column to procedure arg when executing an UPDATE trigger Thu, 10 Mar, 02:43
Rick Hillegas (JIRA) [jira] Created: (DERBY-5122) Placeholder for marking disabled tests. Thu, 10 Mar, 16:40
Rick Hillegas (JIRA) [jira] Updated: (DERBY-5122) Placeholder for marking disabled tests. Thu, 10 Mar, 16:40
Ole.Solb...@Sun.COM Regression Test Report - Daily 1079883 - Sun DBTG Thu, 10 Mar, 16:55
Myrna van Lunteren (JIRA) [jira] Created: (DERBY-5123) address a select number of intermittent test issues - goal is to get all nightly tests at trunk running clean for at least 2 weeks Thu, 10 Mar, 19:59
Kathey Marsden (JIRA) [jira] Updated: (DERBY-4852) Lots of failures with Connection Refused, starting with JMXtest.testDerbyRegisteredMBeansSimpleInfo on 10.6.2.3(1022806) codeline while running Junit suite with ibm16 on windows machine Thu, 10 Mar, 20:34
Kathey Marsden (JIRA) [jira] Updated: (DERBY-5091) Derby Test and Fix 2011 GSoC Project Thu, 10 Mar, 21:34
Kathey Marsden Derby GSoc 2011 Thu, 10 Mar, 21:58
Nirmal Fernando   Re: Derby GSoc 2011 Fri, 11 Mar, 03:31
siddharth srivastava   Re: Derby GSoc 2011 Fri, 11 Mar, 04:24
Kathey Marsden     Re: Derby GSoc 2011 Fri, 11 Mar, 04:53
[jira] Assigned: (DERBY-5108) Intermittent failure in AutomaticIndexStatisticsTest.testShutdownWhileScanningThenDelete on Windows
Mike Matrigali (JIRA)   [jira] Assigned: (DERBY-5108) Intermittent failure in AutomaticIndexStatisticsTest.testShutdownWhileScanningThenDelete on Windows Thu, 10 Mar, 23:01
Mike Matrigali (JIRA)   [jira] Assigned: (DERBY-5108) Intermittent failure in AutomaticIndexStatisticsTest.testShutdownWhileScanningThenDelete on Windows Tue, 15 Mar, 16:01
[jira] Commented: (DERBY-5096) DisconnectException: "Connection was refused because the database DB was not found" when creating db for first time
Steven Hendrickx (JIRA)   [jira] Commented: (DERBY-5096) DisconnectException: "Connection was refused because the database DB was not found" when creating db for first time Fri, 11 Mar, 09:47
Kathey Marsden (JIRA)   [jira] Commented: (DERBY-5096) DisconnectException: "Connection was refused because the database DB was not found" when creating db for first time Fri, 11 Mar, 17:02
[jira] Updated: (DERBY-5102) GrantRevokeDDLTest depends on implicit ordering of test cases
Knut Anders Hatlen (JIRA)   [jira] Updated: (DERBY-5102) GrantRevokeDDLTest depends on implicit ordering of test cases Fri, 11 Mar, 12:31
Knut Anders Hatlen (JIRA)   [jira] Updated: (DERBY-5102) GrantRevokeDDLTest depends on implicit ordering of test cases Fri, 11 Mar, 12:50
Knut Anders Hatlen (JIRA) [jira] Resolved: (DERBY-5102) GrantRevokeDDLTest depends on implicit ordering of test cases Fri, 11 Mar, 12:52
Apache Hudson Server Build failed in Jenkins: Derby-trunk #806 Fri, 11 Mar, 13:05
Apache Hudson Server   Build failed in Jenkins: Derby-trunk #807 Fri, 11 Mar, 15:04
Apache Hudson Server     Jenkins build is back to normal : Derby-trunk #808 Fri, 11 Mar, 23:14
Knut Anders Hatlen (JIRA) [jira] Created: (DERBY-5124) NPE or assert failure printed when dropping table while statistics are written out Fri, 11 Mar, 13:28
Knut Anders Hatlen (JIRA) [jira] Commented: (DERBY-5124) NPE or assert failure printed when dropping table while statistics are written out Fri, 11 Mar, 13:32
Knut Anders Hatlen (JIRA) [jira] Updated: (DERBY-5124) NPE or assert failure printed when dropping table while statistics are written out Fri, 11 Mar, 14:13
Knut Anders Hatlen (JIRA) [jira] Resolved: (DERBY-5124) NPE or assert failure printed when dropping table while statistics are written out Fri, 11 Mar, 14:14
Knut Anders Hatlen (JIRA) [jira] Assigned: (DERBY-5045) Assert failures in UpdateStatisticsTest Fri, 11 Mar, 14:57
[jira] Updated: (DERBY-5045) Assert failures in UpdateStatisticsTest
Knut Anders Hatlen (JIRA)   [jira] Updated: (DERBY-5045) Assert failures in UpdateStatisticsTest Fri, 11 Mar, 14:57
Knut Anders Hatlen (JIRA)   [jira] Updated: (DERBY-5045) Assert failures in UpdateStatisticsTest Sat, 12 Mar, 16:51
Zied ABID (JIRA) [jira] Created: (DERBY-5125) Derby 10.7.1.1 : Duild fails with javacc 5 (Debian packaging) Fri, 11 Mar, 15:47
[jira] Updated: (DERBY-5125) Derby 10.7.1.1 : Duild fails with javacc 5 (Debian packaging)
Zied ABID (JIRA)   [jira] Updated: (DERBY-5125) Derby 10.7.1.1 : Duild fails with javacc 5 (Debian packaging) Fri, 11 Mar, 15:49
Zied ABID (JIRA)   [jira] Updated: (DERBY-5125) Derby 10.7.1.1 : Duild fails with javacc 5 (Debian packaging) Fri, 11 Mar, 15:49
[jira] Updated: (DERBY-5125) Derby 10.7.1.1 : Build fails with javacc 5 (for Debian packaging)
Zied ABID (JIRA)   [jira] Updated: (DERBY-5125) Derby 10.7.1.1 : Build fails with javacc 5 (for Debian packaging) Fri, 11 Mar, 15:52
Knut Anders Hatlen (JIRA)   [jira] Updated: (DERBY-5125) Derby 10.7.1.1 : Build fails with javacc 5 (for Debian packaging) Sun, 13 Mar, 13:14
Kathey Marsden (JIRA)   [jira] Updated: (DERBY-5125) Derby 10.7.1.1 : Build fails with javacc 5 (for Debian packaging) Mon, 14 Mar, 16:07
[jira] Commented: (DERBY-5125) Derby 10.7.1.1 : Build fails with javacc 5 (for Debian packaging)
Rick Hillegas (JIRA)   [jira] Commented: (DERBY-5125) Derby 10.7.1.1 : Build fails with javacc 5 (for Debian packaging) Fri, 11 Mar, 16:13
Zied ABID (JIRA)   [jira] Commented: (DERBY-5125) Derby 10.7.1.1 : Build fails with javacc 5 (for Debian packaging) Sun, 13 Mar, 11:00
Zied ABID (JIRA)   [jira] Commented: (DERBY-5125) Derby 10.7.1.1 : Build fails with javacc 5 (for Debian packaging) Mon, 14 Mar, 15:43
Knut Anders Hatlen (JIRA)   [jira] Commented: (DERBY-5125) Derby 10.7.1.1 : Build fails with javacc 5 (for Debian packaging) Mon, 14 Mar, 16:18
Rick Hillegas 10.8.1 showstoppers Fri, 11 Mar, 16:25
Ole.Solb...@Sun.COM Regression Test Report - Daily 1080279 - Sun DBTG Fri, 11 Mar, 16:55
Kathey Marsden (JIRA) [jira] Created: (DERBY-5126) Add Derby test case for CVE-2010-4476 - Java Runtime Environment hangs when converting "2.2250738585072012e-308" to a binary floating-point number Fri, 11 Mar, 19:13
Rick Hillegas (JIRA) [jira] Updated: (DERBY-5126) Add Derby test case for CVE-2010-4476 - Java Runtime Environment hangs when converting "2.2250738585072012e-308" to a binary floating-point number Fri, 11 Mar, 19:31
[jira] Updated: (DERBY-5121) Problem mapping the update row to the row passed to the action statement when executing an UPDATE trigger
Rick Hillegas (JIRA)   [jira] Updated: (DERBY-5121) Problem mapping the update row to the row passed to the action statement when executing an UPDATE trigger Fri, 11 Mar, 20:40
Rick Hillegas (JIRA)   [jira] Updated: (DERBY-5121) Problem mapping the update row to the row passed to the action statement when executing an UPDATE trigger Fri, 11 Mar, 20:47
[jira] Issue Comment Edited: (DERBY-5096) DisconnectException: "Connection was refused because the database DB was not found" when creating db for first time
Kathey Marsden (JIRA)   [jira] Issue Comment Edited: (DERBY-5096) DisconnectException: "Connection was refused because the database DB was not found" when creating db for first time Fri, 11 Mar, 21:48
Kathey Marsden (JIRA)   [jira] Issue Comment Edited: (DERBY-5096) DisconnectException: "Connection was refused because the database DB was not found" when creating db for first time Fri, 11 Mar, 21:53
Kathey Marsden (JIRA) [jira] Issue Comment Edited: (DERBY-4319) hang in suites.all with ibm 1.5 on AIX after ttestDefaultProperties Fri, 11 Mar, 21:53
Message list« Previous · 1 · 2 · 3 · 4 · 5 · 6 · 7 · 8 · 9 · 10 · 11 · 12 · 13 · 14 · 15 · Next »Thread · Author · Date
Box list
Jul 2014429
Jun 2014712
May 2014698
Apr 2014464
Mar 2014895
Feb 2014630
Jan 2014475
Dec 2013329
Nov 2013524
Oct 2013875
Sep 2013562
Aug 2013618
Jul 2013657
Jun 20131166
May 2013788
Apr 20131185
Mar 2013588
Feb 2013664
Jan 2013538
Dec 2012331
Nov 2012446
Oct 2012636
Sep 2012663
Aug 2012384
Jul 2012481
Jun 2012586
May 2012900
Apr 2012709
Mar 2012767
Feb 2012897
Jan 2012391
Dec 2011478
Nov 2011444
Oct 2011576
Sep 2011744
Aug 2011684
Jul 2011722
Jun 2011804
May 2011605
Apr 2011574
Mar 20111193
Feb 20111393
Jan 2011834
Dec 2010535
Nov 2010595
Oct 2010703
Sep 2010673
Aug 2010657
Jul 2010848
Jun 2010929
May 2010709
Apr 2010885
Mar 2010673
Feb 2010646
Jan 2010638
Dec 2009566
Nov 2009660
Oct 2009604
Sep 2009505
Aug 2009921
Jul 20091312
Jun 20091035
May 2009835
Apr 20091088
Mar 2009884
Feb 2009541
Jan 2009692
Dec 2008522
Nov 2008616
Oct 2008723
Sep 2008455
Aug 2008754
Jul 2008988
Jun 2008871
May 2008842
Apr 20081384
Mar 20081904
Feb 20082074
Jan 20081539
Dec 2007852
Nov 20071273
Oct 20071391
Sep 2007911
Aug 2007908
Jul 20071492
Jun 20072222
May 20072295
Apr 20071394
Mar 20072200
Feb 20071383
Jan 20071360
Dec 20061026
Nov 20061413
Oct 20061324
Sep 20062319
Aug 20063287
Jul 20062434
Jun 20061712
May 20061602
Apr 20061694
Mar 20061985
Feb 20062535
Jan 20061640
Dec 2005741
Nov 20051157
Oct 20051185
Sep 2005783
Aug 2005896
Jul 2005652
Jun 20051494
May 20051323
Apr 2005684
Mar 2005612
Feb 2005351
Jan 2005438
Dec 2004435
Nov 2004274
Oct 2004281
Sep 2004388
Aug 2004160