db-derby-dev mailing list archives: February 2011

Site index · List index
Message list« Previous · 1 · 2 · 3 · 4 · 5 · 6 · 7 · 8 · 9 · 10 · 11 · 12 · 13 · 14 · Next »Thread · Author · Date
Myrna van Lunteren (JIRA) [jira] Closed: (DERBY-2588) SecureServerTest( Opened = false, Authenticated= false, CustomDerbyProperties= true )junit.framework.AssertionFailedError: extinout\derby.log Wed, 23 Feb, 07:50
Myrna van Lunteren (JIRA) [jira] Closed: (DERBY-2637) encountered junit failure in DerbyNetNewServer Wed, 23 Feb, 08:04
Myrna van Lunteren (JIRA) [jira] Closed: (DERBY-2650) derbynet/dblook_test_net.java: Failed to start database - intermittent failure Wed, 23 Feb, 08:10
Myrna van Lunteren (JIRA) [jira] Closed: (DERBY-2767) 'lang/ddlTableLockMode.sql' fails with 'Number of rows visited=1' when expecting '0'. Wed, 23 Feb, 08:14
Myrna van Lunteren (JIRA) [jira] Updated: (DERBY-2916) Change/error? in 'Ordered null semantics' output from 'SYSCS_UTIL.SYSCS_GET_RUNTIMESTATISTICS()' in lang/wisconsin.java Wed, 23 Feb, 08:18
Myrna van Lunteren (JIRA) [jira] Updated: (DERBY-2947) Reoccurrence of DERBY-861: Intermittent failure of store/readlocks.sql Wed, 23 Feb, 08:18
Myrna van Lunteren (JIRA) [jira] Closed: (DERBY-3101) Some of the derbynet tests fails with Timed out waiting for network server to start on Zos machine Wed, 23 Feb, 08:22
Myrna van Lunteren (JIRA) [jira] Updated: (DERBY-3248) SecureServerTest needs cleanup runServerCommand, possibly causing test failures when tests are run through ant. Wed, 23 Feb, 08:24
Myrna van Lunteren (JIRA) [jira] Closed: (DERBY-3295) DataSourceTest.testConnectionErrorEvent() failed with AssertionFailedError Wed, 23 Feb, 08:28
Myrna van Lunteren (JIRA) [jira] Updated: (DERBY-3251) NetworkServerTestSetup.startSeparateProcess() can end up with the server stalled. Wed, 23 Feb, 08:38
Myrna van Lunteren (JIRA) [jira] Closed: (DERBY-3389) 'store/OnlineCompressTest.java' fails with "Expected at least 33 pages reclaimed. ERROR: for 2000 row test. Expected 1, but got 18" Wed, 23 Feb, 12:06
Myrna van Lunteren (JIRA) [jira] Closed: (DERBY-3833) OnlineCompressTest fails with ERROR XSDBB: Unknown page format at page Page(1,Container(0, 1440)) on 10.3 with ibm 1.5 Wed, 23 Feb, 12:08
Myrna van Lunteren (JIRA) [jira] Closed: (DERBY-3465) 'testNetworkServerSecurityMechanism' fails with 'junit.framework.AssertionFailedError: did not expect an sqlexception'. Wed, 23 Feb, 12:24
Myrna van Lunteren (JIRA) [jira] Updated: (DERBY-3519) junit regression test failure in testInertTime(org.apache.derbyTesting.functionTests.tests.lang.TimeHandlingTest)junit.framework.AssertionFailedError: expected:<2> but was:<3> Wed, 23 Feb, 12:30
Myrna van Lunteren (JIRA) [jira] Closed: (DERBY-3604) Hang in .suites.All on 10.4 trunk ('Found one Java-level deadlock') Wed, 23 Feb, 12:30
Myrna van Lunteren (JIRA) [jira] Updated: (DERBY-3624) testfailure in storetests/st_derby715 with ibm 1.5 on iseries machine; one deadlock message missing Wed, 23 Feb, 12:34
Myrna van Lunteren (JIRA) [jira] Closed: (DERBY-3627) derbynet/DerbyNetAutoStart.java with DerbyNetClient fails intermittently on iseries Wed, 23 Feb, 12:52
Myrna van Lunteren (JIRA) [jira] Updated: (DERBY-3647) EMMA is unable to write coverage information from network server when it is started in a separate process with default security policy Wed, 23 Feb, 12:54
Myrna van Lunteren (JIRA) [jira] Closed: (DERBY-3679) dataSourcePermissions_net failed on 10.1 with NullPointerException on IBM 1.5 Wed, 23 Feb, 13:08
Myrna van Lunteren (JIRA) [jira] Commented: (DERBY-3679) dataSourcePermissions_net failed on 10.1 with NullPointerException on IBM 1.5 Wed, 23 Feb, 13:14
Myrna van Lunteren (JIRA) [jira] Updated: (DERBY-3680) subquery.sql fails intermittently with different plan Wed, 23 Feb, 13:16
Myrna van Lunteren (JIRA) [jira] Updated: (DERBY-3740) BlobClob4BlobTest.testLockingWithLongRowBlob fails with .AssertionFailedError: FAIL - statement should timeout in 10.3 codeline on Linux with IBM 1.5 Wed, 23 Feb, 13:17
Myrna van Lunteren (JIRA) [jira] Updated: (DERBY-3808) Convert subquery.sql to junit Wed, 23 Feb, 21:54
Myrna van Lunteren (JIRA) [jira] Updated: (DERBY-3819) 'Expected Table Scan ResultSet for T3' in 'test_predicatePushdown(....PredicatePushdownTest)' since 670215 2008-06-21 18:01:08 MEST Wed, 23 Feb, 22:12
Myrna van Lunteren (JIRA) [jira] Closed: (DERBY-3821) 'OutOfMemoryError: Java heap space: XJ001.U' in 'testXATransactionTimeout' on 10.4 Wed, 23 Feb, 22:28
Myrna van Lunteren (JIRA) [jira] Closed: (DERBY-3866) access denied (java.lang.RuntimePermission charsetProvider) in LocalizedDisplay(...i18n.LocalizedDisplayScriptTest) with JRE - JDBC: J2SE 1.4.2 - JDBC 3.0 on Microsoft Windows XP Professional - 5.1. Thu, 24 Feb, 08:28
Myrna van Lunteren (JIRA) [jira] Commented: (DERBY-3866) access denied (java.lang.RuntimePermission charsetProvider) in LocalizedDisplay(...i18n.LocalizedDisplayScriptTest) with JRE - JDBC: J2SE 1.4.2 - JDBC 3.0 on Microsoft Windows XP Professional - 5.1. Thu, 24 Feb, 08:50
Myrna van Lunteren (JIRA) [jira] Reopened: (DERBY-1801) Reoccurrence of JIRA-937: Instability in wisconsin test Thu, 24 Feb, 08:58
Myrna van Lunteren (JIRA) [jira] Updated: (DERBY-1801) Reoccurrence of JIRA-937: Instability in wisconsin test Thu, 24 Feb, 08:58
Myrna van Lunteren (JIRA) [jira] Reopened: (DERBY-2650) derbynet/dblook_test_net.java: Failed to start database - intermittent failure Thu, 24 Feb, 09:02
Myrna van Lunteren (JIRA) [jira] Updated: (DERBY-2650) derbynet/dblook_test_net.java: Failed to start database - intermittent failure Thu, 24 Feb, 09:02
Myrna van Lunteren (JIRA) [jira] Commented: (DERBY-973) Restore fails in OnlineBackupTest1 Thu, 24 Feb, 09:06
Myrna van Lunteren (JIRA) [jira] Updated: (DERBY-3389) 'store/OnlineCompressTest.java' fails with "Expected at least 33 pages reclaimed. ERROR: for 2000 row test. Expected 1, but got 18" Thu, 24 Feb, 09:25
Myrna van Lunteren (JIRA) [jira] Reopened: (DERBY-3389) 'store/OnlineCompressTest.java' fails with "Expected at least 33 pages reclaimed. ERROR: for 2000 row test. Expected 1, but got 18" Thu, 24 Feb, 09:25
Myrna van Lunteren (JIRA) [jira] Updated: (DERBY-2767) 'lang/ddlTableLockMode.sql' fails with 'Number of rows visited=1' when expecting '0'. Thu, 24 Feb, 09:29
Myrna van Lunteren (JIRA) [jira] Reopened: (DERBY-2767) 'lang/ddlTableLockMode.sql' fails with 'Number of rows visited=1' when expecting '0'. Thu, 24 Feb, 09:29
Myrna van Lunteren (JIRA) [jira] Commented: (DERBY-3873) Intermittent failures in 'ttestSetPortPriority(o.a.dT.fT.tests.derbynet.ServerPropertiesTest)' Thu, 24 Feb, 10:00
Myrna van Lunteren (JIRA) [jira] Updated: (DERBY-3873) Intermittent failures in 'ttestSetPortPriority(o.a.dT.fT.tests.derbynet.ServerPropertiesTest)' Thu, 24 Feb, 10:02
Myrna van Lunteren (JIRA) [jira] Closed: (DERBY-3979) NullPointerException (NPE) in test jdbc20 - jdbcapi/getCurConnJdbc20.sql Thu, 24 Feb, 11:28
Myrna van Lunteren (JIRA) [jira] Updated: (DERBY-4046) PredicatePushdownTest does not properly test for predicate pushdown in all cases Thu, 24 Feb, 11:30
Myrna van Lunteren (JIRA) [jira] Updated: (DERBY-3993) With IBM 1.6 T_RawStoreFactory fails with There should be 0 observers, but we still have 1 observers on Win 2K Thu, 24 Feb, 11:30
Myrna van Lunteren (JIRA) [jira] Resolved: (DERBY-3987) testMetaDataQueryRunInSYScompilationSchema() fails on small device platforms lacking the Norwegian locale Thu, 24 Feb, 16:54
Myrna van Lunteren (JIRA) [jira] Updated: (DERBY-4021) 'ant junit-lowmem' fails when classpath is not set Thu, 24 Feb, 17:14
Myrna van Lunteren (JIRA) [jira] Updated: (DERBY-4143) lang/aggregateOptimization.sql fails with different query plan on zos IBM 1.6 64bit Thu, 24 Feb, 17:28
Myrna van Lunteren (JIRA) [jira] Closed: (DERBY-4144) 'SecureServerTest' fails with 'AssertionFailedError: Security exceptions in output of trace enabling command: ' Thu, 24 Feb, 17:30
Myrna van Lunteren (JIRA) [jira] Updated: (DERBY-4158) If XA tests fail after the prepare of a transaction, subsequent tests may be affected Thu, 24 Feb, 17:30
Myrna van Lunteren (JIRA) [jira] Closed: (DERBY-4167) NullPointerException in StressMultiTest (testStressMulti) with ibm 1.5 on iseries Thu, 24 Feb, 17:34
Myrna van Lunteren (JIRA) [jira] Updated: (DERBY-4174) some launched processes from tests do not check for success or failure Thu, 24 Feb, 17:40
Myrna van Lunteren (JIRA) [jira] Updated: (DERBY-4201) SecureServerTest AssertionFailedError: Timed out waiting for network server to start Thu, 24 Feb, 17:58
Myrna van Lunteren (JIRA) [jira] Updated: (DERBY-4176) java.net.SocketException: Connection reset with ibm 1.5. running ServerPropertiesTest in suites.All Thu, 24 Feb, 17:58
Myrna van Lunteren (JIRA) [jira] Updated: (DERBY-4209) Stabilize and investigate failures in MogTest Thu, 24 Feb, 18:02
Myrna van Lunteren (JIRA) [jira] Closed: (DERBY-4234) IOException: Incorrect function on rollback after expected duplicate key error (23505) Thu, 24 Feb, 20:14
Myrna van Lunteren (JIRA) [jira] Updated: (DERBY-4266) hang with sane jars with ibm 1.5 on iseries in lang/wisconsin.java Thu, 24 Feb, 20:41
Myrna van Lunteren (JIRA) [jira] Updated: (DERBY-4238) JMX test failure starting network server doesn't seem to get recorded to the fail directory Thu, 24 Feb, 20:45
Myrna van Lunteren (JIRA) [jira] Updated: (DERBY-4418) derbyall/encryptionAll/encryptionAll/aes fails on 10.4, 10.3 and 10.2 with Sun JVM 1.6.0_15 on Solaris Thu, 24 Feb, 21:09
Myrna van Lunteren (JIRA) [jira] Updated: (DERBY-4762) Failure in testPing Thu, 24 Feb, 21:11
Myrna van Lunteren (JIRA) [jira] Updated: (DERBY-4291) Intermittent failure in 'store/updatelocks.sql' on Windows Vista Thu, 24 Feb, 21:11
Myrna van Lunteren (JIRA) [jira] Updated: (DERBY-4635) intermittent failure in (...)replicationTests.ReplicationRun_Local_1Indexing.testReplication_Local_1_Indexing Thu, 24 Feb, 21:13
Myrna van Lunteren (JIRA) [jira] Updated: (DERBY-4852) Lots of failures with Connection Refused, starting with JMXtest.testDerbyRegisteredMBeansSimpleInfo on 10.6.2.3(1022806) codeline while running Junit suite with ibm16 on windows machine Thu, 24 Feb, 21:13
Myrna van Lunteren (JIRA) [jira] Updated: (DERBY-5001) Intermittent bug in InterruptResilienceTest Thu, 24 Feb, 21:15
Myrna van Lunteren (JIRA) [jira] Updated: (DERBY-4975) LDAPAuthenticationTest does not heed port number, and other quirks Thu, 24 Feb, 21:15
Myrna van Lunteren (JIRA) [jira] Updated: (DERBY-4915) test failure in OSReadOnlyTest in assertDirectoryDeleted Thu, 24 Feb, 21:15
Myrna van Lunteren (JIRA) [jira] Updated: (DERBY-4323) test failure in lang.ErrorMessageTest with IBM iseries IBM 1.5 Thu, 24 Feb, 21:17
Myrna van Lunteren (JIRA) [jira] Updated: (DERBY-4265) timed out waiting for server to start in StatementPoolingTest Thu, 24 Feb, 21:19
Myrna van Lunteren (JIRA) [jira] Updated: (DERBY-4303) Handful of replication tests failed because they failed to get a connection to the slave within two minutes. Thu, 24 Feb, 21:21
Myrna van Lunteren (JIRA) [jira] Updated: (DERBY-4647) BaseTestCase.execJavaCmd() does not work with weme 6.2 Thu, 24 Feb, 21:23
Myrna van Lunteren (JIRA) [jira] Updated: (DERBY-4669) ClassLoaderBootTest fails if derbyclient.jar comes before derby.jar on the classpath Thu, 24 Feb, 21:25
Myrna van Lunteren (JIRA) [jira] Updated: (DERBY-4916) Upgrade tests fail in DropDatabaseSetup.tearDown unable to delete a directory Thu, 24 Feb, 21:25
Myrna van Lunteren (JIRA) [jira] Updated: (DERBY-5037) Assertion failure from index-stat-thread when running AutomaticIndexStatisticsTest Thu, 24 Feb, 21:27
Myrna van Lunteren (JIRA) [jira] Updated: (DERBY-5045) Assert failures in UpdateStatisticsTest Thu, 24 Feb, 21:27
Myrna van Lunteren (JIRA) [jira] Updated: (DERBY-5040) On Windows, cascade of errors after failed test AutomaticIndexStatisticsTest Thu, 24 Feb, 21:27
Myrna van Lunteren (JIRA) [jira] Updated: (DERBY-5057) Out-of-memory error in istat tests Thu, 24 Feb, 21:27
Myrna van Lunteren (JIRA) [jira] Updated: (DERBY-4905) test failure in teardown (removeDir) related to testSQLRoles Thu, 24 Feb, 21:29
Myrna van Lunteren (JIRA) [jira] Updated: (DERBY-5014) Tests should restore the timeout values to default after they are done running. Thu, 24 Feb, 21:29
Myrna van Lunteren (JIRA) [jira] Updated: (DERBY-4922) failure in tests using encryption - fails to rename certain database files Thu, 24 Feb, 21:31
Myrna van Lunteren (JIRA) [jira] Closed: (DERBY-4261) testImportDataExportQueryLobsInExtFile fails with NullPointerException with weme6.1 Thu, 24 Feb, 21:48
Myrna van Lunteren (JIRA) [jira] Updated: (DERBY-4616) SysinfoTest prints permission errors when printing sysinfo Thu, 24 Feb, 21:50
Myrna van Lunteren (JIRA) [jira] Updated: (DERBY-4540) 'AssertionFailedError' in 'store.AccessTest.testCS4595B_UniqueIndex(AccessTest.java:1729)' on SUSE Linux / IBM JIT - r9 Thu, 24 Feb, 21:50
Myrna van Lunteren (JIRA) [jira] Updated: (DERBY-4739) test hang in Suites.all starting derbynet.SSLTest on Mac OS X 10.6 Thu, 24 Feb, 21:52
Myrna van Lunteren (JIRA) [jira] Updated: (DERBY-4744) Out of Memory resulting in heapdump and javacore in test derbynetclientmats (and derbynetmats) stress.multi with 10.1 with IBM 1.5 JVM after upgrade to SR11 FP1 (from SR10) Thu, 24 Feb, 21:54
Myrna van Lunteren (JIRA) [jira] Updated: (DERBY-4740) On Mac OSX 10.6 suites.All fails with Exception in thread "main" java.lang.OutOfMemoryError: PermGen space even with -XX:MaxPermSize=128M Thu, 24 Feb, 21:54
Myrna van Lunteren (JIRA) [jira] Updated: (DERBY-4824) replication tests hang with classpath entry with parentheses Thu, 24 Feb, 21:54
Myrna van Lunteren (JIRA) [jira] Updated: (DERBY-4925) AssertionFailedError: DerbyMBeanCount:5 in ManagementMBeanTest.testStartStopManagementFromApplication() Thu, 24 Feb, 21:56
Myrna van Lunteren (JIRA) [jira] Updated: (DERBY-4914) Utf8CcsidManagerClientTest timed out waiting for network server to start Thu, 24 Feb, 21:56
Myrna van Lunteren (JIRA) [jira] Updated: (DERBY-5026) testStatsCreatedOnGrowthThenDeleteDb failing with ibm15 on trunk. The revision on trunk is 1069665 Thu, 24 Feb, 21:58
Myrna van Lunteren (JIRA) [jira] Updated: (DERBY-5058) Add support for "boolean" data type in UpdatableResultSetTest Thu, 24 Feb, 21:58
Myrna van Lunteren (JIRA) [jira] Commented: (DERBY-5069) Since Feb 7,2011 weme 6.2 Junit tests have failed to run completely with Failed to invoke suite():java.lang.reflect.InvocationTargetException Sun, 27 Feb, 04:38
Myrna van Lunteren (JIRA) [jira] Created: (DERBY-5072) test failure in org.apache.derbyTesting.functionTests.tests.jdbc4.Driver40UnbootedTest.test_notBooted Sun, 27 Feb, 05:47
Myrna van Lunteren (JIRA) [jira] Commented: (DERBY-5072) test failure in org.apache.derbyTesting.functionTests.tests.jdbc4.Driver40UnbootedTest.test_notBooted Sun, 27 Feb, 05:53
Myrna van Lunteren (JIRA) [jira] Closed: (DERBY-4266) hang with sane jars with ibm 1.5 on iseries in lang/wisconsin.java Sun, 27 Feb, 08:28
Myrna van Lunteren (JIRA) [jira] Created: (DERBY-5074) test failure(s) with IBM 1.4.2 in store.InterruptResilienceTest.testRAFWriteInterrupted: java.sql.SQLException: The exception 'junit.framework.AssertionFailedError: interrupt flag lost' was thrown while evaluating an expression. Mon, 28 Feb, 08:22
Myrna van Lunteren (JIRA) [jira] Closed: (DERBY-5072) test failure in org.apache.derbyTesting.functionTests.tests.jdbc4.Driver40UnbootedTest.test_notBooted Mon, 28 Feb, 19:35
Nirmal Fernando Resolved Issues Tue, 01 Feb, 05:30
Nirmal Fernando Re: [jira] Commented: (DERBY-4907) EmbeddedXADataSource with ;create=true attribute set in setDatabaseName fails with java.sql.SQLException: Database not available Tue, 01 Feb, 17:22
Nirmal Fernando Re: Few basic doubts Wed, 09 Feb, 13:57
Nirmal Fernando Re: Few basic doubts Wed, 09 Feb, 16:13
Nirmal Fernando UpdateBoolean Tests Tue, 15 Feb, 05:10
Nirmal Fernando Re: UpdateBoolean Tests Tue, 15 Feb, 11:30
Ole.Solb...@Sun.COM Regression Test Report - Daily 1065685 - Sun DBTG Tue, 01 Feb, 16:55
Ole.Solb...@Sun.COM Regression Test Report - Daily 1066096 - Sun DBTG Wed, 02 Feb, 16:55
Message list« Previous · 1 · 2 · 3 · 4 · 5 · 6 · 7 · 8 · 9 · 10 · 11 · 12 · 13 · 14 · Next »Thread · Author · Date
Box list
Oct 2014422
Sep 2014531
Aug 2014659
Jul 2014570
Jun 2014712
May 2014698
Apr 2014464
Mar 2014895
Feb 2014630
Jan 2014475
Dec 2013329
Nov 2013524
Oct 2013875
Sep 2013562
Aug 2013618
Jul 2013657
Jun 20131166
May 2013788
Apr 20131185
Mar 2013588
Feb 2013664
Jan 2013538
Dec 2012331
Nov 2012446
Oct 2012636
Sep 2012663
Aug 2012384
Jul 2012481
Jun 2012586
May 2012900
Apr 2012709
Mar 2012767
Feb 2012897
Jan 2012391
Dec 2011478
Nov 2011444
Oct 2011576
Sep 2011744
Aug 2011684
Jul 2011722
Jun 2011804
May 2011605
Apr 2011574
Mar 20111193
Feb 20111393
Jan 2011834
Dec 2010535
Nov 2010595
Oct 2010703
Sep 2010673
Aug 2010657
Jul 2010848
Jun 2010929
May 2010709
Apr 2010885
Mar 2010673
Feb 2010646
Jan 2010638
Dec 2009566
Nov 2009660
Oct 2009604
Sep 2009505
Aug 2009921
Jul 20091312
Jun 20091035
May 2009835
Apr 20091088
Mar 2009884
Feb 2009541
Jan 2009692
Dec 2008522
Nov 2008616
Oct 2008723
Sep 2008455
Aug 2008754
Jul 2008988
Jun 2008871
May 2008842
Apr 20081384
Mar 20081904
Feb 20082074
Jan 20081539
Dec 2007852
Nov 20071273
Oct 20071391
Sep 2007911
Aug 2007908
Jul 20071492
Jun 20072222
May 20072295
Apr 20071394
Mar 20072200
Feb 20071383
Jan 20071360
Dec 20061026
Nov 20061413
Oct 20061324
Sep 20062319
Aug 20063287
Jul 20062434
Jun 20061712
May 20061602
Apr 20061694
Mar 20061985
Feb 20062535
Jan 20061640
Dec 2005741
Nov 20051157
Oct 20051185
Sep 2005783
Aug 2005896
Jul 2005652
Jun 20051494
May 20051323
Apr 2005684
Mar 2005612
Feb 2005351
Jan 2005438
Dec 2004435
Nov 2004274
Oct 2004281
Sep 2004388
Aug 2004160