db-derby-dev mailing list archives

Site index · List index
Message view « Date » · « Thread »
Top « Date » · « Thread »
From "Mike Matrigali (JIRA)" <j...@apache.org>
Subject [jira] Commented: (DERBY-4922) failure in tests using encryption - fails to rename certain database files
Date Thu, 17 Feb 2011 22:51:12 GMT

    [ https://issues.apache.org/jira/browse/DERBY-4922?page=com.atlassian.jira.plugin.system.issuetabpanels:comment-tabpanel&focusedCommentId=12996137#comment-12996137
] 

Mike Matrigali commented on DERBY-4922:
---------------------------------------

another 10.7, windows, ibm16 example:
http://people.apache.org/~myrnavl/derby_test_results/v10_7/windows/testlog/ibm16/1070375-suites.All_diff.txt

There was 1 error:
1) testEncrypt(org.apache.derbyTesting.functionTests.tests.jdbcapi.DboPowersTest)java.sql.SQLException:
Failed to start database 'dbsqlauth' with class loader sun.misc.Launcher$AppClassLoader@44fa44fa,
see the next exception for details.
	at java.lang.Throwable.<init>(Throwable.java:80)
	at java.sql.SQLException.<init>(SQLException.java:153)
	at java.sql.SQLException.<init>(SQLException.java:176)
	at org.apache.derby.impl.jdbc.SQLExceptionFactory40.getSQLException(Unknown Source)
	at org.apache.derby.impl.jdbc.Util.newEmbedSQLException(Unknown Source)
	at org.apache.derby.impl.jdbc.Util.seeNextException(Unknown Source)
	at org.apache.derby.impl.jdbc.EmbedConnection.bootDatabase(Unknown Source)
	at org.apache.derby.impl.jdbc.EmbedConnection.<init>(Unknown Source)
	at org.apache.derby.jdbc.Driver40.getNewEmbedConnection(Unknown Source)
	at org.apache.derby.jdbc.InternalDriver.connect(Unknown Source)
	at org.apache.derby.jdbc.AutoloadedDriver.connect(Unknown Source)
	at java.sql.DriverManager.getConnection(DriverManager.java:322)
	at java.sql.DriverManager.getConnection(DriverManager.java:297)
	at org.apache.derbyTesting.junit.DriverManagerConnector.openConnection(DriverManagerConnector.java:81)
	at org.apache.derbyTesting.junit.DriverManagerConnector.openConnection(DriverManagerConnector.java:43)
	at org.apache.derbyTesting.junit.TestConfiguration.openDefaultConnection(TestConfiguration.java:1538)
	at org.apache.derbyTesting.junit.BaseJDBCTestSetup.getConnection(BaseJDBCTestSetup.java:72)
	at org.apache.derbyTesting.junit.DatabasePropertyTestSetup.setProperties(DatabasePropertyTestSetup.java:313)
	at org.apache.derbyTesting.junit.DatabasePropertyTestSetup.setUp(DatabasePropertyTestSetup.java:268)
	at junit.extensions.TestSetup$1.protect(TestSetup.java:18)
	at junit.extensions.TestSetup.run(TestSetup.java:23)
	at org.apache.derbyTesting.junit.BaseTestSetup.run(BaseTestSetup.java:57)
	at junit.extensions.TestDecorator.basicRun(TestDecorator.java:22)
	at junit.extensions.TestSetup$1.protect(TestSetup.java:19)
	at junit.extensions.TestSetup.run(TestSetup.java:23)
	at org.apache.derbyTesting.junit.BaseTestSetup.run(BaseTestSetup.java:57)
	at junit.extensions.TestDecorator.basicRun(TestDecorator.java:22)
	at junit.extensions.TestSetup$1.protect(TestSetup.java:19)
	at junit.extensions.TestSetup.run(TestSetup.java:23)
	at junit.extensions.TestDecorator.basicRun(TestDecorator.java:22)
	at junit.extensions.TestSetup$1.protect(TestSetup.java:19)
	at junit.extensions.TestSetup.run(TestSetup.java:23)
Caused by: java.sql.SQLException: Failed to start database 'dbsqlauth' with class loader sun.misc.Launcher$AppClassLoader@44fa44fa,
see the next exception for details.
	at org.apache.derby.impl.jdbc.SQLExceptionFactory.getSQLException(Unknown Source)
	at org.apache.derby.impl.jdbc.SQLExceptionFactory40.wrapArgsForTransportAcrossDRDA(Unknown
Source)
	... 48 more
Caused by: java.sql.SQLException: cannot create log file at directory F:\jartest\JarResults.2011-02-13\ibm16_suites.All\system\dbsqlauth\log.
	at org.apache.derby.impl.jdbc.SQLExceptionFactory.getSQLException(Unknown Source)
	at org.apache.derby.impl.jdbc.SQLExceptionFactory40.wrapArgsForTransportAcrossDRDA(Unknown
Source)
	at org.apache.derby.impl.jdbc.SQLExceptionFactory40.getSQLException(Unknown Source)
	at org.apache.derby.impl.jdbc.Util.generateCsSQLException(Unknown Source)
	... 45 more
Caused by: ERROR XSLAQ: cannot create log file at directory F:\jartest\JarResults.2011-02-13\ibm16_suites.All\system\dbsqlauth\log.
	at org.apache.derby.iapi.error.StandardException.newException(Unknown Source)
	at org.apache.derby.impl.store.raw.log.LogToFile.getLogDirectory(Unknown Source)
	at org.apache.derby.impl.store.raw.log.LogToFile.getControlFileName(Unknown Source)
	at org.apache.derby.impl.store.raw.log.LogToFile.boot(Unknown Source)
	at org.apache.derby.impl.services.monitor.BaseMonitor.boot(Unknown Source)
	at org.apache.derby.impl.services.monitor.TopService.bootModule(Unknown Source)
	at org.apache.derby.impl.services.monitor.BaseMonitor.startModule(Unknown Source)
	at org.apache.derby.iapi.services.monitor.Monitor.bootServiceModule(Unknown Source)
	at org.apache.derby.impl.store.raw.data.BaseDataFileFactory.bootLogFactory(Unknown Source)
	at org.apache.derby.impl.store.raw.data.BaseDataFileFactory.setRawStoreFactory(Unknown Source)
	at org.apache.derby.impl.store.raw.RawStore.boot(Unknown Source)
	at org.apache.derby.impl.services.monitor.BaseMonitor.boot(Unknown Source)
	at org.apache.derby.impl.services.monitor.TopService.bootModule(Unknown Source)
	at org.apache.derby.impl.services.monitor.BaseMonitor.startModule(Unknown Source)
	at org.apache.derby.iapi.services.monitor.Monitor.bootServiceModule(Unknown Source)
	at org.apache.derby.impl.store.access.RAMAccessManager.boot(Unknown Source)
	at org.apache.derby.impl.services.monitor.BaseMonitor.boot(Unknown Source)
	at org.apache.derby.impl.services.monitor.TopService.bootModule(Unknown Source)
	at org.apache.derby.impl.services.monitor.BaseMonitor.startModule(Unknown Source)
	at org.apache.derby.iapi.services.monitor.Monitor.bootServiceModule(Unknown Source)
	at org.apache.derby.impl.db.BasicDatabase.bootStore(Unknown Source)
	at org.apache.derby.impl.db.BasicDatabase.boot(Unknown Source)
	at org.apache.derby.impl.services.monitor.BaseMonitor.boot(Unknown Source)
	at org.apache.derby.impl.services.monitor.TopService.bootModule(Unknown Source)
	at org.apache.derby.impl.services.monitor.BaseMonitor.bootService(Unknown Source)
	at org.apache.derby.impl.services.monitor.BaseMonitor.startProviderService(Unknown Source)
	at org.apache.derby.impl.services.monitor.BaseMonitor.findProviderAndStartService(Unknown
Source)
	at org.apache.derby.impl.services.monitor.BaseMonitor.startPersistentService(Unknown Source)
	at org.apache.derby.iapi.services.monitor.Monitor.startPersistentService(Unknown Source)
	... 45 more
There was 1 failure:
1) testReEncrypt(org.apache.derbyTesting.functionTests.tests.jdbcapi.DboPowersTest)junit.framework.AssertionFailedError:
F:\jartest\JarResults.2011-02-13\ibm16_suites.All\system\dbsqlauth\seg0
	at org.apache.derbyTesting.junit.DropDatabaseSetup.removeDir(DropDatabaseSetup.java:116)
	at org.apache.derbyTesting.junit.DropDatabaseSetup.removeDir(DropDatabaseSetup.java:128)
	at org.apache.derbyTesting.junit.DropDatabaseSetup.access$000(DropDatabaseSetup.java:35)
	at org.apache.derbyTesting.junit.DropDatabaseSetup$1.run(DropDatabaseSetup.java:105)
	at java.security.AccessController.doPrivileged(AccessController.java:202)
	at org.apache.derbyTesting.junit.DropDatabaseSetup.removeDirectory(DropDatabaseSetup.java:102)
	at org.apache.derbyTesting.junit.DropDatabaseSetup.removeDirectory(DropDatabaseSetup.java:98)
	at org.apache.derbyTesting.junit.DropDatabaseSetup.removeDatabase(DropDatabaseSetup.java:91)
	at org.apache.derbyTesting.junit.TestConfiguration$7.tearDown(TestConfiguration.java:863)
	at junit.extensions.TestSetup$1.protect(TestSetup.java:20)
	at junit.extensions.TestSetup.run(TestSetup.java:23)
	at org.apache.derbyTesting.junit.BaseTestSetup.run(BaseTestSetup.java:57)
	at junit.extensions.TestDecorator.basicRun(TestDecorator.java:22)
	at junit.extensions.TestSetup$1.protect(TestSetup.java:19)
	at junit.extensions.TestSetup.run(TestSetup.java:23)
	at junit.extensions.TestDecorator.basicRun(TestDecorator.java:22)
	at junit.extensions.TestSetup$1.protect(TestSetup.java:19)
	at junit.extensions.TestSetup.run(TestSetup.java:23)

FAILURES!!!
Tests run: 13180,  Failures: 1,  Errors: 1



> failure in tests using encryption - fails to rename certain database files
> --------------------------------------------------------------------------
>
>                 Key: DERBY-4922
>                 URL: https://issues.apache.org/jira/browse/DERBY-4922
>             Project: Derby
>          Issue Type: Bug
>          Components: Test
>    Affects Versions: 10.7.1.1, 10.7.1.3
>         Environment: windows XP
>            Reporter: Myrna van Lunteren
>
> I've seen 2 test failures related to an attempt by derby to rename database files;
> 1: during nightly tests (11/29/2010; svn sync-ed up to 1040394, so 10.7.1.2) with ibm
1.6 SR8, derbyall (dir edited to shorter name & inserted line breaks for readability)
> *** Start: encryptDatabase jdk1.6.0 encryptionAll:encryptionOFB 2010-11-30 00:41:14 ***
> 74 del
> < 0 rows inserted/updated/deleted
> 74a74,76
> > ERROR 38000: The exception 'org.apache.derby.iapi.error.PassThroughException: 
>    ERROR XBM0S: Unable to rename
>  file 'C:\test\\derbyall\encryptionAll\encryptionOFB\encryptDatabase\wombat\service.properties'
>  to 'C:\test\derbyall\encryptionAll\encryptionOFB\encryptDatabase\wombat\service.propertiesold''
>  was thrown while evaluating an expression.
> > ERROR XJ001: Java exception: 'ERROR XBM0S: Unable to rename 
>    file 'C:\test\derbyall\encryptionAll\encryptionOFB\encryptDatabase\wombat\service.properties'
>    to 'C:\test\derbyall\encryptionAll\encryptionOFB\encryptDatabase\wombat\service.propertiesold':
>    org.apache.derby.iapi.error.PassThroughException'.
> > ERROR XBM0S: Unable to rename
>     file 'C:\test\derbyall\encryptionAll\encryptionOFB\encryptDatabase\wombat\service.properties'
>     to 'C:\test\derbyall\encryptionAll\encryptionOFB\encryptDatabase\wombat\service.propertiesold'
> .....(many more resulting diffs)...
>  
> 2: during DbpPowersTest in test cycle of 10.7.1.1 (build 1040133), with ibm 1.5. SR11
FP1:
> 1) testReEncrypt(org.apache.derbyTesting.functionTests.tests.jdbcapi.DboPowersTest)
>    junit.framework.AssertionFailedError: 
>    (re)encryption, no authentication expected:<null> but was:
>    <java.sql.SQLException: DERBY SQL error: SQLCODE: -1, SQLSTATE: XJ040, 
>    SQLERRMC: Failed to start database 'singleUse/oneuse1e' 
>    with class loader sun.misc.Launcher$AppClassLoader@2c0a2c0a, see the next exception
for details.::
>    SQLSTATE: XJ001Java exception:
>    'ERROR XBM0S: Unable to rename file 'C:\test\system\singleUse\oneuse1e\service.properties'
to
>     'C:\test\system\singleUse\oneuse1e\service.propertiesold':
>    org.apache.derby.iapi.error.PassThroughException'.::SQLSTATE: XBM0S
>    Unable to rename file 'C:\test\system\singleUse\oneuse1e\service.properties'   
>    to   'C:\test\system\singleUse\oneuse1e\service.propertiesold'>
> 	at org.apache.derbyTesting.functionTests.tests.jdbcapi.DboPowersTest.vetAttempt(DboPowersTest.java:751)
> 	at org.apache.derbyTesting.functionTests.tests.jdbcapi.DboPowersTest.vetEncryptionAttempt(DboPowersTest.java:586)
> 	at org.apache.derbyTesting.functionTests.tests.jdbcapi.DboPowersTest.testReEncrypt(DboPowersTest.java:510)
> 	at sun.reflect.NativeMethodAccessorImpl.invoke0(Native Method)
> 	at sun.reflect.NativeMethodAccessorImpl.invoke(NativeMethodAccessorImpl.java:79)
> 	at sun.reflect.DelegatingMethodAccessorImpl.invoke(DelegatingMethodAccessorImpl.java:43)
> 	at org.apache.derbyTesting.junit.BaseTestCase.runBare(BaseTestCase.java:109)
> 	at junit.extensions.TestDecorator.basicRun(TestDecorator.java:22)
> 	at junit.extensions.TestSetup$1.protect(TestSetup.java:19)
> 	at junit.extensions.TestSetup.run(TestSetup.java:23)
> 	at org.apache.derbyTesting.junit.BaseTestSetup.run(BaseTestSetup.java:57)
> 	at junit.extensions.TestDecorator.basicRun(TestDecorator.java:22)
> 	at junit.extensions.TestSetup$1.protect(TestSetup.java:19)
> 	at junit.extensions.TestSetup.run(TestSetup.java:23)
> 	at junit.extensions.TestDecorator.basicRun(TestDecorator.java:22)
> 	at junit.extensions.TestSetup$1.protect(TestSetup.java:19)
> 	at junit.extensions.TestSetup.run(TestSetup.java:23)
> 	at org.apache.derbyTesting.junit.BaseTestSetup.run(BaseTestSetup.java:57)
> 	at junit.extensions.TestDecorator.basicRun(TestDecorator.java:22)
> 	at junit.extensions.TestSetup$1.protect(TestSetup.java:19)
> 	at junit.extensions.TestSetup.run(TestSetup.java:23)
> I believe the problems are related to the removeDir issues of DERBY-4905 and DERBY-4915.

-- 
This message is automatically generated by JIRA.
-
For more information on JIRA, see: http://www.atlassian.com/software/jira

        

Mime
View raw message