db-derby-dev mailing list archives

Site index · List index
Message view « Date » · « Thread »
Top « Date » · « Thread »
From Tiago Espinha <tiago.de...@yahoo.co.uk>
Subject Re: regression test regressed
Date Tue, 13 Jul 2010 18:59:47 GMT
Hello Rick,

Do we know which patch it was that introduced this? The second failure has to do 
with my test conversions from last year and it should come up if we're trying to 
request one more port from TestConfiguration.getNextAvailablePort() without 
adjusting the constant for the maximum number of ports needed.

This is as intended, to make sure all the ports used are sequential to allow for 
parallel test runs.

If this is just the result of a new test invoking the getNextAvailablePort() 
then all there needs to be done is increment the 
TestConfiguration.MAX_PORTS_USED constant to 11 and the following wiki page also 
should be updated for 
coherence: http://wiki.apache.org/db-derby/DerbyJUnitTesting#Running_Tests

The first failure might be (i.e. probably is) related.

Tiago


----- Original Message ----
From: Rick Hillegas <rick.hillegas@oracle.com>
To: "derby-dev@db.apache.org" <derby-dev@db.apache.org>
Sent: Tue, 13 July, 2010 19:44:29
Subject: regression test regressed

I'm seeing these now:

1) 
testAttributeAccumulatedConnectionCount(org.apache.derbyTesting.functionTests.tests.management.NetworkServerMBeanTest)java.security.PrivilegedActionException:
 javax.management.InstanceNotFoundException: 
org.apache.derby:type=NetworkServer,system=c013800d-0129-cd0d-100f-ffffe1d7aa3e
   at java.security.AccessController.doPrivileged(Native Method)
   at 
org.apache.derbyTesting.functionTests.tests.management.MBeanTest.getAttribute(MBeanTest.java:379)

   at 
org.apache.derbyTesting.functionTests.tests.management.NetworkServerMBeanTest.testAttributeAccumulatedConnectionCount(NetworkServerMBeanTest.java:93)

   at sun.reflect.NativeMethodAccessorImpl.invoke0(Native Method)
   at 
sun.reflect.NativeMethodAccessorImpl.invoke(NativeMethodAccessorImpl.java:39)
   at 
sun.reflect.DelegatingMethodAccessorImpl.invoke(DelegatingMethodAccessorImpl.java:25)

   at org.apache.derbyTesting.junit.BaseTestCase.runBare(BaseTestCase.java:109)
   at junit.extensions.TestDecorator.basicRun(TestDecorator.java:24)
   at junit.extensions.TestSetup$1.protect(TestSetup.java:21)
   at junit.extensions.TestSetup.run(TestSetup.java:25)
   at org.apache.derbyTesting.junit.BaseTestSetup.run(BaseTestSetup.java:57)
   at junit.extensions.TestDecorator.basicRun(TestDecorator.java:24)
   at junit.extensions.TestSetup$1.protect(TestSetup.java:21)
   at junit.extensions.TestSetup.run(TestSetup.java:25)
   at junit.extensions.TestDecorator.basicRun(TestDecorator.java:24)
   at junit.extensions.TestSetup$1.protect(TestSetup.java:21)
   at junit.extensions.TestSetup.run(TestSetup.java:25)
   at org.apache.derbyTesting.junit.BaseTestSetup.run(BaseTestSetup.java:57)
Caused by: javax.management.InstanceNotFoundException: 
org.apache.derby:type=NetworkServer,system=c013800d-0129-cd0d-100f-ffffe1d7aa3e
   at 
com.sun.jmx.interceptor.DefaultMBeanServerInterceptor.getMBean(DefaultMBeanServerInterceptor.java:1010)

   at 
com.sun.jmx.interceptor.DefaultMBeanServerInterceptor.getAttribute(DefaultMBeanServerInterceptor.java:627)

   at 
com.sun.jmx.mbeanserver.JmxMBeanServer.getAttribute(JmxMBeanServer.java:659)
   at 
org.apache.derbyTesting.functionTests.tests.management.MBeanTest$4.run(MBeanTest.java:382)

   ... 41 more
There was 1 failure:
1) 
ttestSetPortPriority(org.apache.derbyTesting.functionTests.tests.derbynet.ServerPropertiesTest)junit.framework.AssertionFailedError:
 Port 1537 exceeeds expected maximum. You may need to update 
TestConfiguration.MAX_PORTS_USED and the Wiki page at 
http://wiki.apache.org/db-derby/DerbyJUnitTesting if test runs now require more 
available ports
   at 
org.apache.derbyTesting.junit.TestConfiguration.getNextAvailablePort(TestConfiguration.java:1413)

   at 
org.apache.derbyTesting.functionTests.tests.derbynet.ServerPropertiesTest.ttestSetPortPriority(ServerPropertiesTest.java:445)

   at sun.reflect.NativeMethodAccessorImpl.invoke0(Native Method)
   at 
sun.reflect.NativeMethodAccessorImpl.invoke(NativeMethodAccessorImpl.java:39)
   at 
sun.reflect.DelegatingMethodAccessorImpl.invoke(DelegatingMethodAccessorImpl.java:25)

   at org.apache.derbyTesting.junit.BaseTestCase.runBare(BaseTestCase.java:109)
   at junit.extensions.TestDecorator.basicRun(TestDecorator.java:24)
   at junit.extensions.TestSetup$1.protect(TestSetup.java:21)
   at junit.extensions.TestSetup.run(TestSetup.java:25)
   at org.apache.derbyTesting.junit.BaseTestSetup.run(BaseTestSetup.java:57)
   at junit.extensions.TestDecorator.basicRun(TestDecorator.java:24)
   at junit.extensions.TestSetup$1.protect(TestSetup.java:21)
   at junit.extensions.TestSetup.run(TestSetup.java:25)
   at junit.extensions.TestDecorator.basicRun(TestDecorator.java:24)
   at junit.extensions.TestSetup$1.protect(TestSetup.java:21)
   at junit.extensions.TestSetup.run(TestSetup.java:25)
   at junit.extensions.TestDecorator.basicRun(TestDecorator.java:24)
   at junit.extensions.TestSetup$1.protect(TestSetup.java:21)
   at junit.extensions.TestSetup.run(TestSetup.java:25)

FAILURES!!!
Tests run: 8845,  Failures: 1,  Errors: 1


      


Mime
View raw message