db-derby-dev mailing list archives

Site index · List index
Message view « Date » · « Thread »
Top « Date » · « Thread »
From "Tiago R. Espinha (JIRA)" <j...@apache.org>
Subject [jira] Commented: (DERBY-3834) Convert derbynet/runtimeinfo to JUnit
Date Sun, 05 Jul 2009 08:04:14 GMT

    [ https://issues.apache.org/jira/browse/DERBY-3834?page=com.atlassian.jira.plugin.system.issuetabpanels:comment-tabpanel&focusedCommentId=12727300#action_12727300
] 

Tiago R. Espinha commented on DERBY-3834:
-----------------------------------------

I got failures again:
--------------------8<----------------
Time: 6,031.741
There were 2 failures:
1) org.apache.derbyTesting.functionTests.tests.derbynet.RuntimeInfoTestjunit.framework.AssertionFailedError:
Timed out waiting for network server to start
	at org.apache.derbyTesting.junit.NetworkServerTestSetup.setUp(NetworkServerTestSetup.java:200)
	at junit.extensions.TestSetup$1.protect(TestSetup.java:20)
	at junit.extensions.TestSetup.run(TestSetup.java:25)
	at org.apache.derbyTesting.junit.BaseTestSetup.run(BaseTestSetup.java:57)
	at junit.extensions.TestDecorator.basicRun(TestDecorator.java:24)
	at junit.extensions.TestSetup$1.protect(TestSetup.java:21)
	at junit.extensions.TestSetup.run(TestSetup.java:25)
	at junit.extensions.TestDecorator.basicRun(TestDecorator.java:24)
	at junit.extensions.TestSetup$1.protect(TestSetup.java:21)
	at junit.extensions.TestSetup.run(TestSetup.java:25)
	at org.apache.derbyTesting.junit.BaseTestSetup.run(BaseTestSetup.java:57)
	at junit.extensions.TestDecorator.basicRun(TestDecorator.java:24)
	at junit.extensions.TestSetup$1.protect(TestSetup.java:21)
	at junit.extensions.TestSetup.run(TestSetup.java:25)
	at junit.extensions.TestDecorator.basicRun(TestDecorator.java:24)
	at junit.extensions.TestSetup$1.protect(TestSetup.java:21)
	at junit.extensions.TestSetup.run(TestSetup.java:25)
	at junit.extensions.TestDecorator.basicRun(TestDecorator.java:24)
	at junit.extensions.TestSetup$1.protect(TestSetup.java:21)
	at junit.extensions.TestSetup.run(TestSetup.java:25)
	at junit.extensions.TestDecorator.basicRun(TestDecorator.java:24)
	at junit.extensions.TestSetup$1.protect(TestSetup.java:21)
	at junit.extensions.TestSetup.run(TestSetup.java:25)
2) testStressMulti(org.apache.derbyTesting.functionTests.tests.multi.StressMultiTest)junit.framework.AssertionFailedError:
Caused by: 
java.sql.SQLNonTransientConnectionException: The DDM object 0x1232 is not supported.  The
connection has been terminated.
	at org.apache.derby.client.am.SQLExceptionFactory40.getSQLException(SQLExceptionFactory40.java:70)
	at org.apache.derby.client.am.SqlException.getSQLException(SqlException.java:358)
	at org.apache.derby.client.am.Connection.createStatement(Connection.java:368)
	at org.apache.derbyTesting.functionTests.tests.multi.StressMultiTest$StressMultiRunnable.update(StressMultiTest.java:558)
	at org.apache.derbyTesting.functionTests.tests.multi.StressMultiTest$StressMultiRunnable.run(StressMultiTest.java:402)
	at java.lang.Thread.run(Thread.java:619)
Caused by: org.apache.derby.client.am.SqlException: The DDM object 0x1232 is not supported.
 The connection has been terminated.
	at org.apache.derby.client.am.SqlException.copyAsUnchainedSQLException(SqlException.java:505)
	at org.apache.derby.client.am.Sqlca.chainDeferredExceptionsToAgentOrAsConnectionWarnings(Sqlca.java:342)
	at org.apache.derby.client.am.Sqlca.getJDBCMessage(Sqlca.java:304)
	at org.apache.derby.client.am.SqlException.getMessage(SqlException.java:402)
	at org.apache.derby.client.am.SqlException.getSQLException(SqlException.java:358)
	at org.apache.derby.client.am.Statement.executeUpdate(Statement.java:509)
	at org.apache.derbyTesting.functionTests.tests.multi.StressMultiTest$StressMultiRunnable.update(StressMultiTest.java:560)
	... 2 more

	at org.apache.derbyTesting.functionTests.tests.multi.StressMultiTest.handleException(StressMultiTest.java:331)
	at org.apache.derbyTesting.functionTests.tests.multi.StressMultiTest.access$200(StressMultiTest.java:70)
	at org.apache.derbyTesting.functionTests.tests.multi.StressMultiTest$StressMultiRunnable.run(StressMultiTest.java:425)
	at java.lang.Thread.run(Thread.java:619)

FAILURES!!!
Tests run: 11312,  Failures: 2,  Errors: 0
------------------------8<-----------------------
I can't seem to find the reason for these though...

> Convert derbynet/runtimeinfo to JUnit
> -------------------------------------
>
>                 Key: DERBY-3834
>                 URL: https://issues.apache.org/jira/browse/DERBY-3834
>             Project: Derby
>          Issue Type: Improvement
>          Components: Test
>    Affects Versions: 10.5.1.1
>            Reporter: Erlend Birkenes
>            Assignee: Tiago R. Espinha
>            Priority: Minor
>         Attachments: DERBY-3834.patch, DERBY-3834.patch, DERBY-3834.patch, DERBY-3834.patch,
DERBY-3834.patch, DERBY-3834.patch, DERBY-3834.stat, Derby-3834_1.diff
>
>


-- 
This message is automatically generated by JIRA.
-
You can reply to this email to add a comment to the issue online.


Mime
View raw message