db-derby-dev mailing list archives

Site index · List index
Message view « Date » · « Thread »
Top « Date » · « Thread »
From "Suran Jayathilaka (JIRA)" <j...@apache.org>
Subject [jira] Commented: (DERBY-3795) BlobMemTest fails for network client with OutOfMemory errror with 16M heap
Date Thu, 24 Jul 2008 18:57:31 GMT

    [ https://issues.apache.org/jira/browse/DERBY-3795?page=com.atlassian.jira.plugin.system.issuetabpanels:comment-tabpanel&focusedCommentId=12616587#action_12616587
] 

Suran Jayathilaka commented on DERBY-3795:
------------------------------------------

I ran BlobMemTest on a clean and updated checkout of the trunk with
java -Xmx16M -Dderby.tests.trace=true junit.textui.TestRunner org.apache.derbyTesting.functionTests.tests.memory.BlobMemTest

The embedded tests passed.
The client mode tests failed with following.

testBlobLength used 4906 ms .
testBlobLengthWithLengthlessInsert used 4688 ms .
testBlobLengthTooLongDerby961 used 391 ms .
testBlobLength used 13453 ms E.
testBlobLengthWithLengthlessInsert used 469 ms E.
testBlobLengthTooLongDerby961 used 531 ms EE
Time: 30.906
There were 4 errors:
1) testBlobLength(org.apache.derbyTesting.functionTests.tests.memory.BlobMemTest)java.lang.OutOfMemoryError:
Java heap space
        at java.util.Arrays.copyOf(Unknown Source)
        at java.io.ByteArrayOutputStream.toByteArray(Unknown Source)
        at org.apache.derby.client.net.NetStatementReply.parseFastSQLDTARDdata(NetStatementReply.java:1490)
        at org.apache.derby.client.net.NetStatementReply.parseFDODTA(NetStatementReply.java:1484)
        at org.apache.derby.client.net.NetStatementReply.parseSQLDTARD(NetStatementReply.java:1213)
        at org.apache.derby.client.net.NetStatementReply.parseEXCSQLSTTreply(NetStatementReply.java:339)
        at org.apache.derby.client.net.NetStatementReply.readExecuteCall(NetStatementReply.java:106)
        at org.apache.derby.client.net.StatementReply.readExecuteCall(StatementReply.java:75)
        at org.apache.derby.client.net.NetStatement.readExecuteCall_(NetStatement.java:179)
        at org.apache.derby.client.am.Statement.readExecuteCall(Statement.java:1567)
        at org.apache.derby.client.am.PreparedStatement.flowExecute(PreparedStatement.java:2151)
        at org.apache.derby.client.am.PreparedStatement.executeX(PreparedStatement.java:1594)
        at org.apache.derby.client.am.CallableLocatorProcedures.blobGetBytes(CallableLocatorProcedures.java:442)
        at org.apache.derby.client.am.BlobLocatorInputStream.readBytes(BlobLocatorInputStream.java:176)
        at org.apache.derby.client.am.BlobLocatorInputStream.read(BlobLocatorInputStream.java:135)
        at java.io.BufferedInputStream.read1(Unknown Source)
        at java.io.BufferedInputStream.read(Unknown Source)
        at java.io.FilterInputStream.read(Unknown Source)
        at org.apache.derby.client.am.CloseFilterInputStream.read(CloseFilterInputStream.java:79)
        at java.io.FilterInputStream.read(Unknown Source)
        at org.apache.derby.client.am.CloseFilterInputStream.read(CloseFilterInputStream.java:65)
        at org.apache.derbyTesting.functionTests.tests.memory.BlobMemTest.testBlobLength(BlobMemTest.java:144)
        at org.apache.derbyTesting.functionTests.tests.memory.BlobMemTest.testBlobLength(BlobMemTest.java:190)
        at sun.reflect.NativeMethodAccessorImpl.invoke0(Native Method)
        at sun.reflect.NativeMethodAccessorImpl.invoke(Unknown Source)
        at sun.reflect.DelegatingMethodAccessorImpl.invoke(Unknown Source)
        at org.apache.derbyTesting.junit.BaseTestCase.runBare(BaseTestCase.java:104)
2) testBlobLengthWithLengthlessInsert(org.apache.derbyTesting.functionTests.tests.memory.BlobMemTest)java.sql.SQLException:
DERBY SQL error: SQLCODE: -1, SQLSTA
TE: XJ001, SQLERRMC: java.lang.NullPointerException¶¶XJ001.U
        at org.apache.derby.client.am.SQLExceptionFactory.getSQLException(SQLExceptionFactory.java:46)
        at org.apache.derby.client.am.SqlException.getSQLException(SqlException.java:362)
        at org.apache.derby.jdbc.ClientDriver.connect(ClientDriver.java:149)
        at java.sql.DriverManager.getConnection(Unknown Source)
        at java.sql.DriverManager.getConnection(Unknown Source)
        at org.apache.derbyTesting.junit.DriverManagerConnector.openConnection(DriverManagerConnector.java:76)
        at org.apache.derbyTesting.junit.DriverManagerConnector.openConnection(DriverManagerConnector.java:43)
        at org.apache.derbyTesting.junit.TestConfiguration.openDefaultConnection(TestConfiguration.java:1314)
        at org.apache.derbyTesting.junit.BaseJDBCTestCase.openDefaultConnection(BaseJDBCTestCase.java:419)
        at org.apache.derbyTesting.junit.BaseJDBCTestCase.getConnection(BaseJDBCTestCase.java:101)
        at org.apache.derbyTesting.junit.BaseJDBCTestCase.setAutoCommit(BaseJDBCTestCase.java:359)
        at org.apache.derbyTesting.functionTests.tests.memory.BlobMemTest.testBlobLength(BlobMemTest.java:75)
        at org.apache.derbyTesting.functionTests.tests.memory.BlobMemTest.testBlobLengthWithLengthlessInsert(BlobMemTest.java:205)
        at sun.reflect.NativeMethodAccessorImpl.invoke0(Native Method)
        at sun.reflect.NativeMethodAccessorImpl.invoke(Unknown Source)
        at sun.reflect.DelegatingMethodAccessorImpl.invoke(Unknown Source)
        at org.apache.derbyTesting.junit.BaseTestCase.runBare(BaseTestCase.java:104)
        at junit.extensions.TestDecorator.basicRun(TestDecorator.java:24)
        at junit.extensions.TestSetup$1.protect(TestSetup.java:21)
        at junit.extensions.TestSetup.run(TestSetup.java:25)
        at org.apache.derbyTesting.junit.BaseTestSetup.run(BaseTestSetup.java:57)
        at junit.extensions.TestDecorator.basicRun(TestDecorator.java:24)
        at junit.extensions.TestSetup$1.protect(TestSetup.java:21)
        at junit.extensions.TestSetup.run(TestSetup.java:25)
        at junit.extensions.TestDecorator.basicRun(TestDecorator.java:24)
        at junit.extensions.TestSetup$1.protect(TestSetup.java:21)
        at junit.extensions.TestSetup.run(TestSetup.java:25)
        at org.apache.derbyTesting.junit.BaseTestSetup.run(BaseTestSetup.java:57)
        at junit.extensions.TestDecorator.basicRun(TestDecorator.java:24)
        at junit.extensions.TestSetup$1.protect(TestSetup.java:21)
        at junit.extensions.TestSetup.run(TestSetup.java:25)
Caused by: org.apache.derby.client.am.SqlException: DERBY SQL error: SQLCODE: -1, SQLSTATE:
XJ001, SQLERRMC: java.lang.NullPointerException¶¶XJ001.U
        at org.apache.derby.client.am.Connection.completeSqlca(Connection.java:2075)
        at org.apache.derby.client.net.NetConnectionReply.parseRdbAccessFailed(NetConnectionReply.java:537)
        at org.apache.derby.client.net.NetConnectionReply.parseAccessRdbError(NetConnectionReply.java:430)
        at org.apache.derby.client.net.NetConnectionReply.parseACCRDBreply(NetConnectionReply.java:294)
        at org.apache.derby.client.net.NetConnectionReply.readAccessDatabase(NetConnectionReply.java:121)
        at org.apache.derby.client.net.NetConnection.readSecurityCheckAndAccessRdb(NetConnection.java:823)
        at org.apache.derby.client.net.NetConnection.flowSecurityCheckAndAccessRdb(NetConnection.java:747)
        at org.apache.derby.client.net.NetConnection.flowUSRIDPWDconnect(NetConnection.java:568)
        at org.apache.derby.client.net.NetConnection.flowConnect(NetConnection.java:383)
        at org.apache.derby.client.net.NetConnection.<init>(NetConnection.java:218)
        at org.apache.derby.client.net.ClientJDBCObjectFactoryImpl.newNetConnection(ClientJDBCObjectFactoryImpl.java:270)
        at org.apache.derby.jdbc.ClientDriver.connect(ClientDriver.java:140)
        ... 46 more
3) testBlobLengthTooLongDerby961(org.apache.derbyTesting.functionTests.tests.memory.BlobMemTest)java.sql.SQLException:
DERBY SQL error: SQLCODE: -1, SQLSTATE: X
J001, SQLERRMC: java.lang.NullPointerException¶¶XJ001.U
        at org.apache.derby.client.am.SQLExceptionFactory.getSQLException(SQLExceptionFactory.java:46)
        at org.apache.derby.client.am.SqlException.getSQLException(SqlException.java:362)
        at org.apache.derby.jdbc.ClientDriver.connect(ClientDriver.java:149)
        at java.sql.DriverManager.getConnection(Unknown Source)
        at java.sql.DriverManager.getConnection(Unknown Source)
        at org.apache.derbyTesting.junit.DriverManagerConnector.openConnection(DriverManagerConnector.java:76)
        at org.apache.derbyTesting.junit.DriverManagerConnector.openConnection(DriverManagerConnector.java:43)
        at org.apache.derbyTesting.junit.TestConfiguration.openDefaultConnection(TestConfiguration.java:1314)
        at org.apache.derbyTesting.junit.BaseJDBCTestCase.openDefaultConnection(BaseJDBCTestCase.java:419)
        at org.apache.derbyTesting.junit.BaseJDBCTestCase.getConnection(BaseJDBCTestCase.java:101)
        at org.apache.derbyTesting.junit.BaseJDBCTestCase.setAutoCommit(BaseJDBCTestCase.java:359)
        at org.apache.derbyTesting.functionTests.tests.memory.BlobMemTest.testBlobLength(BlobMemTest.java:75)
        at org.apache.derbyTesting.functionTests.tests.memory.BlobMemTest.testBlobLengthTooLongDerby961(BlobMemTest.java:211)
        at sun.reflect.NativeMethodAccessorImpl.invoke0(Native Method)
        at sun.reflect.NativeMethodAccessorImpl.invoke(Unknown Source)
        at sun.reflect.DelegatingMethodAccessorImpl.invoke(Unknown Source)
        at org.apache.derbyTesting.junit.BaseTestCase.runBare(BaseTestCase.java:104)
        at junit.extensions.TestDecorator.basicRun(TestDecorator.java:24)
        at junit.extensions.TestSetup$1.protect(TestSetup.java:21)
        at junit.extensions.TestSetup.run(TestSetup.java:25)
        at org.apache.derbyTesting.junit.BaseTestSetup.run(BaseTestSetup.java:57)
        at junit.extensions.TestDecorator.basicRun(TestDecorator.java:24)
        at junit.extensions.TestSetup$1.protect(TestSetup.java:21)
        at junit.extensions.TestSetup.run(TestSetup.java:25)
        at junit.extensions.TestDecorator.basicRun(TestDecorator.java:24)
        at junit.extensions.TestSetup$1.protect(TestSetup.java:21)
        at junit.extensions.TestSetup.run(TestSetup.java:25)
        at org.apache.derbyTesting.junit.BaseTestSetup.run(BaseTestSetup.java:57)
        at junit.extensions.TestDecorator.basicRun(TestDecorator.java:24)
        at junit.extensions.TestSetup$1.protect(TestSetup.java:21)
        at junit.extensions.TestSetup.run(TestSetup.java:25)
Caused by: org.apache.derby.client.am.SqlException: DERBY SQL error: SQLCODE: -1, SQLSTATE:
XJ001, SQLERRMC: java.lang.NullPointerException¶¶XJ001.U
        at org.apache.derby.client.am.Connection.completeSqlca(Connection.java:2075)
        at org.apache.derby.client.net.NetConnectionReply.parseRdbAccessFailed(NetConnectionReply.java:537)
        at org.apache.derby.client.net.NetConnectionReply.parseAccessRdbError(NetConnectionReply.java:430)
        at org.apache.derby.client.net.NetConnectionReply.parseACCRDBreply(NetConnectionReply.java:294)
        at org.apache.derby.client.net.NetConnectionReply.readAccessDatabase(NetConnectionReply.java:121)
        at org.apache.derby.client.net.NetConnection.readSecurityCheckAndAccessRdb(NetConnection.java:823)
        at org.apache.derby.client.net.NetConnection.flowSecurityCheckAndAccessRdb(NetConnection.java:747)
        at org.apache.derby.client.net.NetConnection.flowUSRIDPWDconnect(NetConnection.java:568)
        at org.apache.derby.client.net.NetConnection.flowConnect(NetConnection.java:383)
        at org.apache.derby.client.net.NetConnection.<init>(NetConnection.java:218)
        at org.apache.derby.client.net.ClientJDBCObjectFactoryImpl.newNetConnection(ClientJDBCObjectFactoryImpl.java:270)
        at org.apache.derby.jdbc.ClientDriver.connect(ClientDriver.java:140)
        ... 46 more
4) BlobMemTest:clientjava.sql.SQLException: Java exception: ': java.lang.NullPointerException'.
        at org.apache.derby.impl.jdbc.SQLExceptionFactory.getSQLException(SQLExceptionFactory.java:45)
        at org.apache.derby.impl.jdbc.Util.newEmbedSQLException(Util.java:87)
        at org.apache.derby.impl.jdbc.Util.javaException(Util.java:244)
        at org.apache.derby.impl.jdbc.TransactionResourceImpl.wrapInSQLException(TransactionResourceImpl.java:403)
        at org.apache.derby.impl.jdbc.TransactionResourceImpl.handleException(TransactionResourceImpl.java:346)
        at org.apache.derby.impl.jdbc.EmbedConnection.handleException(EmbedConnection.java:2192)
        at org.apache.derby.impl.jdbc.EmbedConnection.<init>(EmbedConnection.java:576)
        at org.apache.derby.impl.jdbc.EmbedConnection30.<init>(EmbedConnection30.java:73)
        at org.apache.derby.jdbc.Driver30.getNewEmbedConnection(Driver30.java:80)
        at org.apache.derby.jdbc.InternalDriver.connect(InternalDriver.java:238)
        at org.apache.derby.jdbc.AutoloadedDriver.connect(AutoloadedDriver.java:119)
        at java.sql.DriverManager.getConnection(Unknown Source)
        at java.sql.DriverManager.getConnection(Unknown Source)
        at org.apache.derbyTesting.junit.DriverManagerConnector.openConnection(DriverManagerConnector.java:76)
        at org.apache.derbyTesting.junit.DriverManagerConnector.openConnection(DriverManagerConnector.java:43)
        at org.apache.derbyTesting.junit.TestConfiguration.openDefaultConnection(TestConfiguration.java:1314)
        at org.apache.derbyTesting.junit.BaseJDBCTestSetup.getConnection(BaseJDBCTestSetup.java:72)
        at org.apache.derbyTesting.junit.CleanDatabaseTestSetup.tearDown(CleanDatabaseTestSetup.java:140)
        at junit.extensions.TestSetup$1.protect(TestSetup.java:22)
        at junit.extensions.TestSetup.run(TestSetup.java:25)
        at org.apache.derbyTesting.junit.BaseTestSetup.run(BaseTestSetup.java:57)
        at junit.extensions.TestDecorator.basicRun(TestDecorator.java:24)
        at junit.extensions.TestSetup$1.protect(TestSetup.java:21)
        at junit.extensions.TestSetup.run(TestSetup.java:25)
Caused by: java.lang.NullPointerException
        at org.apache.derby.impl.store.raw.data.BaseDataFileFactory.openContainer(BaseDataFileFactory.java:628)
        at org.apache.derby.impl.store.raw.data.BaseDataFileFactory.openContainer(BaseDataFileFactory.java:558)
        at org.apache.derby.impl.store.raw.xact.Xact.openContainer(Xact.java:1283)
        at org.apache.derby.impl.store.access.conglomerate.OpenConglomerate.init(OpenConglomerate.java:863)
        at org.apache.derby.impl.store.access.heap.Heap.open(Heap.java:683)
        at org.apache.derby.impl.store.access.RAMTransaction.openConglomerate(RAMTransaction.java:479)
        at org.apache.derby.impl.store.access.RAMTransaction.openConglomerate(RAMTransaction.java:1311)
        at org.apache.derby.impl.sql.catalog.DataDictionaryImpl.getDescriptorViaIndexMinion(DataDictionaryImpl.java:8406)
        at org.apache.derby.impl.sql.catalog.DataDictionaryImpl.getDescriptorViaIndex(DataDictionaryImpl.java:8300)
        at org.apache.derby.impl.sql.catalog.DataDictionaryImpl.locateSchemaRow(DataDictionaryImpl.java:1603)
        at org.apache.derby.impl.sql.catalog.DataDictionaryImpl.getSchemaDescriptor(DataDictionaryImpl.java:1470)
        at org.apache.derby.impl.sql.conn.GenericLanguageConnectionContext.initDefaultSchemaDescriptor(GenericLanguageConnectionContext.java:370)
        at org.apache.derby.impl.sql.conn.GenericLanguageConnectionContext.initialize(GenericLanguageConnectionContext.java:347)
        at org.apache.derby.impl.db.BasicDatabase.setupConnection(BasicDatabase.java:309)
        at org.apache.derby.impl.jdbc.TransactionResourceImpl.startTransaction(TransactionResourceImpl.java:188)
        at org.apache.derby.impl.jdbc.EmbedConnection.checkUserIsNotARole(EmbedConnection.java:1170)
        at org.apache.derby.impl.jdbc.EmbedConnection.checkUserCredentials(EmbedConnection.java:1134)
        at org.apache.derby.impl.jdbc.EmbedConnection.<init>(EmbedConnection.java:402)
        ... 24 more

FAILURES!!!
Tests run: 6,  Failures: 0,  Errors: 4


I apologize for the long stack trace, but thought more details would be helpful for debugging..

> BlobMemTest fails  for network client with OutOfMemory errror with 16M heap
> ---------------------------------------------------------------------------
>
>                 Key: DERBY-3795
>                 URL: https://issues.apache.org/jira/browse/DERBY-3795
>             Project: Derby
>          Issue Type: Bug
>          Components: Test
>    Affects Versions: 10.5.0.0
>            Reporter: Kathey Marsden
>            Priority: Minor
>
> The test memory.BlobMemTest should run with 16M heap, but now gives an OOM exception
for client. This appears to be a regression in the client driver.
> 1) testBlobLength(org.apache.derbyTesting.functionTests.tests.memory.BlobMemTest)java.sql.SQLException:
Attempt to fully
>  materialize lob data that is too large for the JVM.  The connection has been terminated.
>         at org.apache.derby.client.am.SQLExceptionFactory.getSQLException(SQLExceptionFactory.java:46)
>         at org.apache.derby.client.am.SqlException.getSQLException(SqlException.java:362)
>         at org.apache.derby.client.am.ResultSet.next(ResultSet.java:281)
>         at org.apache.derbyTesting.functionTests.tests.memory.BlobMemTest.testBlobLength(BlobMemTest.java:136)
>         at org.apache.derbyTesting.functionTests.tests.memory.BlobMemTest.testBlobLength(BlobMemTest.java:190)
>         at sun.reflect.NativeMethodAccessorImpl.invoke0(Native Method)
>         at sun.reflect.NativeMethodAccessorImpl.invoke(NativeMethodAccessorImpl.java:64)
>         at sun.reflect.DelegatingMethodAccessorImpl.invoke(DelegatingMethodAccessorImpl.java:43)
>         at org.apache.derbyTesting.junit.BaseTestCase.runBare(BaseTestCase.java:104)
>         at junit.extensions.TestDecorator.basicRun(TestDecorator.java:22)
>         at junit.extensions.TestSetup$1.protect(TestSetup.java:19)
>         at junit.extensions.TestSetup.run(TestSetup.java:23)
>         at org.apache.derbyTesting.junit.BaseTestSetup.run(BaseTestSetup.java:57)
>         at junit.extensions.TestDecorator.basicRun(TestDecorator.java:22)
>         at junit.extensions.TestSetup$1.protect(TestSetup.java:19)
>         at junit.extensions.TestSetup.run(TestSetup.java:23)
>         at junit.extensions.TestDecorator.basicRun(TestDecorator.java:22)
>         at junit.extensions.TestSetup$1.protect(TestSetup.java:19)
>         at junit.extensions.TestSetup.run(TestSetup.java:23)
>         at org.apache.derbyTesting.junit.BaseTestSetup.run(BaseTestSetup.java:57)
>         at junit.extensions.TestDecorator.basicRun(TestDecorator.java:22)
>         at junit.extensions.TestSetup$1.protect(TestSetup.java:19)
>         at junit.extensions.TestSetup.run(TestSetup.java:23)
> Caused by: org.apache.derby.client.am.DisconnectException: Attempt to fully materialize
lob data that is too large for t
> he JVM.  The connection has been terminated.
>         at org.apache.derby.client.net.NetStatementReply.copyEXTDTA(NetStatementReply.java:1528)
>         at org.apache.derby.client.net.NetResultSetReply.parseCNTQRYreply(NetResultSetReply.java:143)
>         at org.apache.derby.client.net.NetResultSetReply.readFetch(NetResultSetReply.java:42)
>         at org.apache.derby.client.net.ResultSetReply.readFetch(ResultSetReply.java:41)
>         at org.apache.derby.client.net.NetResultSet.readFetch_(NetResultSet.java:206)
>         at org.apache.derby.client.am.ResultSet.flowFetch(ResultSet.java:4275)
>         at org.apache.derby.client.net.NetCursor.getMoreData_(NetCursor.java:1243)
>         at org.apache.derby.client.am.Cursor.stepNext(Cursor.java:176)
>         at org.apache.derby.client.am.Cursor.next(Cursor.java:195)
>         at org.apache.derby.client.am.ResultSet.nextX(ResultSet.java:302)
>         at org.apache.derby.client.am.ResultSet.next(ResultSet.java:272)
>         ... 38 more
> Caused by: java.lang.OutOfMemoryError
>         at java.io.ByteArrayOutputStream.write(ByteArrayOutputStream.java:116)
>         at org.apache.derby.client.net.Reply.getData(Reply.java:787)
>         at org.apache.derby.client.net.NetStatementReply.copyEXTDTA(NetStatementReply.java:1520)
>         ... 48 more
> 2) testBlobLengthWithLengthlessInsert(org.apache.derbyTesting.functionTests.tests.memory.BlobMemTest)java.sql.SQLExcepti
> on: Network protocol exception: DSS chained with same id at end of same id chain parse.
 The connection has been termina
> ted.
>         at org.apache.derby.client.am.SQLExceptionFactory.getSQLException(SQLExceptionFactory.java:46)
>         at org.apache.derby.client.am.SqlException.getSQLException(SqlException.java:362)
>         at org.apache.derby.jdbc.ClientDriver.connect(ClientDriver.java:149)
>         at java.sql.DriverManager.getConnection(DriverManager.java:562)
>         at java.sql.DriverManager.getConnection(DriverManager.java:186)
>         at org.apache.derbyTesting.junit.DriverManagerConnector.openConnection(DriverManagerConnector.java:76)
>         at org.apache.derbyTesting.junit.DriverManagerConnector.openConnection(DriverManagerConnector.java:43)
>         at org.apache.derbyTesting.junit.TestConfiguration.openDefaultConnection(TestConfiguration.java:1314)
>         at org.apache.derbyTesting.junit.BaseJDBCTestCase.openDefaultConnection(BaseJDBCTestCase.java:419)
>         at org.apache.derbyTesting.junit.BaseJDBCTestCase.getConnection(BaseJDBCTestCase.java:101)
>         at org.apache.derbyTesting.junit.BaseJDBCTestCase.rollback(BaseJDBCTestCase.java:378)
>         at org.apache.derbyTesting.functionTests.tests.memory.BlobMemTest.tearDown(BlobMemTest.java:58)
>         at org.apache.derbyTesting.junit.BaseTestCase.runBare(BaseTestCase.java:104)
>         at junit.extensions.TestDecorator.basicRun(TestDecorator.java:22)
>         at junit.extensions.TestSetup$1.protect(TestSetup.java:19)
>         at junit.extensions.TestSetup.run(TestSetup.java:23)
>         at org.apache.derbyTesting.junit.BaseTestSetup.run(BaseTestSetup.java:57)
>         at junit.extensions.TestDecorator.basicRun(TestDecorator.java:22)
>         at junit.extensions.TestSetup$1.protect(TestSetup.java:19)
>         at junit.extensions.TestSetup.run(TestSetup.java:23)
>         at junit.extensions.TestDecorator.basicRun(TestDecorator.java:22)
>         at junit.extensions.TestSetup$1.protect(TestSetup.java:19)
>         at junit.extensions.TestSetup.run(TestSetup.java:23)
>         at org.apache.derbyTesting.junit.BaseTestSetup.run(BaseTestSetup.java:57)
>         at junit.extensions.TestDecorator.basicRun(TestDecorator.java:22)
>         at junit.extensions.TestSetup$1.protect(TestSetup.java:19)
>         at junit.extensions.TestSetup.run(TestSetup.java:23)
> Caused by: org.apache.derby.client.am.DisconnectException: Network protocol exception:
DSS chained with same id at end o
> f same id chain parse.  The connection has been terminated.
>         at org.apache.derby.client.net.Reply.endOfSameIdChainData(Reply.java:1166)
>         at org.apache.derby.client.net.NetConnectionReply.readExchangeServerAttributes(NetConnectionReply.java:56)
>         at org.apache.derby.client.net.NetConnection.readServerAttributesAndKeyExchange(NetConnection.java:794)
>         at org.apache.derby.client.net.NetConnection.flowServerAttributesAndKeyExchange(NetConnection.java:722)
>         at org.apache.derby.client.net.NetConnection.flowUSRIDPWDconnect(NetConnection.java:565)
>         at org.apache.derby.client.net.NetConnection.flowConnect(NetConnection.java:383)
>         at org.apache.derby.client.net.NetConnection.<init>(NetConnection.java:218)
>         at org.apache.derby.client.net.ClientJDBCObjectFactoryImpl.newNetConnection(ClientJDBCObjectFactoryImpl.java:270
> )
>         at org.apache.derby.jdbc.ClientDriver.connect(ClientDriver.java:140)
>         ... 40 more
> FAILURES!!!
> Tests run: 6,  Failures: 0,  Errors: 2

-- 
This message is automatically generated by JIRA.
-
You can reply to this email to add a comment to the issue online.


Mime
View raw message