db-derby-dev mailing list archives

Site index · List index
Message view « Date » · « Thread »
Top « Date » · « Thread »
From "Dag H. Wanvik" <Dag.Wan...@Sun.COM>
Subject MBeans errors on 10.4 head
Date Thu, 29 May 2008 03:05:13 GMT

On trunk of 10.4 I see these (all MBEans related)

There was 1 failure:
1) testStartStopManagementFromApplication(org.apache.derbyTesting.functionTests.tests.management.ManagementMBeanTest)junit.framework.AssertionFailedError:
expected:<2> but was:<5>
	at org.apache.derbyTesting.functionTests.tests.management.ManagementMBeanTest.startStopManagement(ManagementMBeanTest.java:86)
	at org.apache.derbyTesting.functionTests.tests.management.ManagementMBeanTest.testStartStopManagementFromApplication(ManagementMBeanTest.java:56)
	at sun.reflect.NativeMethodAccessorImpl.invoke0(Native Method)
	at sun.reflect.NativeMethodAccessorImpl.invoke(NativeMethodAccessorImpl.java:39)
	at sun.reflect.DelegatingMethodAccessorImpl.invoke(DelegatingMethodAccessorImpl.java:25)
	at org.apache.derbyTesting.junit.BaseTestCase.runBare(BaseTestCase.java:101)
	at junit.extensions.TestDecorator.basicRun(TestDecorator.java:24)
	at junit.extensions.TestSetup$1.protect(TestSetup.java:21)
	at junit.extensions.TestSetup.run(TestSetup.java:25)
	at org.apache.derbyTesting.junit.BaseTestSetup.run(BaseTestSetup.java:57)
	at junit.extensions.TestDecorator.basicRun(TestDecorator.java:24)
	at junit.extensions.TestSetup$1.protect(TestSetup.java:21)
	at junit.extensions.TestSetup.run(TestSetup.java:25)
	at junit.extensions.TestDecorator.basicRun(TestDecorator.java:24)
	at junit.extensions.TestSetup$1.protect(TestSetup.java:21)
	at junit.extensions.TestSetup.run(TestSetup.java:25)
	at org.apache.derbyTesting.junit.BaseTestSetup.run(BaseTestSetup.java:57)

FAILURES!!!
Tests run: 10396,  Failures: 1,  Errors: 42

This I have seen before, but the following avalance of errors I have
not seen.. Any other seen these?

Dag

-------------------------------- errors:
There were 42 errors:
1) testDerbyJarAttributeAlpha(org.apache.derbyTesting.functionTests.tests.management.VersionMBeanTest)javax.management.RuntimeMBeanException:
java.lang.SecurityException: access denied (org.apache.derby.security.SystemPermission engine
monitor)
	at com.sun.jmx.interceptor.DefaultMBeanServerInterceptor.rethrow(DefaultMBeanServerInterceptor.java:856)
	at com.sun.jmx.interceptor.DefaultMBeanServerInterceptor.rethrowMaybeMBeanException(DefaultMBeanServerInterceptor.java:869)
	at com.sun.jmx.interceptor.DefaultMBeanServerInterceptor.getAttribute(DefaultMBeanServerInterceptor.java:670)
	at com.sun.jmx.mbeanserver.JmxMBeanServer.getAttribute(JmxMBeanServer.java:638)
	at org.apache.derbyTesting.functionTests.tests.management.MBeanTest$4.run(MBeanTest.java:382)
	at java.security.AccessController.doPrivileged(Native Method)
	at org.apache.derbyTesting.functionTests.tests.management.MBeanTest.getAttribute(MBeanTest.java:379)
	at org.apache.derbyTesting.functionTests.tests.management.MBeanTest.checkBooleanAttributeValue(MBeanTest.java:431)
	at org.apache.derbyTesting.functionTests.tests.management.VersionMBeanTest.testDerbyJarAttributeAlpha(VersionMBeanTest.java:120)
	at sun.reflect.NativeMethodAccessorImpl.invoke0(Native Method)
	at sun.reflect.NativeMethodAccessorImpl.invoke(NativeMethodAccessorImpl.java:39)
	at sun.reflect.DelegatingMethodAccessorImpl.invoke(DelegatingMethodAccessorImpl.java:25)
	at org.apache.derbyTesting.junit.BaseTestCase.runBare(BaseTestCase.java:101)
	at junit.extensions.TestDecorator.basicRun(TestDecorator.java:24)
	at junit.extensions.TestSetup$1.protect(TestSetup.java:21)
	at junit.extensions.TestSetup.run(TestSetup.java:25)
	at org.apache.derbyTesting.junit.BaseTestSetup.run(BaseTestSetup.java:57)
	at junit.extensions.TestDecorator.basicRun(TestDecorator.java:24)
	at junit.extensions.TestSetup$1.protect(TestSetup.java:21)
	at junit.extensions.TestSetup.run(TestSetup.java:25)
	at junit.extensions.TestDecorator.basicRun(TestDecorator.java:24)
	at junit.extensions.TestSetup$1.protect(TestSetup.java:21)
	at junit.extensions.TestSetup.run(TestSetup.java:25)
	at org.apache.derbyTesting.junit.BaseTestSetup.run(BaseTestSetup.java:57)
Caused by: java.lang.SecurityException: access denied (org.apache.derby.security.SystemPermission
engine monitor)
	at org.apache.derby.iapi.services.info.Version.checkMonitor(Version.java:70)
	at org.apache.derby.iapi.services.info.Version.isAlpha(Version.java:121)
	at sun.reflect.NativeMethodAccessorImpl.invoke0(Native Method)
	at sun.reflect.NativeMethodAccessorImpl.invoke(NativeMethodAccessorImpl.java:39)
	at sun.reflect.DelegatingMethodAccessorImpl.invoke(DelegatingMethodAccessorImpl.java:25)
	at com.sun.jmx.mbeanserver.StandardMBeanIntrospector.invokeM2(StandardMBeanIntrospector.java:93)
	at com.sun.jmx.mbeanserver.StandardMBeanIntrospector.invokeM2(StandardMBeanIntrospector.java:27)
	at com.sun.jmx.mbeanserver.MBeanIntrospector.invokeM(MBeanIntrospector.java:208)
	at com.sun.jmx.mbeanserver.PerInterface.getAttribute(PerInterface.java:65)
	at com.sun.jmx.mbeanserver.MBeanSupport.getAttribute(MBeanSupport.java:216)
	at javax.management.StandardMBean.getAttribute(StandardMBean.java:358)
	at com.sun.jmx.interceptor.DefaultMBeanServerInterceptor.getAttribute(DefaultMBeanServerInterceptor.java:666)
	... 44 more
2) testDerbynetJarAttributeAlpha(org.apache.derbyTesting.functionTests.tests.management.VersionMBeanTest)javax.management.RuntimeMBeanException:
java.lang.SecurityException: access denied (org.apache.derby.security.SystemPermission server
monitor)
	at com.sun.jmx.interceptor.DefaultMBeanServerInterceptor.rethrow(DefaultMBeanServerInterceptor.java:856)
	at com.sun.jmx.interceptor.DefaultMBeanServerInterceptor.rethrowMaybeMBeanException(DefaultMBeanServerInterceptor.java:869)
	at com.sun.jmx.interceptor.DefaultMBeanServerInterceptor.getAttribute(DefaultMBeanServerInterceptor.java:670)
	at com.sun.jmx.mbeanserver.JmxMBeanServer.getAttribute(JmxMBeanServer.java:638)
	at org.apache.derbyTesting.functionTests.tests.management.MBeanTest$4.run(MBeanTest.java:382)
	at java.security.AccessController.doPrivileged(Native Method)
	at org.apache.derbyTesting.functionTests.tests.management.MBeanTest.getAttribute(MBeanTest.java:379)
	at org.apache.derbyTesting.functionTests.tests.management.MBeanTest.checkBooleanAttributeValue(MBeanTest.java:431)
	at org.apache.derbyTesting.functionTests.tests.management.VersionMBeanTest.testDerbynetJarAttributeAlpha(VersionMBeanTest.java:124)
	at sun.reflect.NativeMethodAccessorImpl.invoke0(Native Method)
	at sun.reflect.NativeMethodAccessorImpl.invoke(NativeMethodAccessorImpl.java:39)
	at sun.reflect.DelegatingMethodAccessorImpl.invoke(DelegatingMethodAccessorImpl.java:25)
	at org.apache.derbyTesting.junit.BaseTestCase.runBare(BaseTestCase.java:101)
	at junit.extensions.TestDecorator.basicRun(TestDecorator.java:24)
	at junit.extensions.TestSetup$1.protect(TestSetup.java:21)
	at junit.extensions.TestSetup.run(TestSetup.java:25)
	at org.apache.derbyTesting.junit.BaseTestSetup.run(BaseTestSetup.java:57)
	at junit.extensions.TestDecorator.basicRun(TestDecorator.java:24)
	at junit.extensions.TestSetup$1.protect(TestSetup.java:21)
	at junit.extensions.TestSetup.run(TestSetup.java:25)
	at junit.extensions.TestDecorator.basicRun(TestDecorator.java:24)
	at junit.extensions.TestSetup$1.protect(TestSetup.java:21)
	at junit.extensions.TestSetup.run(TestSetup.java:25)
	at org.apache.derbyTesting.junit.BaseTestSetup.run(BaseTestSetup.java:57)
Caused by: java.lang.SecurityException: access denied (org.apache.derby.security.SystemPermission
server monitor)
	at org.apache.derby.iapi.services.info.Version.checkMonitor(Version.java:70)
	at org.apache.derby.iapi.services.info.Version.isAlpha(Version.java:121)
	at sun.reflect.NativeMethodAccessorImpl.invoke0(Native Method)
	at sun.reflect.NativeMethodAccessorImpl.invoke(NativeMethodAccessorImpl.java:39)
	at sun.reflect.DelegatingMethodAccessorImpl.invoke(DelegatingMethodAccessorImpl.java:25)
	at com.sun.jmx.mbeanserver.StandardMBeanIntrospector.invokeM2(StandardMBeanIntrospector.java:93)
	at com.sun.jmx.mbeanserver.StandardMBeanIntrospector.invokeM2(StandardMBeanIntrospector.java:27)
	at com.sun.jmx.mbeanserver.MBeanIntrospector.invokeM(MBeanIntrospector.java:208)
	at com.sun.jmx.mbeanserver.PerInterface.getAttribute(PerInterface.java:65)
	at com.sun.jmx.mbeanserver.MBeanSupport.getAttribute(MBeanSupport.java:216)
	at javax.management.StandardMBean.getAttribute(StandardMBean.java:358)
	at com.sun.jmx.interceptor.DefaultMBeanServerInterceptor.getAttribute(DefaultMBeanServerInterceptor.java:666)
	... 44 more

Mime
View raw message