db-derby-dev mailing list archives

Site index · List index
Message view « Date » · « Thread »
Top « Date » · « Thread »
From Kathey Marsden <kmarsdende...@sbcglobal.net>
Subject Re: [VOTE] 10.4.1.1 release candidate
Date Mon, 07 Apr 2008 00:39:23 GMT
Dyre.Tjeldvoll@Sun.COM wrote:
> Please test and vote on the 10.4.1.1 release candidate, available at:
> http://people.apache.org/~dyre/derby-10.4.1.1-RC/
>
>   
Running with the db-derby-10.4.1.1-lib-debug.zip distribution and IBM 1.5
[C:/kmarsden/projects/10.4testing] java -version
java version "1.5.0"
Java(TM) 2 Runtime Environment, Standard Edition (build 
pwi32devifx-20070725 (SR5a))
IBM J9 VM (build 2.3, J2RE 1.5.0 IBM J9 2.3 Windows XP x86-32 
j9vmwi3223-20070426 (JIT enabled)
J9VM - 20070420_12448_lHdSMR
JIT  - 20070419_1806_r8
GC   - 200704_19)
JCL  - 20070725


I see the following errors.  SystemPrivilegesPermissionTest seems to 
have a problem setting the policy and then errors cascade from there.
Has anyone seen this before?  The only thing I can think of that is 
slightly different than the way I normally run is that derbyTesting.jar  
is in a different directory from the other jars.  I'll try with it in 
the same directory. Meanwhile any thoughts are welcome.

Thanks

Kathey


.........................................
.....................E...............EEEEEEEEEEEEEEEEEEEEEEEEEEEE
Time: 3,539.125
There were 29 errors:
1) SystemPrivilegesPermissionTestjava.security.AccessControlException: 
Access denied (java.lang.RuntimePermission setSecurityManager)
    at 
java.security.AccessController.checkPermission(AccessController.java:104)
    at java.lang.SecurityManager.checkPermission(SecurityManager.java:547)
    at java.lang.System.setSecurityManager(System.java:538)
    at 
org.apache.derbyTesting.junit.SecurityManagerSetup$3.run(SecurityManagerSetup.java:381)
    at 
java.security.AccessController.doPrivileged(AccessController.java:193)
    at 
org.apache.derbyTesting.junit.SecurityManagerSetup.uninstallSecurityManager(SecurityManagerSetup.java:376)
    at 
org.apache.derbyTesting.junit.SecurityManagerSetup.tearDown(SecurityManagerSetup.java:114)
    at junit.extensions.TestSetup$1.protect(TestSetup.java:20)
    at junit.extensions.TestSetup.run(TestSetup.java:23)
2) Upgrade Tests from 10.0.2.1java.security.AccessControlException: 
Access denied (java.util.PropertyPermission java.security.policy read)
    at 
java.security.AccessController.checkPermission(AccessController.java:104)
    at java.lang.SecurityManager.checkPermission(SecurityManager.java:547)
    at 
java.lang.SecurityManager.checkPropertyAccess(SecurityManager.java:1300)
    at java.lang.System.getProperty(System.java:369)
    at java.lang.System.getProperty(System.java:353)
    at 
org.apache.derbyTesting.junit.BaseTestCase$4.run(BaseTestCase.java:258)
    at 
java.security.AccessController.doPrivileged(AccessController.java:193)
    at 
org.apache.derbyTesting.junit.BaseTestCase.getSystemProperty(BaseTestCase.java:254)
    at 
org.apache.derbyTesting.junit.SecurityManagerSetup.installSecurityManager(SecurityManagerSetup.java:153)
    at 
org.apache.derbyTesting.junit.SecurityManagerSetup.setUp(SecurityManagerSetup.java:105)
    at junit.extensions.TestSetup$1.protect(TestSetup.java:18)
    at junit.extensions.TestSetup.run(TestSetup.java:23)
3) Upgrade Tests from 10.1.1.0java.security.AccessControlException: 
Access denied (java.util.PropertyPermission java.security.policy read)
    at 
java.security.AccessController.checkPermission(AccessController.java:104)
    at java.lang.SecurityManager.checkPermission(SecurityManager.java:547)
    at 
java.lang.SecurityManager.checkPropertyAccess(SecurityManager.java:1300)
    at java.lang.System.getProperty(System.java:369)
    at java.lang.System.getProperty(System.java:353)
    at 
org.apache.derbyTesting.junit.BaseTestCase$4.run(BaseTestCase.java:258)
    at 
java.security.AccessController.doPrivileged(AccessController.java:193)
    at 
org.apache.derbyTesting.junit.BaseTestCase.getSystemProperty(BaseTestCase.java:254)
    at 
org.apache.derbyTesting.junit.SecurityManagerSetup.installSecurityManager(SecurityManagerSetup.java:153)
    at 
org.apache.derbyTesting.junit.SecurityManagerSetup.setUp(SecurityManagerSetup.java:105)
    at junit.extensions.TestSetup$1.protect(TestSetup.java:18)
    at junit.extensions.TestSetup.run(TestSetup.java:23)
4) Upgrade Tests from 10.1.2.1java.security.AccessControlException: 
Access denied (java.util.PropertyPermission java.security.policy read)
    at 
java.security.AccessController.checkPermission(AccessController.java:104)
    at java.lang.SecurityManager.checkPermission(SecurityManager.java:547)
    at 
java.lang.SecurityManager.checkPropertyAccess(SecurityManager.java:1300)
    at java.lang.System.getProperty(System.java:369)
    at java.lang.System.getProperty(System.java:353)
    at 
org.apache.derbyTesting.junit.BaseTestCase$4.run(BaseTestCase.java:258)
    at 
java.security.AccessController.doPrivileged(AccessController.java:193)
    at 
org.apache.derbyTesting.junit.BaseTestCase.getSystemProperty(BaseTestCase.java:254)
    at 
org.apache.derbyTesting.junit.SecurityManagerSetup.installSecurityManager(SecurityManagerSetup.java:153)
    at 
org.apache.derbyTesting.junit.SecurityManagerSetup.setUp(SecurityManagerSetup.java:105)
    at junit.extensions.TestSetup$1.protect(TestSetup.java:18)
    at junit.extensions.TestSetup.run(TestSetup.java:23)
5) Upgrade Tests from 10.1.3.1java.security.AccessControlException: 
Access denied (java.util.PropertyPermission java.security.policy read)
    at 
java.security.AccessController.checkPermission(AccessController.java:104)
    at java.lang.SecurityManager.checkPermission(SecurityManager.java:547)
    at 
java.lang.SecurityManager.checkPropertyAccess(SecurityManager.java:1300)
    at java.lang.System.getProperty(System.java:369)
    at java.lang.System.getProperty(System.java:353)
    at 
org.apache.derbyTesting.junit.BaseTestCase$4.run(BaseTestCase.java:258)
    at 
java.security.AccessController.doPrivileged(AccessController.java:193)
    at 
org.apache.derbyTesting.junit.BaseTestCase.getSystemProperty(BaseTestCase.java:254)
    at 
org.apache.derbyTesting.junit.SecurityManagerSetup.installSecurityManager(SecurityManagerSetup.java:153)
    at 
org.apache.derbyTesting.junit.SecurityManagerSetup.setUp(SecurityManagerSetup.java:105)
    at junit.extensions.TestSetup$1.protect(TestSetup.java:18)
    at junit.extensions.TestSetup.run(TestSetup.java:23)
6) Upgrade Tests from 10.2.1.6java.security.AccessControlException: 
Access denied (java.util.PropertyPermission java.security.policy read)
    at 
java.security.AccessController.checkPermission(AccessController.java:104)
    at java.lang.SecurityManager.checkPermission(SecurityManager.java:547)
    at 
java.lang.SecurityManager.checkPropertyAccess(SecurityManager.java:1300)
    at java.lang.System.getProperty(System.java:369)
    at java.lang.System.getProperty(System.java:353)
    at 
org.apache.derbyTesting.junit.BaseTestCase$4.run(BaseTestCase.java:258)
    at 
java.security.AccessController.doPrivileged(AccessController.java:193)
    at 
org.apache.derbyTesting.junit.BaseTestCase.getSystemProperty(BaseTestCase.java:254)
    at 
org.apache.derbyTesting.junit.SecurityManagerSetup.installSecurityManager(SecurityManagerSetup.java:153)
    at 
org.apache.derbyTesting.junit.SecurityManagerSetup.setUp(SecurityManagerSetup.java:105)
    at junit.extensions.TestSetup$1.protect(TestSetup.java:18)
    at junit.extensions.TestSetup.run(TestSetup.java:23)
7) Upgrade Tests from 10.2.2.0java.security.AccessControlException: 
Access denied (java.util.PropertyPermission java.security.policy read)
    at 
java.security.AccessController.checkPermission(AccessController.java:104)
    at java.lang.SecurityManager.checkPermission(SecurityManager.java:547)
    at 
java.lang.SecurityManager.checkPropertyAccess(SecurityManager.java:1300)
    at java.lang.System.getProperty(System.java:369)
    at java.lang.System.getProperty(System.java:353)
    at 
org.apache.derbyTesting.junit.BaseTestCase$4.run(BaseTestCase.java:258)
    at 
java.security.AccessController.doPrivileged(AccessController.java:193)
    at 
org.apache.derbyTesting.junit.BaseTestCase.getSystemProperty(BaseTestCase.java:254)
    at 
org.apache.derbyTesting.junit.SecurityManagerSetup.installSecurityManager(SecurityManagerSetup.java:153)
    at 
org.apache.derbyTesting.junit.SecurityManagerSetup.setUp(SecurityManagerSetup.java:105)
    at junit.extensions.TestSetup$1.protect(TestSetup.java:18)
    at junit.extensions.TestSetup.run(TestSetup.java:23)
8) Upgrade Tests from 10.3.1.4java.security.AccessControlException: 
Access denied (java.util.PropertyPermission java.security.policy read)
    at 
java.security.AccessController.checkPermission(AccessController.java:104)
    at java.lang.SecurityManager.checkPermission(SecurityManager.java:547)
    at 
java.lang.SecurityManager.checkPropertyAccess(SecurityManager.java:1300)
    at java.lang.System.getProperty(System.java:369)
    at java.lang.System.getProperty(System.java:353)
    at 
org.apache.derbyTesting.junit.BaseTestCase$4.run(BaseTestCase.java:258)
    at 
java.security.AccessController.doPrivileged(AccessController.java:193)
    at 
org.apache.derbyTesting.junit.BaseTestCase.getSystemProperty(BaseTestCase.java:254)
    at 
org.apache.derbyTesting.junit.SecurityManagerSetup.installSecurityManager(SecurityManagerSetup.java:153)
    at 
org.apache.derbyTesting.junit.SecurityManagerSetup.setUp(SecurityManagerSetup.java:105)
    at junit.extensions.TestSetup$1.protect(TestSetup.java:18)
    at junit.extensions.TestSetup.run(TestSetup.java:23)
9) Encryption Algorithm: defaultjava.sql.SQLException: Failed to create 
database 'singleUse/oneuse64', see the next exception for details.
    at 
org.apache.derby.impl.jdbc.SQLExceptionFactory.getSQLException(SQLExceptionFactory.java:45)
    at org.apache.derby.impl.jdbc.Util.newEmbedSQLException(Util.java:87)
    at org.apache.derby.impl.jdbc.Util.seeNextException(Util.java:223)
    at 
org.apache.derby.impl.jdbc.EmbedConnection.createDatabase(EmbedConnection.java:2368)
    at 
org.apache.derby.impl.jdbc.EmbedConnection.<init>(EmbedConnection.java:382)
    at 
org.apache.derby.jdbc.Driver30.getNewEmbedConnection(Driver30.java:80)
    at org.apache.derby.jdbc.InternalDriver.connect(InternalDriver.java:238)
    at 
org.apache.derby.jdbc.EmbeddedDataSource.getConnection(EmbeddedDataSource.java:478)
    at 
org.apache.derby.jdbc.EmbeddedDataSource.getConnection(EmbeddedDataSource.java:422)
    at org.apache.derbyTesting.junit.Decorator$1.setUp(Decorator.java:81)
    at junit.extensions.TestSetup$1.protect(TestSetup.java:18)
    at junit.extensions.TestSetup.run(TestSetup.java:23)
    at 
org.apache.derbyTesting.junit.BaseTestSetup.run(BaseTestSetup.java:57)
    at junit.extensions.TestDecorator.basicRun(TestDecorator.java:22)
    at junit.extensions.TestSetup$1.protect(TestSetup.java:19)
    at junit.extensions.TestSetup.run(TestSetup.java:23)
    at 
org.apache.derbyTesting.junit.BaseTestSetup.run(BaseTestSetup.java:57)
    at junit.extensions.TestDecorator.basicRun(TestDecorator.java:22)
    at junit.extensions.TestSetup$1.protect(TestSetup.java:19)
    at junit.extensions.TestSetup.run(TestSetup.java:23)
Caused by: java.sql.SQLException: Directory 
C:\kmarsden\projects\10.4testing\test3\system\singleUse\oneuse64 cannot 
be created.
    at 
org.apache.derby.impl.jdbc.SQLExceptionFactory.getSQLException(SQLExceptionFactory.java:45)
    at org.apache.derby.impl.jdbc.Util.newEmbedSQLException(Util.java:87)
    at org.apache.derby.impl.jdbc.Util.seeNextException(Util.java:223)
    at 
org.apache.derby.impl.jdbc.TransactionResourceImpl.wrapInSQLException(TransactionResourceImpl.java:398)
    at 
org.apache.derby.impl.jdbc.TransactionResourceImpl.handleException(TransactionResourceImpl.java:346)
    at 
org.apache.derby.impl.jdbc.EmbedConnection.handleException(EmbedConnection.java:2125)
    ... 27 more
Caused by: java.sql.SQLException: Java exception: 'Access denied 
(java.io.FilePermission 
C:\kmarsden\projects\10.4testing\test3\system\singleUse\oneuse64 write): 
java.security.AccessControlException'.
    at 
org.apache.derby.impl.jdbc.SQLExceptionFactory.getSQLException(SQLExceptionFactory.java:45)
    at org.apache.derby.impl.jdbc.Util.newEmbedSQLException(Util.java:87)
    at org.apache.derby.impl.jdbc.Util.javaException(Util.java:244)
    at 
org.apache.derby.impl.jdbc.TransactionResourceImpl.wrapInSQLException(TransactionResourceImpl.java:403)
    ... 30 more
Caused by: java.security.AccessControlException: Access denied 
(java.io.FilePermission 
C:\kmarsden\projects\10.4testing\test3\system\singleUse\oneuse64 write)
    at 
java.security.AccessController.checkPermission(AccessController.java:104)
    at java.lang.SecurityManager.checkPermission(SecurityManager.java:547)
    at java.lang.SecurityManager.checkWrite(SecurityManager.java:977)
    at java.io.File.mkdir(File.java:1145)
    at java.io.File.mkdirs(File.java:1174)
    at 
org.apache.derby.impl.services.monitor.StorageFactoryService$9.run(StorageFactoryService.java:675)
    at 
java.security.AccessController.doPrivileged(AccessController.java:242)
    at 
org.apache.derby.impl.services.monitor.StorageFactoryService.createServiceRoot(StorageFactoryService.java:651)
    at 
org.apache.derby.impl.services.monitor.BaseMonitor.bootService(BaseMonitor.java:1760)
    at 
org.apache.derby.impl.services.monitor.BaseMonitor.createPersistentService(BaseMonitor.java:1024)
    at 
org.apache.derby.iapi.services.monitor.Monitor.createPersistentService(Monitor.java:596)
    at 
org.apache.derby.impl.jdbc.EmbedConnection.createDatabase(EmbedConnection.java:2362)
    ... 26 more
10) Encryption Algorithm: defaultjava.sql.SQLException: Failed to create 
database 'singleUse/oneuse64', see the next exception for details.
    at 
org.apache.derby.impl.jdbc.SQLExceptionFactory.getSQLException(SQLExceptionFactory.java:45)
    at org.apache.derby.impl.jdbc.Util.newEmbedSQLException(Util.java:87)
    at org.apache.derby.impl.jdbc.Util.seeNextException(Util.java:223)
    at 
org.apache.derby.impl.jdbc.EmbedConnection.createDatabase(EmbedConnection.java:2368)
    at 
org.apache.derby.impl.jdbc.EmbedConnection.<init>(EmbedConnection.java:382)
    at 
org.apache.derby.jdbc.Driver30.getNewEmbedConnection(Driver30.java:80)
    at org.apache.derby.jdbc.InternalDriver.connect(InternalDriver.java:238)
    at 
org.apache.derby.jdbc.AutoloadedDriver.connect(AutoloadedDriver.java:119)
    at java.sql.DriverManager.getConnection(DriverManager.java:562)
    at java.sql.DriverManager.getConnection(DriverManager.java:155)
    at 
org.apache.derbyTesting.junit.DriverManagerConnector.getConnectionByAttributes(DriverManagerConnector.java:131)
    at 
org.apache.derbyTesting.junit.DriverManagerConnector.openConnection(DriverManagerConnector.java:91)
    at 
org.apache.derbyTesting.junit.DriverManagerConnector.openConnection(DriverManagerConnector.java:47)
    at 
org.apache.derbyTesting.junit.TestConfiguration.openConnection(TestConfiguration.java:1341)
    at 
org.apache.derbyTesting.junit.DropDatabaseSetup.tearDown(DropDatabaseSetup.java:54)
    at junit.extensions.TestSetup$1.protect(TestSetup.java:20)
    at junit.extensions.TestSetup.run(TestSetup.java:23)
    at 
org.apache.derbyTesting.junit.BaseTestSetup.run(BaseTestSetup.java:57)
    at junit.extensions.TestDecorator.basicRun(TestDecorator.java:22)
    at junit.extensions.TestSetup$1.protect(TestSetup.java:19)
    at junit.extensions.TestSetup.run(TestSetup.java:23)
Caused by: java.sql.SQLException: Directory 
C:\kmarsden\projects\10.4testing\test3\system\singleUse\oneuse64 cannot 
be created.
    at 
org.apache.derby.impl.jdbc.SQLExceptionFactory.getSQLException(SQLExceptionFactory.java:45)
    at org.apache.derby.impl.jdbc.Util.newEmbedSQLException(Util.java:87)
    at org.apache.derby.impl.jdbc.Util.seeNextException(Util.java:223)
    at 
org.apache.derby.impl.jdbc.TransactionResourceImpl.wrapInSQLException(TransactionResourceImpl.java:398)
    at 
org.apache.derby.impl.jdbc.TransactionResourceImpl.handleException(TransactionResourceImpl.java:346)
    at 
org.apache.derby.impl.jdbc.EmbedConnection.handleException(EmbedConnection.java:2125)
    ... 27 more
Caused by: java.sql.SQLException: Java exception: 'Access denied 
(java.io.FilePermission 
C:\kmarsden\projects\10.4testing\test3\system\singleUse\oneuse64 write): 
java.security.AccessControlException'.
    at 
org.apache.derby.impl.jdbc.SQLExceptionFactory.getSQLException(SQLExceptionFactory.java:45)
    at org.apache.derby.impl.jdbc.Util.newEmbedSQLException(Util.java:87)
    at org.apache.derby.impl.jdbc.Util.javaException(Util.java:244)
    at 
org.apache.derby.impl.jdbc.TransactionResourceImpl.wrapInSQLException(TransactionResourceImpl.java:403)
    ... 30 more
Caused by: java.security.AccessControlException: Access denied 
(java.io.FilePermission 
C:\kmarsden\projects\10.4testing\test3\system\singleUse\oneuse64 write)
    at 
java.security.AccessController.checkPermission(AccessController.java:104)
    at java.lang.SecurityManager.checkPermission(SecurityManager.java:547)
    at java.lang.SecurityManager.checkWrite(SecurityManager.java:977)
    at java.io.File.mkdir(File.java:1145)
    at java.io.File.mkdirs(File.java:1174)
    at 
org.apache.derby.impl.services.monitor.StorageFactoryService$9.run(StorageFactoryService.java:675)
    at 
java.security.AccessController.doPrivileged(AccessController.java:242)
    at 
org.apache.derby.impl.services.monitor.StorageFactoryService.createServiceRoot(StorageFactoryService.java:651)
    at 
org.apache.derby.impl.services.monitor.BaseMonitor.bootService(BaseMonitor.java:1760)
    at 
org.apache.derby.impl.services.monitor.BaseMonitor.createPersistentService(BaseMonitor.java:1024)
    at 
org.apache.derby.iapi.services.monitor.Monitor.createPersistentService(Monitor.java:596)
    at 
org.apache.derby.impl.jdbc.EmbedConnection.createDatabase(EmbedConnection.java:2362)
    ... 26 more
11) Encryption Algorithm: AES/CBC/NoPaddingjava.sql.SQLException: Failed 
to create database 'singleUse/oneuse65', see the next exception for details.
    at 
org.apache.derby.impl.jdbc.SQLExceptionFactory.getSQLException(SQLExceptionFactory.java:45)
    at org.apache.derby.impl.jdbc.Util.newEmbedSQLException(Util.java:87)
    at org.apache.derby.impl.jdbc.Util.seeNextException(Util.java:223)
    at 
org.apache.derby.impl.jdbc.EmbedConnection.createDatabase(EmbedConnection.java:2368)
    at 
org.apache.derby.impl.jdbc.EmbedConnection.<init>(EmbedConnection.java:382)
    at 
org.apache.derby.jdbc.Driver30.getNewEmbedConnection(Driver30.java:80)
    at org.apache.derby.jdbc.InternalDriver.connect(InternalDriver.java:238)
    at 
org.apache.derby.jdbc.EmbeddedDataSource.getConnection(EmbeddedDataSource.java:478)
    at 
org.apache.derby.jdbc.EmbeddedDataSource.getConnection(EmbeddedDataSource.java:422)
    at org.apache.derbyTesting.junit.Decorator$2.setUp(Decorator.java:185)
    at junit.extensions.TestSetup$1.protect(TestSetup.java:18)
    at junit.extensions.TestSetup.run(TestSetup.java:23)
    at 
org.apache.derbyTesting.junit.BaseTestSetup.run(BaseTestSetup.java:57)
    at junit.extensions.TestDecorator.basicRun(TestDecorator.java:22)
    at junit.extensions.TestSetup$1.protect(TestSetup.java:19)
    at junit.extensions.TestSetup.run(TestSetup.java:23)
    at 
org.apache.derbyTesting.junit.BaseTestSetup.run(BaseTestSetup.java:57)
    at junit.extensions.TestDecorator.basicRun(TestDecorator.java:22)
    at junit.extensions.TestSetup$1.protect(TestSetup.java:19)
    at junit.extensions.TestSetup.run(TestSetup.java:23)
Caused by: java.sql.SQLException: Directory 
C:\kmarsden\projects\10.4testing\test3\system\singleUse\oneuse65 cannot 
be created.
    at 
org.apache.derby.impl.jdbc.SQLExceptionFactory.getSQLException(SQLExceptionFactory.java:45)
    at org.apache.derby.impl.jdbc.Util.newEmbedSQLException(Util.java:87)
    at org.apache.derby.impl.jdbc.Util.seeNextException(Util.java:223)
    at 
org.apache.derby.impl.jdbc.TransactionResourceImpl.wrapInSQLException(TransactionResourceImpl.java:398)
    at 
org.apache.derby.impl.jdbc.TransactionResourceImpl.handleException(TransactionResourceImpl.java:346)
    at 
org.apache.derby.impl.jdbc.EmbedConnection.handleException(EmbedConnection.java:2125)
    ... 27 more
Caused by: java.sql.SQLException: Java exception: 'Access denied 
(java.io.FilePermission 
C:\kmarsden\projects\10.4testing\test3\system\singleUse\oneuse65 write): 
java.security.AccessControlException'.
    at 
org.apache.derby.impl.jdbc.SQLExceptionFactory.getSQLException(SQLExceptionFactory.java:45)
    at org.apache.derby.impl.jdbc.Util.newEmbedSQLException(Util.java:87)
    at org.apache.derby.impl.jdbc.Util.javaException(Util.java:244)
    at 
org.apache.derby.impl.jdbc.TransactionResourceImpl.wrapInSQLException(TransactionResourceImpl.java:403)
    ... 30 more
Caused by: java.security.AccessControlException: Access denied 
(java.io.FilePermission 
C:\kmarsden\projects\10.4testing\test3\system\singleUse\oneuse65 write)
    at 
java.security.AccessController.checkPermission(AccessController.java:104)
    at java.lang.SecurityManager.checkPermission(SecurityManager.java:547)
    at java.lang.SecurityManager.checkWrite(SecurityManager.java:977)
    at java.io.File.mkdir(File.java:1145)
    at java.io.File.mkdirs(File.java:1174)
    at 
org.apache.derby.impl.services.monitor.StorageFactoryService$9.run(StorageFactoryService.java:675)
    at 
java.security.AccessController.doPrivileged(AccessController.java:242)
    at 
org.apache.derby.impl.services.monitor.StorageFactoryService.createServiceRoot(StorageFactoryService.java:651)
    at 
org.apache.derby.impl.services.monitor.BaseMonitor.bootService(BaseMonitor.java:1760)
    at 
org.apache.derby.impl.services.monitor.BaseMonitor.createPersistentService(BaseMonitor.java:1024)
    at 
org.apache.derby.iapi.services.monitor.Monitor.createPersistentService(Monitor.java:596)
    at 
org.apache.derby.impl.jdbc.EmbedConnection.createDatabase(EmbedConnection.java:2362)
    ... 26 more
12) Encryption Algorithm: AES/CBC/NoPaddingjava.sql.SQLException: Failed 
to create database 'singleUse/oneuse65', see the next exception for details.
    at 
org.apache.derby.impl.jdbc.SQLExceptionFactory.getSQLException(SQLExceptionFactory.java:45)
    at org.apache.derby.impl.jdbc.Util.newEmbedSQLException(Util.java:87)
    at org.apache.derby.impl.jdbc.Util.seeNextException(Util.java:223)
    at 
org.apache.derby.impl.jdbc.EmbedConnection.createDatabase(EmbedConnection.java:2368)
    at 
org.apache.derby.impl.jdbc.EmbedConnection.<init>(EmbedConnection.java:382)
    at 
org.apache.derby.jdbc.Driver30.getNewEmbedConnection(Driver30.java:80)
    at org.apache.derby.jdbc.InternalDriver.connect(InternalDriver.java:238)
    at 
org.apache.derby.jdbc.AutoloadedDriver.connect(AutoloadedDriver.java:119)
    at java.sql.DriverManager.getConnection(DriverManager.java:562)
    at java.sql.DriverManager.getConnection(DriverManager.java:155)
    at 
org.apache.derbyTesting.junit.DriverManagerConnector.getConnectionByAttributes(DriverManagerConnector.java:131)
    at 
org.apache.derbyTesting.junit.DriverManagerConnector.openConnection(DriverManagerConnector.java:91)
    at 
org.apache.derbyTesting.junit.DriverManagerConnector.openConnection(DriverManagerConnector.java:47)
    at 
org.apache.derbyTesting.junit.TestConfiguration.openConnection(TestConfiguration.java:1341)
    at 
org.apache.derbyTesting.junit.DropDatabaseSetup.tearDown(DropDatabaseSetup.java:54)
    at junit.extensions.TestSetup$1.protect(TestSetup.java:20)
    at junit.extensions.TestSetup.run(TestSetup.java:23)
    at 
org.apache.derbyTesting.junit.BaseTestSetup.run(BaseTestSetup.java:57)
    at junit.extensions.TestDecorator.basicRun(TestDecorator.java:22)
    at junit.extensions.TestSetup$1.protect(TestSetup.java:19)
    at junit.extensions.TestSetup.run(TestSetup.java:23)
Caused by: java.sql.SQLException: Directory 
C:\kmarsden\projects\10.4testing\test3\system\singleUse\oneuse65 cannot 
be created.
    at 
org.apache.derby.impl.jdbc.SQLExceptionFactory.getSQLException(SQLExceptionFactory.java:45)
    at org.apache.derby.impl.jdbc.Util.newEmbedSQLException(Util.java:87)
    at org.apache.derby.impl.jdbc.Util.seeNextException(Util.java:223)
    at 
org.apache.derby.impl.jdbc.TransactionResourceImpl.wrapInSQLException(TransactionResourceImpl.java:398)
    at 
org.apache.derby.impl.jdbc.TransactionResourceImpl.handleException(TransactionResourceImpl.java:346)
    at 
org.apache.derby.impl.jdbc.EmbedConnection.handleException(EmbedConnection.java:2125)
    ... 27 more
Caused by: java.sql.SQLException: Java exception: 'Access denied 
(java.io.FilePermission 
C:\kmarsden\projects\10.4testing\test3\system\singleUse\oneuse65 write): 
java.security.AccessControlException'.
    at 
org.apache.derby.impl.jdbc.SQLExceptionFactory.getSQLException(SQLExceptionFactory.java:45)
    at org.apache.derby.impl.jdbc.Util.newEmbedSQLException(Util.java:87)
    at org.apache.derby.impl.jdbc.Util.javaException(Util.java:244)
    at 
org.apache.derby.impl.jdbc.TransactionResourceImpl.wrapInSQLException(TransactionResourceImpl.java:403)
    ... 30 more
Caused by: java.security.AccessControlException: Access denied 
(java.io.FilePermission 
C:\kmarsden\projects\10.4testing\test3\system\singleUse\oneuse65 write)
    at 
java.security.AccessController.checkPermission(AccessController.java:104)
    at java.lang.SecurityManager.checkPermission(SecurityManager.java:547)
    at java.lang.SecurityManager.checkWrite(SecurityManager.java:977)
    at java.io.File.mkdir(File.java:1145)
    at java.io.File.mkdirs(File.java:1174)
    at 
org.apache.derby.impl.services.monitor.StorageFactoryService$9.run(StorageFactoryService.java:675)
    at 
java.security.AccessController.doPrivileged(AccessController.java:242)
    at 
org.apache.derby.impl.services.monitor.StorageFactoryService.createServiceRoot(StorageFactoryService.java:651)
    at 
org.apache.derby.impl.services.monitor.BaseMonitor.bootService(BaseMonitor.java:1760)
    at 
org.apache.derby.impl.services.monitor.BaseMonitor.createPersistentService(BaseMonitor.java:1024)
    at 
org.apache.derby.iapi.services.monitor.Monitor.createPersistentService(Monitor.java:596)
    at 
org.apache.derby.impl.jdbc.EmbedConnection.createDatabase(EmbedConnection.java:2362)
    ... 26 more
13) Encryption Algorithm: DES/ECB/NoPaddingjava.sql.SQLException: Failed 
to create database 'singleUse/oneuse66', see the next exception for details.
    at 
org.apache.derby.impl.jdbc.SQLExceptionFactory.getSQLException(SQLExceptionFactory.java:45)
    at org.apache.derby.impl.jdbc.Util.newEmbedSQLException(Util.java:87)
    at org.apache.derby.impl.jdbc.Util.seeNextException(Util.java:223)
    at 
org.apache.derby.impl.jdbc.EmbedConnection.createDatabase(EmbedConnection.java:2368)
    at 
org.apache.derby.impl.jdbc.EmbedConnection.<init>(EmbedConnection.java:382)
    at 
org.apache.derby.jdbc.Driver30.getNewEmbedConnection(Driver30.java:80)
    at org.apache.derby.jdbc.InternalDriver.connect(InternalDriver.java:238)
    at 
org.apache.derby.jdbc.EmbeddedDataSource.getConnection(EmbeddedDataSource.java:478)
    at 
org.apache.derby.jdbc.EmbeddedDataSource.getConnection(EmbeddedDataSource.java:422)
    at org.apache.derbyTesting.junit.Decorator$2.setUp(Decorator.java:185)
    at junit.extensions.TestSetup$1.protect(TestSetup.java:18)
    at junit.extensions.TestSetup.run(TestSetup.java:23)
    at 
org.apache.derbyTesting.junit.BaseTestSetup.run(BaseTestSetup.java:57)
    at junit.extensions.TestDecorator.basicRun(TestDecorator.java:22)
    at junit.extensions.TestSetup$1.protect(TestSetup.java:19)
    at junit.extensions.TestSetup.run(TestSetup.java:23)
    at 
org.apache.derbyTesting.junit.BaseTestSetup.run(BaseTestSetup.java:57)
    at junit.extensions.TestDecorator.basicRun(TestDecorator.java:22)
    at junit.extensions.TestSetup$1.protect(TestSetup.java:19)
    at junit.extensions.TestSetup.run(TestSetup.java:23)
Caused by: java.sql.SQLException: Directory 
C:\kmarsden\projects\10.4testing\test3\system\singleUse\oneuse66 cannot 
be created.
    at 
org.apache.derby.impl.jdbc.SQLExceptionFactory.getSQLException(SQLExceptionFactory.java:45)
    at org.apache.derby.impl.jdbc.Util.newEmbedSQLException(Util.java:87)
    at org.apache.derby.impl.jdbc.Util.seeNextException(Util.java:223)
    at 
org.apache.derby.impl.jdbc.TransactionResourceImpl.wrapInSQLException(TransactionResourceImpl.java:398)
    at 
org.apache.derby.impl.jdbc.TransactionResourceImpl.handleException(TransactionResourceImpl.java:346)
    at 
org.apache.derby.impl.jdbc.EmbedConnection.handleException(EmbedConnection.java:2125)
    ... 27 more
Caused by: java.sql.SQLException: Java exception: 'Access denied 
(java.io.FilePermission 
C:\kmarsden\projects\10.4testing\test3\system\singleUse\oneuse66 write): 
java.security.AccessControlException'.
    at 
org.apache.derby.impl.jdbc.SQLExceptionFactory.getSQLException(SQLExceptionFactory.java:45)
    at org.apache.derby.impl.jdbc.Util.newEmbedSQLException(Util.java:87)
    at org.apache.derby.impl.jdbc.Util.javaException(Util.java:244)
    at 
org.apache.derby.impl.jdbc.TransactionResourceImpl.wrapInSQLException(TransactionResourceImpl.java:403)
    ... 30 more
Caused by: java.security.AccessControlException: Access denied 
(java.io.FilePermission 
C:\kmarsden\projects\10.4testing\test3\system\singleUse\oneuse66 write)
    at 
java.security.AccessController.checkPermission(AccessController.java:104)
    at java.lang.SecurityManager.checkPermission(SecurityManager.java:547)
    at java.lang.SecurityManager.checkWrite(SecurityManager.java:977)
    at java.io.File.mkdir(File.java:1145)
    at java.io.File.mkdirs(File.java:1174)
    at 
org.apache.derby.impl.services.monitor.StorageFactoryService$9.run(StorageFactoryService.java:675)
    at 
java.security.AccessController.doPrivileged(AccessController.java:242)
    at 
org.apache.derby.impl.services.monitor.StorageFactoryService.createServiceRoot(StorageFactoryService.java:651)
    at 
org.apache.derby.impl.services.monitor.BaseMonitor.bootService(BaseMonitor.java:1760)
    at 
org.apache.derby.impl.services.monitor.BaseMonitor.createPersistentService(BaseMonitor.java:1024)
    at 
org.apache.derby.iapi.services.monitor.Monitor.createPersistentService(Monitor.java:596)
    at 
org.apache.derby.impl.jdbc.EmbedConnection.createDatabase(EmbedConnection.java:2362)
    ... 26 more
14) Encryption Algorithm: DES/ECB/NoPaddingjava.sql.SQLException: Failed 
to create database 'singleUse/oneuse66', see the next exception for details.
    at 
org.apache.derby.impl.jdbc.SQLExceptionFactory.getSQLException(SQLExceptionFactory.java:45)
    at org.apache.derby.impl.jdbc.Util.newEmbedSQLException(Util.java:87)
    at org.apache.derby.impl.jdbc.Util.seeNextException(Util.java:223)
    at 
org.apache.derby.impl.jdbc.EmbedConnection.createDatabase(EmbedConnection.java:2368)
    at 
org.apache.derby.impl.jdbc.EmbedConnection.<init>(EmbedConnection.java:382)
    at 
org.apache.derby.jdbc.Driver30.getNewEmbedConnection(Driver30.java:80)
    at org.apache.derby.jdbc.InternalDriver.connect(InternalDriver.java:238)
    at 
org.apache.derby.jdbc.AutoloadedDriver.connect(AutoloadedDriver.java:119)
    at java.sql.DriverManager.getConnection(DriverManager.java:562)
    at java.sql.DriverManager.getConnection(DriverManager.java:155)
    at 
org.apache.derbyTesting.junit.DriverManagerConnector.getConnectionByAttributes(DriverManagerConnector.java:131)
    at 
org.apache.derbyTesting.junit.DriverManagerConnector.openConnection(DriverManagerConnector.java:91)
    at 
org.apache.derbyTesting.junit.DriverManagerConnector.openConnection(DriverManagerConnector.java:47)
    at 
org.apache.derbyTesting.junit.TestConfiguration.openConnection(TestConfiguration.java:1341)
    at 
org.apache.derbyTesting.junit.DropDatabaseSetup.tearDown(DropDatabaseSetup.java:54)
    at junit.extensions.TestSetup$1.protect(TestSetup.java:20)
    at junit.extensions.TestSetup.run(TestSetup.java:23)
    at 
org.apache.derbyTesting.junit.BaseTestSetup.run(BaseTestSetup.java:57)
    at junit.extensions.TestDecorator.basicRun(TestDecorator.java:22)
    at junit.extensions.TestSetup$1.protect(TestSetup.java:19)
    at junit.extensions.TestSetup.run(TestSetup.java:23)
Caused by: java.sql.SQLException: Directory 
C:\kmarsden\projects\10.4testing\test3\system\singleUse\oneuse66 cannot 
be created.
    at 
org.apache.derby.impl.jdbc.SQLExceptionFactory.getSQLException(SQLExceptionFactory.java:45)
    at org.apache.derby.impl.jdbc.Util.newEmbedSQLException(Util.java:87)
    at org.apache.derby.impl.jdbc.Util.seeNextException(Util.java:223)
    at 
org.apache.derby.impl.jdbc.TransactionResourceImpl.wrapInSQLException(TransactionResourceImpl.java:398)
    at 
org.apache.derby.impl.jdbc.TransactionResourceImpl.handleException(TransactionResourceImpl.java:346)
    at 
org.apache.derby.impl.jdbc.EmbedConnection.handleException(EmbedConnection.java:2125)
    ... 27 more
Caused by: java.sql.SQLException: Java exception: 'Access denied 
(java.io.FilePermission 
C:\kmarsden\projects\10.4testing\test3\system\singleUse\oneuse66 write): 
java.security.AccessControlException'.
    at 
org.apache.derby.impl.jdbc.SQLExceptionFactory.getSQLException(SQLExceptionFactory.java:45)
    at org.apache.derby.impl.jdbc.Util.newEmbedSQLException(Util.java:87)
    at org.apache.derby.impl.jdbc.Util.javaException(Util.java:244)
    at 
org.apache.derby.impl.jdbc.TransactionResourceImpl.wrapInSQLException(TransactionResourceImpl.java:403)
    ... 30 more
Caused by: java.security.AccessControlException: Access denied 
(java.io.FilePermission 
C:\kmarsden\projects\10.4testing\test3\system\singleUse\oneuse66 write)
    at 
java.security.AccessController.checkPermission(AccessController.java:104)
    at java.lang.SecurityManager.checkPermission(SecurityManager.java:547)
    at java.lang.SecurityManager.checkWrite(SecurityManager.java:977)
    at java.io.File.mkdir(File.java:1145)
    at java.io.File.mkdirs(File.java:1174)
    at 
org.apache.derby.impl.services.monitor.StorageFactoryService$9.run(StorageFactoryService.java:675)
    at 
java.security.AccessController.doPrivileged(AccessController.java:242)
    at 
org.apache.derby.impl.services.monitor.StorageFactoryService.createServiceRoot(StorageFactoryService.java:651)
    at 
org.apache.derby.impl.services.monitor.BaseMonitor.bootService(BaseMonitor.java:1760)
    at 
org.apache.derby.impl.services.monitor.BaseMonitor.createPersistentService(BaseMonitor.java:1024)
    at 
org.apache.derby.iapi.services.monitor.Monitor.createPersistentService(Monitor.java:596)
    at 
org.apache.derby.impl.jdbc.EmbedConnection.createDatabase(EmbedConnection.java:2362)
    ... 26 more
15) Encryption Algorithm: DESede/CFB/NoPaddingjava.sql.SQLException: 
Failed to create database 'singleUse/oneuse67', see the next exception 
for details.
    at 
org.apache.derby.impl.jdbc.SQLExceptionFactory.getSQLException(SQLExceptionFactory.java:45)
    at org.apache.derby.impl.jdbc.Util.newEmbedSQLException(Util.java:87)
    at org.apache.derby.impl.jdbc.Util.seeNextException(Util.java:223)
    at 
org.apache.derby.impl.jdbc.EmbedConnection.createDatabase(EmbedConnection.java:2368)
    at 
org.apache.derby.impl.jdbc.EmbedConnection.<init>(EmbedConnection.java:382)
    at 
org.apache.derby.jdbc.Driver30.getNewEmbedConnection(Driver30.java:80)
    at org.apache.derby.jdbc.InternalDriver.connect(InternalDriver.java:238)
    at 
org.apache.derby.jdbc.EmbeddedDataSource.getConnection(EmbeddedDataSource.java:478)
    at 
org.apache.derby.jdbc.EmbeddedDataSource.getConnection(EmbeddedDataSource.java:422)
    at org.apache.derbyTesting.junit.Decorator$2.setUp(Decorator.java:185)
    at junit.extensions.TestSetup$1.protect(TestSetup.java:18)
    at junit.extensions.TestSetup.run(TestSetup.java:23)
    at 
org.apache.derbyTesting.junit.BaseTestSetup.run(BaseTestSetup.java:57)
    at junit.extensions.TestDecorator.basicRun(TestDecorator.java:22)
    at junit.extensions.TestSetup$1.protect(TestSetup.java:19)
    at junit.extensions.TestSetup.run(TestSetup.java:23)
    at 
org.apache.derbyTesting.junit.BaseTestSetup.run(BaseTestSetup.java:57)
    at junit.extensions.TestDecorator.basicRun(TestDecorator.java:22)
    at junit.extensions.TestSetup$1.protect(TestSetup.java:19)
    at junit.extensions.TestSetup.run(TestSetup.java:23)
Caused by: java.sql.SQLException: Directory 
C:\kmarsden\projects\10.4testing\test3\system\singleUse\oneuse67 cannot 
be created.
    at 
org.apache.derby.impl.jdbc.SQLExceptionFactory.getSQLException(SQLExceptionFactory.java:45)
    at org.apache.derby.impl.jdbc.Util.newEmbedSQLException(Util.java:87)
    at org.apache.derby.impl.jdbc.Util.seeNextException(Util.java:223)
    at 
org.apache.derby.impl.jdbc.TransactionResourceImpl.wrapInSQLException(TransactionResourceImpl.java:398)
    at 
org.apache.derby.impl.jdbc.TransactionResourceImpl.handleException(TransactionResourceImpl.java:346)
    at 
org.apache.derby.impl.jdbc.EmbedConnection.handleException(EmbedConnection.java:2125)
    ... 27 more
Caused by: java.sql.SQLException: Java exception: 'Access denied 
(java.io.FilePermission 
C:\kmarsden\projects\10.4testing\test3\system\singleUse\oneuse67 write): 
java.security.AccessControlException'.
    at 
org.apache.derby.impl.jdbc.SQLExceptionFactory.getSQLException(SQLExceptionFactory.java:45)
    at org.apache.derby.impl.jdbc.Util.newEmbedSQLException(Util.java:87)
    at org.apache.derby.impl.jdbc.Util.javaException(Util.java:244)
    at 
org.apache.derby.impl.jdbc.TransactionResourceImpl.wrapInSQLException(TransactionResourceImpl.java:403)
    ... 30 more
Caused by: java.security.AccessControlException: Access denied 
(java.io.FilePermission 
C:\kmarsden\projects\10.4testing\test3\system\singleUse\oneuse67 write)
    at 
java.security.AccessController.checkPermission(AccessController.java:104)
    at java.lang.SecurityManager.checkPermission(SecurityManager.java:547)
    at java.lang.SecurityManager.checkWrite(SecurityManager.java:977)
    at java.io.File.mkdir(File.java:1145)
    at java.io.File.mkdirs(File.java:1174)
    at 
org.apache.derby.impl.services.monitor.StorageFactoryService$9.run(StorageFactoryService.java:675)
    at 
java.security.AccessController.doPrivileged(AccessController.java:242)
    at 
org.apache.derby.impl.services.monitor.StorageFactoryService.createServiceRoot(StorageFactoryService.java:651)
    at 
org.apache.derby.impl.services.monitor.BaseMonitor.bootService(BaseMonitor.java:1760)
    at 
org.apache.derby.impl.services.monitor.BaseMonitor.createPersistentService(BaseMonitor.java:1024)
    at 
org.apache.derby.iapi.services.monitor.Monitor.createPersistentService(Monitor.java:596)
    at 
org.apache.derby.impl.jdbc.EmbedConnection.createDatabase(EmbedConnection.java:2362)
    ... 26 more
16) Encryption Algorithm: DESede/CFB/NoPaddingjava.sql.SQLException: 
Failed to create database 'singleUse/oneuse67', see the next exception 
for details.
    at 
org.apache.derby.impl.jdbc.SQLExceptionFactory.getSQLException(SQLExceptionFactory.java:45)
    at org.apache.derby.impl.jdbc.Util.newEmbedSQLException(Util.java:87)
    at org.apache.derby.impl.jdbc.Util.seeNextException(Util.java:223)
    at 
org.apache.derby.impl.jdbc.EmbedConnection.createDatabase(EmbedConnection.java:2368)
    at 
org.apache.derby.impl.jdbc.EmbedConnection.<init>(EmbedConnection.java:382)
    at 
org.apache.derby.jdbc.Driver30.getNewEmbedConnection(Driver30.java:80)
    at org.apache.derby.jdbc.InternalDriver.connect(InternalDriver.java:238)
    at 
org.apache.derby.jdbc.AutoloadedDriver.connect(AutoloadedDriver.java:119)
    at java.sql.DriverManager.getConnection(DriverManager.java:562)
    at java.sql.DriverManager.getConnection(DriverManager.java:155)
    at 
org.apache.derbyTesting.junit.DriverManagerConnector.getConnectionByAttributes(DriverManagerConnector.java:131)
    at 
org.apache.derbyTesting.junit.DriverManagerConnector.openConnection(DriverManagerConnector.java:91)
    at 
org.apache.derbyTesting.junit.DriverManagerConnector.openConnection(DriverManagerConnector.java:47)
    at 
org.apache.derbyTesting.junit.TestConfiguration.openConnection(TestConfiguration.java:1341)
    at 
org.apache.derbyTesting.junit.DropDatabaseSetup.tearDown(DropDatabaseSetup.java:54)
    at junit.extensions.TestSetup$1.protect(TestSetup.java:20)
    at junit.extensions.TestSetup.run(TestSetup.java:23)
    at 
org.apache.derbyTesting.junit.BaseTestSetup.run(BaseTestSetup.java:57)
    at junit.extensions.TestDecorator.basicRun(TestDecorator.java:22)
    at junit.extensions.TestSetup$1.protect(TestSetup.java:19)
    at junit.extensions.TestSetup.run(TestSetup.java:23)
Caused by: java.sql.SQLException: Directory 
C:\kmarsden\projects\10.4testing\test3\system\singleUse\oneuse67 cannot 
be created.
    at 
org.apache.derby.impl.jdbc.SQLExceptionFactory.getSQLException(SQLExceptionFactory.java:45)
    at org.apache.derby.impl.jdbc.Util.newEmbedSQLException(Util.java:87)
    at org.apache.derby.impl.jdbc.Util.seeNextException(Util.java:223)
    at 
org.apache.derby.impl.jdbc.TransactionResourceImpl.wrapInSQLException(TransactionResourceImpl.java:398)
    at 
org.apache.derby.impl.jdbc.TransactionResourceImpl.handleException(TransactionResourceImpl.java:346)
    at 
org.apache.derby.impl.jdbc.EmbedConnection.handleException(EmbedConnection.java:2125)
    ... 27 more
Caused by: java.sql.SQLException: Java exception: 'Access denied 
(java.io.FilePermission 
C:\kmarsden\projects\10.4testing\test3\system\singleUse\oneuse67 write): 
java.security.AccessControlException'.
    at 
org.apache.derby.impl.jdbc.SQLExceptionFactory.getSQLException(SQLExceptionFactory.java:45)
    at org.apache.derby.impl.jdbc.Util.newEmbedSQLException(Util.java:87)
    at org.apache.derby.impl.jdbc.Util.javaException(Util.java:244)
    at 
org.apache.derby.impl.jdbc.TransactionResourceImpl.wrapInSQLException(TransactionResourceImpl.java:403)
    ... 30 more
Caused by: java.security.AccessControlException: Access denied 
(java.io.FilePermission 
C:\kmarsden\projects\10.4testing\test3\system\singleUse\oneuse67 write)
    at 
java.security.AccessController.checkPermission(AccessController.java:104)
    at java.lang.SecurityManager.checkPermission(SecurityManager.java:547)
    at java.lang.SecurityManager.checkWrite(SecurityManager.java:977)
    at java.io.File.mkdir(File.java:1145)
    at java.io.File.mkdirs(File.java:1174)
    at 
org.apache.derby.impl.services.monitor.StorageFactoryService$9.run(StorageFactoryService.java:675)
    at 
java.security.AccessController.doPrivileged(AccessController.java:242)
    at 
org.apache.derby.impl.services.monitor.StorageFactoryService.createServiceRoot(StorageFactoryService.java:651)
    at 
org.apache.derby.impl.services.monitor.BaseMonitor.bootService(BaseMonitor.java:1760)
    at 
org.apache.derby.impl.services.monitor.BaseMonitor.createPersistentService(BaseMonitor.java:1024)
    at 
org.apache.derby.iapi.services.monitor.Monitor.createPersistentService(Monitor.java:596)
    at 
org.apache.derby.impl.jdbc.EmbedConnection.createDatabase(EmbedConnection.java:2362)
    ... 26 more
17) Encryption Algorithm: DES/CBC/NoPaddingjava.sql.SQLException: Failed 
to create database 'singleUse/oneuse68', see the next exception for details.
    at 
org.apache.derby.impl.jdbc.SQLExceptionFactory.getSQLException(SQLExceptionFactory.java:45)
    at org.apache.derby.impl.jdbc.Util.newEmbedSQLException(Util.java:87)
    at org.apache.derby.impl.jdbc.Util.seeNextException(Util.java:223)
    at 
org.apache.derby.impl.jdbc.EmbedConnection.createDatabase(EmbedConnection.java:2368)
    at 
org.apache.derby.impl.jdbc.EmbedConnection.<init>(EmbedConnection.java:382)
    at 
org.apache.derby.jdbc.Driver30.getNewEmbedConnection(Driver30.java:80)
    at org.apache.derby.jdbc.InternalDriver.connect(InternalDriver.java:238)
    at 
org.apache.derby.jdbc.EmbeddedDataSource.getConnection(EmbeddedDataSource.java:478)
    at 
org.apache.derby.jdbc.EmbeddedDataSource.getConnection(EmbeddedDataSource.java:422)
    at org.apache.derbyTesting.junit.Decorator$2.setUp(Decorator.java:185)
    at junit.extensions.TestSetup$1.protect(TestSetup.java:18)
    at junit.extensions.TestSetup.run(TestSetup.java:23)
    at 
org.apache.derbyTesting.junit.BaseTestSetup.run(BaseTestSetup.java:57)
    at junit.extensions.TestDecorator.basicRun(TestDecorator.java:22)
    at junit.extensions.TestSetup$1.protect(TestSetup.java:19)
    at junit.extensions.TestSetup.run(TestSetup.java:23)
    at 
org.apache.derbyTesting.junit.BaseTestSetup.run(BaseTestSetup.java:57)
    at junit.extensions.TestDecorator.basicRun(TestDecorator.java:22)
    at junit.extensions.TestSetup$1.protect(TestSetup.java:19)
    at junit.extensions.TestSetup.run(TestSetup.java:23)
Caused by: java.sql.SQLException: Directory 
C:\kmarsden\projects\10.4testing\test3\system\singleUse\oneuse68 cannot 
be created.
    at 
org.apache.derby.impl.jdbc.SQLExceptionFactory.getSQLException(SQLExceptionFactory.java:45)
    at org.apache.derby.impl.jdbc.Util.newEmbedSQLException(Util.java:87)
    at org.apache.derby.impl.jdbc.Util.seeNextException(Util.java:223)
    at 
org.apache.derby.impl.jdbc.TransactionResourceImpl.wrapInSQLException(TransactionResourceImpl.java:398)
    at 
org.apache.derby.impl.jdbc.TransactionResourceImpl.handleException(TransactionResourceImpl.java:346)
    at 
org.apache.derby.impl.jdbc.EmbedConnection.handleException(EmbedConnection.java:2125)
    ... 27 more
Caused by: java.sql.SQLException: Java exception: 'Access denied 
(java.io.FilePermission 
C:\kmarsden\projects\10.4testing\test3\system\singleUse\oneuse68 write): 
java.security.AccessControlException'.
    at 
org.apache.derby.impl.jdbc.SQLExceptionFactory.getSQLException(SQLExceptionFactory.java:45)
    at org.apache.derby.impl.jdbc.Util.newEmbedSQLException(Util.java:87)
    at org.apache.derby.impl.jdbc.Util.javaException(Util.java:244)
    at 
org.apache.derby.impl.jdbc.TransactionResourceImpl.wrapInSQLException(TransactionResourceImpl.java:403)
    ... 30 more
Caused by: java.security.AccessControlException: Access denied 
(java.io.FilePermission 
C:\kmarsden\projects\10.4testing\test3\system\singleUse\oneuse68 write)
    at 
java.security.AccessController.checkPermission(AccessController.java:104)
    at java.lang.SecurityManager.checkPermission(SecurityManager.java:547)
    at java.lang.SecurityManager.checkWrite(SecurityManager.java:977)
    at java.io.File.mkdir(File.java:1145)
    at java.io.File.mkdirs(File.java:1174)
    at 
org.apache.derby.impl.services.monitor.StorageFactoryService$9.run(StorageFactoryService.java:675)
    at 
java.security.AccessController.doPrivileged(AccessController.java:242)
    at 
org.apache.derby.impl.services.monitor.StorageFactoryService.createServiceRoot(StorageFactoryService.java:651)
    at 
org.apache.derby.impl.services.monitor.BaseMonitor.bootService(BaseMonitor.java:1760)
    at 
org.apache.derby.impl.services.monitor.BaseMonitor.createPersistentService(BaseMonitor.java:1024)
    at 
org.apache.derby.iapi.services.monitor.Monitor.createPersistentService(Monitor.java:596)
    at 
org.apache.derby.impl.jdbc.EmbedConnection.createDatabase(EmbedConnection.java:2362)
    ... 26 more
18) Encryption Algorithm: DES/CBC/NoPaddingjava.sql.SQLException: Failed 
to create database 'singleUse/oneuse68', see the next exception for details.
    at 
org.apache.derby.impl.jdbc.SQLExceptionFactory.getSQLException(SQLExceptionFactory.java:45)
    at org.apache.derby.impl.jdbc.Util.newEmbedSQLException(Util.java:87)
    at org.apache.derby.impl.jdbc.Util.seeNextException(Util.java:223)
    at 
org.apache.derby.impl.jdbc.EmbedConnection.createDatabase(EmbedConnection.java:2368)
    at 
org.apache.derby.impl.jdbc.EmbedConnection.<init>(EmbedConnection.java:382)
    at 
org.apache.derby.jdbc.Driver30.getNewEmbedConnection(Driver30.java:80)
    at org.apache.derby.jdbc.InternalDriver.connect(InternalDriver.java:238)
    at 
org.apache.derby.jdbc.AutoloadedDriver.connect(AutoloadedDriver.java:119)
    at java.sql.DriverManager.getConnection(DriverManager.java:562)
    at java.sql.DriverManager.getConnection(DriverManager.java:155)
    at 
org.apache.derbyTesting.junit.DriverManagerConnector.getConnectionByAttributes(DriverManagerConnector.java:131)
    at 
org.apache.derbyTesting.junit.DriverManagerConnector.openConnection(DriverManagerConnector.java:91)
    at 
org.apache.derbyTesting.junit.DriverManagerConnector.openConnection(DriverManagerConnector.java:47)
    at 
org.apache.derbyTesting.junit.TestConfiguration.openConnection(TestConfiguration.java:1341)
    at 
org.apache.derbyTesting.junit.DropDatabaseSetup.tearDown(DropDatabaseSetup.java:54)
    at junit.extensions.TestSetup$1.protect(TestSetup.java:20)
    at junit.extensions.TestSetup.run(TestSetup.java:23)
    at 
org.apache.derbyTesting.junit.BaseTestSetup.run(BaseTestSetup.java:57)
    at junit.extensions.TestDecorator.basicRun(TestDecorator.java:22)
    at junit.extensions.TestSetup$1.protect(TestSetup.java:19)
    at junit.extensions.TestSetup.run(TestSetup.java:23)
Caused by: java.sql.SQLException: Directory 
C:\kmarsden\projects\10.4testing\test3\system\singleUse\oneuse68 cannot 
be created.
    at 
org.apache.derby.impl.jdbc.SQLExceptionFactory.getSQLException(SQLExceptionFactory.java:45)
    at org.apache.derby.impl.jdbc.Util.newEmbedSQLException(Util.java:87)
    at org.apache.derby.impl.jdbc.Util.seeNextException(Util.java:223)
    at 
org.apache.derby.impl.jdbc.TransactionResourceImpl.wrapInSQLException(TransactionResourceImpl.java:398)
    at 
org.apache.derby.impl.jdbc.TransactionResourceImpl.handleException(TransactionResourceImpl.java:346)
    at 
org.apache.derby.impl.jdbc.EmbedConnection.handleException(EmbedConnection.java:2125)
    ... 27 more
Caused by: java.sql.SQLException: Java exception: 'Access denied 
(java.io.FilePermission 
C:\kmarsden\projects\10.4testing\test3\system\singleUse\oneuse68 write): 
java.security.AccessControlException'.
    at 
org.apache.derby.impl.jdbc.SQLExceptionFactory.getSQLException(SQLExceptionFactory.java:45)
    at org.apache.derby.impl.jdbc.Util.newEmbedSQLException(Util.java:87)
    at org.apache.derby.impl.jdbc.Util.javaException(Util.java:244)
    at 
org.apache.derby.impl.jdbc.TransactionResourceImpl.wrapInSQLException(TransactionResourceImpl.java:403)
    ... 30 more
Caused by: java.security.AccessControlException: Access denied 
(java.io.FilePermission 
C:\kmarsden\projects\10.4testing\test3\system\singleUse\oneuse68 write)
    at 
java.security.AccessController.checkPermission(AccessController.java:104)
    at java.lang.SecurityManager.checkPermission(SecurityManager.java:547)
    at java.lang.SecurityManager.checkWrite(SecurityManager.java:977)
    at java.io.File.mkdir(File.java:1145)
    at java.io.File.mkdirs(File.java:1174)
    at 
org.apache.derby.impl.services.monitor.StorageFactoryService$9.run(StorageFactoryService.java:675)
    at 
java.security.AccessController.doPrivileged(AccessController.java:242)
    at 
org.apache.derby.impl.services.monitor.StorageFactoryService.createServiceRoot(StorageFactoryService.java:651)
    at 
org.apache.derby.impl.services.monitor.BaseMonitor.bootService(BaseMonitor.java:1760)
    at 
org.apache.derby.impl.services.monitor.BaseMonitor.createPersistentService(BaseMonitor.java:1024)
    at 
org.apache.derby.iapi.services.monitor.Monitor.createPersistentService(Monitor.java:596)
    at 
org.apache.derby.impl.jdbc.EmbedConnection.createDatabase(EmbedConnection.java:2362)
    ... 26 more
19) Encryption Algorithm: Blowfish/CBC/NoPaddingjava.sql.SQLException: 
Failed to create database 'singleUse/oneuse69', see the next exception 
for details.
    at 
org.apache.derby.impl.jdbc.SQLExceptionFactory.getSQLException(SQLExceptionFactory.java:45)
    at org.apache.derby.impl.jdbc.Util.newEmbedSQLException(Util.java:87)
    at org.apache.derby.impl.jdbc.Util.seeNextException(Util.java:223)
    at 
org.apache.derby.impl.jdbc.EmbedConnection.createDatabase(EmbedConnection.java:2368)
    at 
org.apache.derby.impl.jdbc.EmbedConnection.<init>(EmbedConnection.java:382)
    at 
org.apache.derby.jdbc.Driver30.getNewEmbedConnection(Driver30.java:80)
    at org.apache.derby.jdbc.InternalDriver.connect(InternalDriver.java:238)
    at 
org.apache.derby.jdbc.EmbeddedDataSource.getConnection(EmbeddedDataSource.java:478)
    at 
org.apache.derby.jdbc.EmbeddedDataSource.getConnection(EmbeddedDataSource.java:422)
    at org.apache.derbyTesting.junit.Decorator$2.setUp(Decorator.java:185)
    at junit.extensions.TestSetup$1.protect(TestSetup.java:18)
    at junit.extensions.TestSetup.run(TestSetup.java:23)
    at 
org.apache.derbyTesting.junit.BaseTestSetup.run(BaseTestSetup.java:57)
    at junit.extensions.TestDecorator.basicRun(TestDecorator.java:22)
    at junit.extensions.TestSetup$1.protect(TestSetup.java:19)
    at junit.extensions.TestSetup.run(TestSetup.java:23)
    at 
org.apache.derbyTesting.junit.BaseTestSetup.run(BaseTestSetup.java:57)
    at junit.extensions.TestDecorator.basicRun(TestDecorator.java:22)
    at junit.extensions.TestSetup$1.protect(TestSetup.java:19)
    at junit.extensions.TestSetup.run(TestSetup.java:23)
Caused by: java.sql.SQLException: Directory 
C:\kmarsden\projects\10.4testing\test3\system\singleUse\oneuse69 cannot 
be created.
    at 
org.apache.derby.impl.jdbc.SQLExceptionFactory.getSQLException(SQLExceptionFactory.java:45)
    at org.apache.derby.impl.jdbc.Util.newEmbedSQLException(Util.java:87)
    at org.apache.derby.impl.jdbc.Util.seeNextException(Util.java:223)
    at 
org.apache.derby.impl.jdbc.TransactionResourceImpl.wrapInSQLException(TransactionResourceImpl.java:398)
    at 
org.apache.derby.impl.jdbc.TransactionResourceImpl.handleException(TransactionResourceImpl.java:346)
    at 
org.apache.derby.impl.jdbc.EmbedConnection.handleException(EmbedConnection.java:2125)
    ... 27 more
Caused by: java.sql.SQLException: Java exception: 'Access denied 
(java.io.FilePermission 
C:\kmarsden\projects\10.4testing\test3\system\singleUse\oneuse69 write): 
java.security.AccessControlException'.
    at 
org.apache.derby.impl.jdbc.SQLExceptionFactory.getSQLException(SQLExceptionFactory.java:45)
    at org.apache.derby.impl.jdbc.Util.newEmbedSQLException(Util.java:87)
    at org.apache.derby.impl.jdbc.Util.javaException(Util.java:244)
    at 
org.apache.derby.impl.jdbc.TransactionResourceImpl.wrapInSQLException(TransactionResourceImpl.java:403)
    ... 30 more
Caused by: java.security.AccessControlException: Access denied 
(java.io.FilePermission 
C:\kmarsden\projects\10.4testing\test3\system\singleUse\oneuse69 write)
    at 
java.security.AccessController.checkPermission(AccessController.java:104)
    at java.lang.SecurityManager.checkPermission(SecurityManager.java:547)
    at java.lang.SecurityManager.checkWrite(SecurityManager.java:977)
    at java.io.File.mkdir(File.java:1145)
    at java.io.File.mkdirs(File.java:1174)
    at 
org.apache.derby.impl.services.monitor.StorageFactoryService$9.run(StorageFactoryService.java:675)
    at 
java.security.AccessController.doPrivileged(AccessController.java:242)
    at 
org.apache.derby.impl.services.monitor.StorageFactoryService.createServiceRoot(StorageFactoryService.java:651)
    at 
org.apache.derby.impl.services.monitor.BaseMonitor.bootService(BaseMonitor.java:1760)
    at 
org.apache.derby.impl.services.monitor.BaseMonitor.createPersistentService(BaseMonitor.java:1024)
    at 
org.apache.derby.iapi.services.monitor.Monitor.createPersistentService(Monitor.java:596)
    at 
org.apache.derby.impl.jdbc.EmbedConnection.createDatabase(EmbedConnection.java:2362)
    ... 26 more
20) Encryption Algorithm: Blowfish/CBC/NoPaddingjava.sql.SQLException: 
Failed to create database 'singleUse/oneuse69', see the next exception 
for details.
    at 
org.apache.derby.impl.jdbc.SQLExceptionFactory.getSQLException(SQLExceptionFactory.java:45)
    at org.apache.derby.impl.jdbc.Util.newEmbedSQLException(Util.java:87)
    at org.apache.derby.impl.jdbc.Util.seeNextException(Util.java:223)
    at 
org.apache.derby.impl.jdbc.EmbedConnection.createDatabase(EmbedConnection.java:2368)
    at 
org.apache.derby.impl.jdbc.EmbedConnection.<init>(EmbedConnection.java:382)
    at 
org.apache.derby.jdbc.Driver30.getNewEmbedConnection(Driver30.java:80)
    at org.apache.derby.jdbc.InternalDriver.connect(InternalDriver.java:238)
    at 
org.apache.derby.jdbc.AutoloadedDriver.connect(AutoloadedDriver.java:119)
    at java.sql.DriverManager.getConnection(DriverManager.java:562)
    at java.sql.DriverManager.getConnection(DriverManager.java:155)
    at 
org.apache.derbyTesting.junit.DriverManagerConnector.getConnectionByAttributes(DriverManagerConnector.java:131)
    at 
org.apache.derbyTesting.junit.DriverManagerConnector.openConnection(DriverManagerConnector.java:91)
    at 
org.apache.derbyTesting.junit.DriverManagerConnector.openConnection(DriverManagerConnector.java:47)
    at 
org.apache.derbyTesting.junit.TestConfiguration.openConnection(TestConfiguration.java:1341)
    at 
org.apache.derbyTesting.junit.DropDatabaseSetup.tearDown(DropDatabaseSetup.java:54)
    at junit.extensions.TestSetup$1.protect(TestSetup.java:20)
    at junit.extensions.TestSetup.run(TestSetup.java:23)
    at 
org.apache.derbyTesting.junit.BaseTestSetup.run(BaseTestSetup.java:57)
    at junit.extensions.TestDecorator.basicRun(TestDecorator.java:22)
    at junit.extensions.TestSetup$1.protect(TestSetup.java:19)
    at junit.extensions.TestSetup.run(TestSetup.java:23)
Caused by: java.sql.SQLException: Directory 
C:\kmarsden\projects\10.4testing\test3\system\singleUse\oneuse69 cannot 
be created.
    at 
org.apache.derby.impl.jdbc.SQLExceptionFactory.getSQLException(SQLExceptionFactory.java:45)
    at org.apache.derby.impl.jdbc.Util.newEmbedSQLException(Util.java:87)
    at org.apache.derby.impl.jdbc.Util.seeNextException(Util.java:223)
    at 
org.apache.derby.impl.jdbc.TransactionResourceImpl.wrapInSQLException(TransactionResourceImpl.java:398)
    at 
org.apache.derby.impl.jdbc.TransactionResourceImpl.handleException(TransactionResourceImpl.java:346)
    at 
org.apache.derby.impl.jdbc.EmbedConnection.handleException(EmbedConnection.java:2125)
    ... 27 more
Caused by: java.sql.SQLException: Java exception: 'Access denied 
(java.io.FilePermission 
C:\kmarsden\projects\10.4testing\test3\system\singleUse\oneuse69 write): 
java.security.AccessControlException'.
    at 
org.apache.derby.impl.jdbc.SQLExceptionFactory.getSQLException(SQLExceptionFactory.java:45)
    at org.apache.derby.impl.jdbc.Util.newEmbedSQLException(Util.java:87)
    at org.apache.derby.impl.jdbc.Util.javaException(Util.java:244)
    at 
org.apache.derby.impl.jdbc.TransactionResourceImpl.wrapInSQLException(TransactionResourceImpl.java:403)
    ... 30 more
Caused by: java.security.AccessControlException: Access denied 
(java.io.FilePermission 
C:\kmarsden\projects\10.4testing\test3\system\singleUse\oneuse69 write)
    at 
java.security.AccessController.checkPermission(AccessController.java:104)
    at java.lang.SecurityManager.checkPermission(SecurityManager.java:547)
    at java.lang.SecurityManager.checkWrite(SecurityManager.java:977)
    at java.io.File.mkdir(File.java:1145)
    at java.io.File.mkdirs(File.java:1174)
    at 
org.apache.derby.impl.services.monitor.StorageFactoryService$9.run(StorageFactoryService.java:675)
    at 
java.security.AccessController.doPrivileged(AccessController.java:242)
    at 
org.apache.derby.impl.services.monitor.StorageFactoryService.createServiceRoot(StorageFactoryService.java:651)
    at 
org.apache.derby.impl.services.monitor.BaseMonitor.bootService(BaseMonitor.java:1760)
    at 
org.apache.derby.impl.services.monitor.BaseMonitor.createPersistentService(BaseMonitor.java:1024)
    at 
org.apache.derby.iapi.services.monitor.Monitor.createPersistentService(Monitor.java:596)
    at 
org.apache.derby.impl.jdbc.EmbedConnection.createDatabase(EmbedConnection.java:2362)
    ... 26 more
21) Encryption Algorithm: AES/OFB/NoPaddingjava.sql.SQLException: Failed 
to create database 'singleUse/oneuse6a', see the next exception for details.
    at 
org.apache.derby.impl.jdbc.SQLExceptionFactory.getSQLException(SQLExceptionFactory.java:45)
    at org.apache.derby.impl.jdbc.Util.newEmbedSQLException(Util.java:87)
    at org.apache.derby.impl.jdbc.Util.seeNextException(Util.java:223)
    at 
org.apache.derby.impl.jdbc.EmbedConnection.createDatabase(EmbedConnection.java:2368)
    at 
org.apache.derby.impl.jdbc.EmbedConnection.<init>(EmbedConnection.java:382)
    at 
org.apache.derby.jdbc.Driver30.getNewEmbedConnection(Driver30.java:80)
    at org.apache.derby.jdbc.InternalDriver.connect(InternalDriver.java:238)
    at 
org.apache.derby.jdbc.EmbeddedDataSource.getConnection(EmbeddedDataSource.java:478)
    at 
org.apache.derby.jdbc.EmbeddedDataSource.getConnection(EmbeddedDataSource.java:422)
    at org.apache.derbyTesting.junit.Decorator$2.setUp(Decorator.java:185)
    at junit.extensions.TestSetup$1.protect(TestSetup.java:18)
    at junit.extensions.TestSetup.run(TestSetup.java:23)
    at 
org.apache.derbyTesting.junit.BaseTestSetup.run(BaseTestSetup.java:57)
    at junit.extensions.TestDecorator.basicRun(TestDecorator.java:22)
    at junit.extensions.TestSetup$1.protect(TestSetup.java:19)
    at junit.extensions.TestSetup.run(TestSetup.java:23)
    at 
org.apache.derbyTesting.junit.BaseTestSetup.run(BaseTestSetup.java:57)
    at junit.extensions.TestDecorator.basicRun(TestDecorator.java:22)
    at junit.extensions.TestSetup$1.protect(TestSetup.java:19)
    at junit.extensions.TestSetup.run(TestSetup.java:23)
Caused by: java.sql.SQLException: Directory 
C:\kmarsden\projects\10.4testing\test3\system\singleUse\oneuse6a cannot 
be created.
    at 
org.apache.derby.impl.jdbc.SQLExceptionFactory.getSQLException(SQLExceptionFactory.java:45)
    at org.apache.derby.impl.jdbc.Util.newEmbedSQLException(Util.java:87)
    at org.apache.derby.impl.jdbc.Util.seeNextException(Util.java:223)
    at 
org.apache.derby.impl.jdbc.TransactionResourceImpl.wrapInSQLException(TransactionResourceImpl.java:398)
    at 
org.apache.derby.impl.jdbc.TransactionResourceImpl.handleException(TransactionResourceImpl.java:346)
    at 
org.apache.derby.impl.jdbc.EmbedConnection.handleException(EmbedConnection.java:2125)
    ... 27 more
Caused by: java.sql.SQLException: Java exception: 'Access denied 
(java.io.FilePermission 
C:\kmarsden\projects\10.4testing\test3\system\singleUse\oneuse6a write): 
java.security.AccessControlException'.
    at 
org.apache.derby.impl.jdbc.SQLExceptionFactory.getSQLException(SQLExceptionFactory.java:45)
    at org.apache.derby.impl.jdbc.Util.newEmbedSQLException(Util.java:87)
    at org.apache.derby.impl.jdbc.Util.javaException(Util.java:244)
    at 
org.apache.derby.impl.jdbc.TransactionResourceImpl.wrapInSQLException(TransactionResourceImpl.java:403)
    ... 30 more
Caused by: java.security.AccessControlException: Access denied 
(java.io.FilePermission 
C:\kmarsden\projects\10.4testing\test3\system\singleUse\oneuse6a write)
    at 
java.security.AccessController.checkPermission(AccessController.java:104)
    at java.lang.SecurityManager.checkPermission(SecurityManager.java:547)
    at java.lang.SecurityManager.checkWrite(SecurityManager.java:977)
    at java.io.File.mkdir(File.java:1145)
    at java.io.File.mkdirs(File.java:1174)
    at 
org.apache.derby.impl.services.monitor.StorageFactoryService$9.run(StorageFactoryService.java:675)
    at 
java.security.AccessController.doPrivileged(AccessController.java:242)
    at 
org.apache.derby.impl.services.monitor.StorageFactoryService.createServiceRoot(StorageFactoryService.java:651)
    at 
org.apache.derby.impl.services.monitor.BaseMonitor.bootService(BaseMonitor.java:1760)
    at 
org.apache.derby.impl.services.monitor.BaseMonitor.createPersistentService(BaseMonitor.java:1024)
    at 
org.apache.derby.iapi.services.monitor.Monitor.createPersistentService(Monitor.java:596)
    at 
org.apache.derby.impl.jdbc.EmbedConnection.createDatabase(EmbedConnection.java:2362)
    ... 26 more
22) Encryption Algorithm: AES/OFB/NoPaddingjava.sql.SQLException: Failed 
to create database 'singleUse/oneuse6a', see the next exception for details.
    at 
org.apache.derby.impl.jdbc.SQLExceptionFactory.getSQLException(SQLExceptionFactory.java:45)
    at org.apache.derby.impl.jdbc.Util.newEmbedSQLException(Util.java:87)
    at org.apache.derby.impl.jdbc.Util.seeNextException(Util.java:223)
    at 
org.apache.derby.impl.jdbc.EmbedConnection.createDatabase(EmbedConnection.java:2368)
    at 
org.apache.derby.impl.jdbc.EmbedConnection.<init>(EmbedConnection.java:382)
    at 
org.apache.derby.jdbc.Driver30.getNewEmbedConnection(Driver30.java:80)
    at org.apache.derby.jdbc.InternalDriver.connect(InternalDriver.java:238)
    at 
org.apache.derby.jdbc.AutoloadedDriver.connect(AutoloadedDriver.java:119)
    at java.sql.DriverManager.getConnection(DriverManager.java:562)
    at java.sql.DriverManager.getConnection(DriverManager.java:155)
    at 
org.apache.derbyTesting.junit.DriverManagerConnector.getConnectionByAttributes(DriverManagerConnector.java:131)
    at 
org.apache.derbyTesting.junit.DriverManagerConnector.openConnection(DriverManagerConnector.java:91)
    at 
org.apache.derbyTesting.junit.DriverManagerConnector.openConnection(DriverManagerConnector.java:47)
    at 
org.apache.derbyTesting.junit.TestConfiguration.openConnection(TestConfiguration.java:1341)
    at 
org.apache.derbyTesting.junit.DropDatabaseSetup.tearDown(DropDatabaseSetup.java:54)
    at junit.extensions.TestSetup$1.protect(TestSetup.java:20)
    at junit.extensions.TestSetup.run(TestSetup.java:23)
    at 
org.apache.derbyTesting.junit.BaseTestSetup.run(BaseTestSetup.java:57)
    at junit.extensions.TestDecorator.basicRun(TestDecorator.java:22)
    at junit.extensions.TestSetup$1.protect(TestSetup.java:19)
    at junit.extensions.TestSetup.run(TestSetup.java:23)
Caused by: java.sql.SQLException: Directory 
C:\kmarsden\projects\10.4testing\test3\system\singleUse\oneuse6a cannot 
be created.
    at 
org.apache.derby.impl.jdbc.SQLExceptionFactory.getSQLException(SQLExceptionFactory.java:45)
    at org.apache.derby.impl.jdbc.Util.newEmbedSQLException(Util.java:87)
    at org.apache.derby.impl.jdbc.Util.seeNextException(Util.java:223)
    at 
org.apache.derby.impl.jdbc.TransactionResourceImpl.wrapInSQLException(TransactionResourceImpl.java:398)
    at 
org.apache.derby.impl.jdbc.TransactionResourceImpl.handleException(TransactionResourceImpl.java:346)
    at 
org.apache.derby.impl.jdbc.EmbedConnection.handleException(EmbedConnection.java:2125)
    ... 27 more
Caused by: java.sql.SQLException: Java exception: 'Access denied 
(java.io.FilePermission 
C:\kmarsden\projects\10.4testing\test3\system\singleUse\oneuse6a write): 
java.security.AccessControlException'.
    at 
org.apache.derby.impl.jdbc.SQLExceptionFactory.getSQLException(SQLExceptionFactory.java:45)
    at org.apache.derby.impl.jdbc.Util.newEmbedSQLException(Util.java:87)
    at org.apache.derby.impl.jdbc.Util.javaException(Util.java:244)
    at 
org.apache.derby.impl.jdbc.TransactionResourceImpl.wrapInSQLException(TransactionResourceImpl.java:403)
    ... 30 more
Caused by: java.security.AccessControlException: Access denied 
(java.io.FilePermission 
C:\kmarsden\projects\10.4testing\test3\system\singleUse\oneuse6a write)
    at 
java.security.AccessController.checkPermission(AccessController.java:104)
    at java.lang.SecurityManager.checkPermission(SecurityManager.java:547)
    at java.lang.SecurityManager.checkWrite(SecurityManager.java:977)
    at java.io.File.mkdir(File.java:1145)
    at java.io.File.mkdirs(File.java:1174)
    at 
org.apache.derby.impl.services.monitor.StorageFactoryService$9.run(StorageFactoryService.java:675)
    at 
java.security.AccessController.doPrivileged(AccessController.java:242)
    at 
org.apache.derby.impl.services.monitor.StorageFactoryService.createServiceRoot(StorageFactoryService.java:651)
    at 
org.apache.derby.impl.services.monitor.BaseMonitor.bootService(BaseMonitor.java:1760)
    at 
org.apache.derby.impl.services.monitor.BaseMonitor.createPersistentService(BaseMonitor.java:1024)
    at 
org.apache.derby.iapi.services.monitor.Monitor.createPersistentService(Monitor.java:596)
    at 
org.apache.derby.impl.jdbc.EmbedConnection.createDatabase(EmbedConnection.java:2362)
    ... 26 more
23) ReplicationRun_Local Suitejava.security.AccessControlException: 
Access denied (java.util.PropertyPermission java.security.policy read)
    at 
java.security.AccessController.checkPermission(AccessController.java:104)
    at java.lang.SecurityManager.checkPermission(SecurityManager.java:547)
    at 
java.lang.SecurityManager.checkPropertyAccess(SecurityManager.java:1300)
    at java.lang.System.getProperty(System.java:369)
    at java.lang.System.getProperty(System.java:353)
    at 
org.apache.derbyTesting.junit.BaseTestCase$4.run(BaseTestCase.java:258)
    at 
java.security.AccessController.doPrivileged(AccessController.java:193)
    at 
org.apache.derbyTesting.junit.BaseTestCase.getSystemProperty(BaseTestCase.java:254)
    at 
org.apache.derbyTesting.junit.SecurityManagerSetup.installSecurityManager(SecurityManagerSetup.java:153)
    at 
org.apache.derbyTesting.junit.SecurityManagerSetup.setUp(SecurityManagerSetup.java:105)
    at junit.extensions.TestSetup$1.protect(TestSetup.java:18)
    at junit.extensions.TestSetup.run(TestSetup.java:23)
24) ReplicationRun_Local_1 Suitejava.security.AccessControlException: 
Access denied (java.util.PropertyPermission java.security.policy read)
    at 
java.security.AccessController.checkPermission(AccessController.java:104)
    at java.lang.SecurityManager.checkPermission(SecurityManager.java:547)
    at 
java.lang.SecurityManager.checkPropertyAccess(SecurityManager.java:1300)
    at java.lang.System.getProperty(System.java:369)
    at java.lang.System.getProperty(System.java:353)
    at 
org.apache.derbyTesting.junit.BaseTestCase$4.run(BaseTestCase.java:258)
    at 
java.security.AccessController.doPrivileged(AccessController.java:193)
    at 
org.apache.derbyTesting.junit.BaseTestCase.getSystemProperty(BaseTestCase.java:254)
    at 
org.apache.derbyTesting.junit.SecurityManagerSetup.installSecurityManager(SecurityManagerSetup.java:153)
    at 
org.apache.derbyTesting.junit.SecurityManagerSetup.setUp(SecurityManagerSetup.java:105)
    at junit.extensions.TestSetup$1.protect(TestSetup.java:18)
    at junit.extensions.TestSetup.run(TestSetup.java:23)
25) ReplicationRun_Local_StateTest_part1 
Suitejava.security.AccessControlException: Access denied 
(java.util.PropertyPermission java.security.policy read)
    at 
java.security.AccessController.checkPermission(AccessController.java:104)
    at java.lang.SecurityManager.checkPermission(SecurityManager.java:547)
    at 
java.lang.SecurityManager.checkPropertyAccess(SecurityManager.java:1300)
    at java.lang.System.getProperty(System.java:369)
    at java.lang.System.getProperty(System.java:353)
    at 
org.apache.derbyTesting.junit.BaseTestCase$4.run(BaseTestCase.java:258)
    at 
java.security.AccessController.doPrivileged(AccessController.java:193)
    at 
org.apache.derbyTesting.junit.BaseTestCase.getSystemProperty(BaseTestCase.java:254)
    at 
org.apache.derbyTesting.junit.SecurityManagerSetup.installSecurityManager(SecurityManagerSetup.java:153)
    at 
org.apache.derbyTesting.junit.SecurityManagerSetup.setUp(SecurityManagerSetup.java:105)
    at junit.extensions.TestSetup$1.protect(TestSetup.java:18)
    at junit.extensions.TestSetup.run(TestSetup.java:23)
26) ReplicationRun_Local_StateTest_part1_1 
Suitejava.security.AccessControlException: Access denied 
(java.util.PropertyPermission java.security.policy read)
    at 
java.security.AccessController.checkPermission(AccessController.java:104)
    at java.lang.SecurityManager.checkPermission(SecurityManager.java:547)
    at 
java.lang.SecurityManager.checkPropertyAccess(SecurityManager.java:1300)
    at java.lang.System.getProperty(System.java:369)
    at java.lang.System.getProperty(System.java:353)
    at 
org.apache.derbyTesting.junit.BaseTestCase$4.run(BaseTestCase.java:258)
    at 
java.security.AccessController.doPrivileged(AccessController.java:193)
    at 
org.apache.derbyTesting.junit.BaseTestCase.getSystemProperty(BaseTestCase.java:254)
    at 
org.apache.derbyTesting.junit.SecurityManagerSetup.installSecurityManager(SecurityManagerSetup.java:153)
    at 
org.apache.derbyTesting.junit.SecurityManagerSetup.setUp(SecurityManagerSetup.java:105)
    at junit.extensions.TestSetup$1.protect(TestSetup.java:18)
    at junit.extensions.TestSetup.run(TestSetup.java:23)
27) ReplicationRun_Local_StateTest_part1_2 
Suitejava.security.AccessControlException: Access denied 
(java.util.PropertyPermission java.security.policy read)
    at 
java.security.AccessController.checkPermission(AccessController.java:104)
    at java.lang.SecurityManager.checkPermission(SecurityManager.java:547)
    at 
java.lang.SecurityManager.checkPropertyAccess(SecurityManager.java:1300)
    at java.lang.System.getProperty(System.java:369)
    at java.lang.System.getProperty(System.java:353)
    at 
org.apache.derbyTesting.junit.BaseTestCase$4.run(BaseTestCase.java:258)
    at 
java.security.AccessController.doPrivileged(AccessController.java:193)
    at 
org.apache.derbyTesting.junit.BaseTestCase.getSystemProperty(BaseTestCase.java:254)
    at 
org.apache.derbyTesting.junit.SecurityManagerSetup.installSecurityManager(SecurityManagerSetup.java:153)
    at 
org.apache.derbyTesting.junit.SecurityManagerSetup.setUp(SecurityManagerSetup.java:105)
    at junit.extensions.TestSetup$1.protect(TestSetup.java:18)
    at junit.extensions.TestSetup.run(TestSetup.java:23)
28) ReplicationRun_Local_StateTest_part1_3 
Suitejava.security.AccessControlException: Access denied 
(java.util.PropertyPermission java.security.policy read)
    at 
java.security.AccessController.checkPermission(AccessController.java:104)
    at java.lang.SecurityManager.checkPermission(SecurityManager.java:547)
    at 
java.lang.SecurityManager.checkPropertyAccess(SecurityManager.java:1300)
    at java.lang.System.getProperty(System.java:369)
    at java.lang.System.getProperty(System.java:353)
    at 
org.apache.derbyTesting.junit.BaseTestCase$4.run(BaseTestCase.java:258)
    at 
java.security.AccessController.doPrivileged(AccessController.java:193)
    at 
org.apache.derbyTesting.junit.BaseTestCase.getSystemProperty(BaseTestCase.java:254)
    at 
org.apache.derbyTesting.junit.SecurityManagerSetup.installSecurityManager(SecurityManagerSetup.java:153)
    at 
org.apache.derbyTesting.junit.SecurityManagerSetup.setUp(SecurityManagerSetup.java:105)
    at junit.extensions.TestSetup$1.protect(TestSetup.java:18)
    at junit.extensions.TestSetup.run(TestSetup.java:23)
29) ReplicationRun_Local_StateTest_part2 
Suitejava.security.AccessControlException: Access denied 
(java.util.PropertyPermission java.security.policy read)
    at 
java.security.AccessController.checkPermission(AccessController.java:104)
    at java.lang.SecurityManager.checkPermission(SecurityManager.java:547)
    at 
java.lang.SecurityManager.checkPropertyAccess(SecurityManager.java:1300)
    at java.lang.System.getProperty(System.java:369)
    at java.lang.System.getProperty(System.java:353)
    at 
org.apache.derbyTesting.junit.BaseTestCase$4.run(BaseTestCase.java:258)
    at 
java.security.AccessController.doPrivileged(AccessController.java:193)
    at 
org.apache.derbyTesting.junit.BaseTestCase.getSystemProperty(BaseTestCase.java:254)
    at 
org.apache.derbyTesting.junit.SecurityManagerSetup.installSecurityManager(SecurityManagerSetup.java:153)
    at 
org.apache.derbyTesting.junit.SecurityManagerSetup.setUp(SecurityManagerSetup.java:105)
    at junit.extensions.TestSetup$1.protect(TestSetup.java:18)
    at junit.extensions.TestSetup.run(TestSetup.java:23)

FAILURES!!!
Tests run: 7621,  Failures: 0,  Errors: 29


>   


Mime
View raw message