db-derby-dev mailing list archives

Site index · List index
Message view « Date » · « Thread »
Top « Date » · « Thread »
From "Myrna van Lunteren" <m.v.lunte...@gmail.com>
Subject build problem? with sane=true after revision 592590
Date Fri, 09 Nov 2007 19:31:37 GMT
Hi,

After revision 592590, if I build with sane=true in my ant.properties
(or after running ant sane with no specific sane setting in my
ant.properties) I do not get any build errors, but suites.All fails
miserably, ending something like this:

Tests run: 451,  Failures: 5,  Errors: 500

The errors differ between running with jdk15 or jdk14, but with jdk14
I get stuff like this:

Ejava.sql.SQLException: org.apache.derby.jdbc.EmbeddedDriver is not
registered with the JDBC driver manager
	at org.apache.derby.jdbc.AutoloadedDriver.getDriverModule(AutoloadedDriver.java:186)
	at org.apache.derby.jdbc.AutoloadedDriver.connect(AutoloadedDriver.java:119)
	at java.sql.DriverManager.getConnection(DriverManager.java:512)
	at java.sql.DriverManager.getConnection(DriverManager.java:171)
	at org.apache.derbyTesting.junit.DriverManagerConnector.openConnection(DriverManagerConnector.java:76)
	at org.apache.derbyTesting.junit.DriverManagerConnector.openConnection(DriverManagerConnector.java:43)
	at org.apache.derbyTesting.junit.TestConfiguration.openDefaultConnection(TestConfiguration.java:1030)
	at org.apache.derbyTesting.junit.BaseJDBCTestSetup.getConnection(BaseJDBCTestSetup.java:74)
	at org.apache.derbyTesting.functionTests.tests.jdbcapi.SURDataModelSetup.setUp(SURDataModelSetup.java:136)
	at junit.extensions.TestSetup$1.protect(TestSetup.java:18)
	at junit.framework.TestResult.runProtected(TestResult.java:124)
	at junit.extensions.TestSetup.run(TestSetup.java:23)
	at org.apache.derbyTesting.junit.BaseTestSetup.run(BaseTestSetup.java:57)
	at junit.framework.TestSuite.runTest(TestSuite.java:208)
	at junit.framework.TestSuite.run(TestSuite.java:203)
	at junit.framework.TestSuite.runTest(TestSuite.java:208)
	at junit.framework.TestSuite.run(TestSuite.java:203)
	at junit.framework.TestSuite.runTest(TestSuite.java:208)
	at junit.framework.TestSuite.run(TestSuite.java:203)
	at junit.framework.TestSuite.runTest(TestSuite.java:208)
	at junit.framework.TestSuite.run(TestSuite.java:203)
	at junit.framework.TestSuite.runTest(TestSuite.java:208)
	at junit.framework.TestSuite.run(TestSuite.java:203)
	at junit.textui.TestRunner.doRun(TestRunner.java:116)
	at junit.textui.TestRunner.start(TestRunner.java:172)
	at junit.textui.TestRunner.main(TestRunner.java:138)
Ejava.sql.SQLException: org.apache.derby.jdbc.EmbeddedDriver is not
registered with the JDBC driver manager
	at org.apache.derby.jdbc.AutoloadedDriver.getDriverModule(AutoloadedDriver.java:186)
	at org.apache.derby.jdbc.AutoloadedDriver.connect(AutoloadedDriver.java:119)
	at java.sql.DriverManager.getConnection(DriverManager.java:512)
	at java.sql.DriverManager.getConnection(DriverManager.java:171)
	at org.apache.derbyTesting.junit.DriverManagerConnector.openConnection(DriverManagerConnector.java:76)
	at org.apache.derbyTesting.junit.DriverManagerConnector.openConnection(DriverManagerConnector.java:43)
	at org.apache.derbyTesting.junit.TestConfiguration.openDefaultConnection(TestConfiguration.java:1030)
	at org.apache.derbyTesting.junit.BaseJDBCTestSetup.getConnection(BaseJDBCTestSetup.java:74)
	at org.apache.derbyTesting.functionTests.tests.jdbcapi.SURDataModelSetup.setUp(SURDataModelSetup.java:136)
	at junit.extensions.TestSetup$1.protect(TestSetup.java:18)
	at junit.framework.TestResult.runProtected(TestResult.java:124)
	at junit.extensions.TestSetup.run(TestSetup.java:23)
	at org.apache.derbyTesting.junit.BaseTestSetup.run(BaseTestSetup.java:57)
	at junit.framework.TestSuite.runTest(TestSuite.java:208)
	at junit.framework.TestSuite.run(TestSuite.java:203)
	at junit.framework.TestSuite.runTest(TestSuite.java:208)
	at junit.framework.TestSuite.run(TestSuite.java:203)
	at junit.framework.TestSuite.runTest(TestSuite.java:208)
	at junit.framework.TestSuite.run(TestSuite.java:203)
	at junit.framework.TestSuite.runTest(TestSuite.java:208)
	at junit.framework.TestSuite.run(TestSuite.java:203)
	at junit.framework.TestSuite.runTest(TestSuite.java:208)
	at junit.framework.TestSuite.run(TestSuite.java:203)
	at junit.textui.TestRunner.doRun(TestRunner.java:116)
	at junit.textui.TestRunner.start(TestRunner.java:172)
	at junit.textui.TestRunner.main(TestRunner.java:138)

jdk15 showed stuff like this:
1) NetworkServerControlApiTest:clientjava.lang.ExceptionInInitializerError
	at java.lang.Class.forName0(Native Method)
	at java.lang.Class.forName(Class.java:164)
	at org.apache.derby.impl.drda.NetworkServerControlImpl.startNetworkServer(NetworkServerControlImpl.java:884)
	at org.apache.derby.impl.drda.NetworkServerControlImpl.start(NetworkServerControlImpl.java:609)
	at org.apache.derby.drda.NetworkServerControl.start(NetworkServerControl.java:333)
	at org.apache.derbyTesting.junit.NetworkServerTestSetup.startWithAPI(NetworkServerTestSetup.java:150)
	at org.apache.derbyTesting.junit.NetworkServerTestSetup.setUp(NetworkServerTestSetup.java:126)
	at junit.extensions.TestSetup$1.protect(TestSetup.java:18)
	at junit.extensions.TestSetup.run(TestSetup.java:23)
	at org.apache.derbyTesting.junit.BaseTestSetup.run(BaseTestSetup.java:57)
	at junit.extensions.TestDecorator.basicRun(TestDecorator.java:22)
	at junit.extensions.TestSetup$1.protect(TestSetup.java:19)
	at junit.extensions.TestSetup.run(TestSetup.java:23)
	at junit.extensions.TestDecorator.basicRun(TestDecorator.java:22)
	at junit.extensions.TestSetup$1.protect(TestSetup.java:19)
	at junit.extensions.TestSetup.run(TestSetup.java:23)
	at junit.extensions.TestDecorator.basicRun(TestDecorator.java:22)
	at junit.extensions.TestSetup$1.protect(TestSetup.java:19)
	at junit.extensions.TestSetup.run(TestSetup.java:23)
Caused by: java.security.AccessControlException: access denied
(java.io.FilePermission C:\derbyt\svn\trunk\classes read)
	at java.security.AccessControlContext.checkPermission(AccessControlContext.java:264)
	at java.security.AccessController.checkPermission(AccessController.java:427)
	at java.lang.SecurityManager.checkPermission(SecurityManager.java:532)
	at java.lang.SecurityManager.checkRead(SecurityManager.java:871)
	at java.io.File.exists(File.java:700)
	at java.io.Win32FileSystem.canonicalize(Win32FileSystem.java:401)
	at java.io.File.getCanonicalPath(File.java:531)
	at org.apache.derby.impl.tools.sysinfo.Main.formatURL(Main.java:1227)
	at org.apache.derby.impl.tools.sysinfo.Main.loadZipFromResource(Main.java:844)
	at org.apache.derby.impl.tools.sysinfo.Main.getAllInfo(Main.java:748)
	at org.apache.derby.impl.tools.sysinfo.Main.reportDerby(Main.java:213)
	at org.apache.derby.impl.tools.sysinfo.Main.getMainInfo(Main.java:120)
	at org.apache.derby.tools.sysinfo.getInfo(sysinfo.java:213)
	at org.apache.derby.impl.services.monitor.BaseMonitor.dumpTempWriter(BaseMonitor.java:1945)
	at org.apache.derby.impl.services.monitor.BaseMonitor.runWithState(BaseMonitor.java:387)
	at org.apache.derby.impl.services.monitor.FileMonitor.<init>(FileMonitor.java:60)
	at org.apache.derby.iapi.services.monitor.Monitor.startMonitor(Monitor.java:289)
	at org.apache.derby.iapi.jdbc.JDBCBoot.boot(JDBCBoot.java:69)
	at org.apache.derby.jdbc.EmbeddedDriver.boot(EmbeddedDriver.java:201)
	at org.apache.derby.jdbc.EmbeddedDriver.<clinit>(EmbeddedDriver.java:96)
	... 32 more
2) PrepareStatementTest:embeddedjava.lang.NoClassDefFoundError
	at java.lang.Class.forName0(Native Method)
	at java.lang.Class.forName(Class.java:164)
	at org.apache.derbyTesting.junit.DriverManagerConnector.loadJDBCDriver(DriverManagerConnector.java:143)
	at org.apache.derbyTesting.junit.DriverManagerConnector.openConnection(DriverManagerConnector.java:72)
	at org.apache.derbyTesting.junit.DriverManagerConnector.openConnection(DriverManagerConnector.java:43)
	at org.apache.derbyTesting.junit.TestConfiguration.openDefaultConnection(TestConfiguration.java:1030)
	at org.apache.derbyTesting.junit.BaseJDBCTestSetup.getConnection(BaseJDBCTestSetup.java:74)
	at org.apache.derbyTesting.junit.CleanDatabaseTestSetup.setUp(CleanDatabaseTestSetup.java:68)
	at junit.extensions.TestSetup$1.protect(TestSetup.java:18)
	at junit.extensions.TestSetup.run(TestSetup.java:23)
	at org.apache.derbyTesting.junit.BaseTestSetup.run(BaseTestSetup.java:57)
3) PrepareStatementTest:clientjava.lang.NoClassDefFoundError
	at java.lang.Class.forName0(Native Method)
	at java.lang.Class.forName(Class.java:164)
	at org.apache.derbyTesting.junit.DriverManagerConnector.loadJDBCDriver(DriverManagerConnector.java:143)
	at org.apache.derbyTesting.junit.DriverManagerConnector.openConnection(DriverManagerConnector.java:72)
	at org.apache.derbyTesting.junit.DriverManagerConnector.openConnection(DriverManagerConnector.java:43)
	at org.apache.derbyTesting.junit.TestConfiguration.openDefaultConnection(TestConfiguration.java:1030)
	at org.apache.derbyTesting.junit.BaseJDBCTestSetup.getConnection(BaseJDBCTestSetup.java:74)
	at org.apache.derbyTesting.junit.CleanDatabaseTestSetup.setUp(CleanDatabaseTestSetup.java:68)
	at junit.extensions.TestSetup$1.protect(TestSetup.java:18)
	at junit.extensions.TestSetup.run(TestSetup.java:23)
	at org.apache.derbyTesting.junit.BaseTestSetup.run(BaseTestSetup.java:57)

Anyone else see this?

I build with jdk15...

Myrna

Mime
View raw message