db-derby-dev mailing list archives

Site index · List index
Message view « Date » · « Thread »
Top « Date » · « Thread »
From Vemund Østgaard (JIRA) <j...@apache.org>
Subject [jira] Commented: (DERBY-2871) XATransactionTest gets XaException: Error executing a XAResource.commit(), server returned XAER_PROTO.
Date Tue, 03 Jul 2007 14:09:04 GMT

    [ https://issues.apache.org/jira/browse/DERBY-2871?page=com.atlassian.jira.plugin.system.issuetabpanels:comment-tabpanel#action_12509881
] 

Vemund Østgaard commented on DERBY-2871:
----------------------------------------

I ran Suites.All on HP with my checked out version of trunk (revision 552770) to verify the
fix.

The same test failed, but this time with a lock timeout instead: 

1) testXATransactionTimeout(org.apache.derbyTesting.functionTests.tests.jdbcapi.XATransactionTest)java.sql.SQLException:
A lock could not be obtained within
the time requested
        at org.apache.derby.client.am.SQLExceptionFactory.getSQLException(Unknown Source)
        at org.apache.derby.client.am.SqlException.getSQLException(Unknown Source)
        at org.apache.derby.client.am.Statement.executeQuery(Unknown Source)
        at org.apache.derbyTesting.functionTests.tests.jdbcapi.XATransactionTest.testXATransactionTimeout(XATransactionTest.java:247)
        at sun.reflect.NativeMethodAccessorImpl.invoke0(Native Method)
        at sun.reflect.NativeMethodAccessorImpl.invoke(NativeMethodAccessorImpl.java:39)
        at sun.reflect.DelegatingMethodAccessorImpl.invoke(DelegatingMethodAccessorImpl.java:25)
        at org.apache.derbyTesting.junit.BaseTestCase.runBare(BaseTestCase.java:95)
        at junit.extensions.TestDecorator.basicRun(TestDecorator.java:24)
        at junit.extensions.TestSetup$1.protect(TestSetup.java:21)
        at junit.extensions.TestSetup.run(TestSetup.java:25)
        at org.apache.derbyTesting.junit.BaseTestSetup.run(BaseTestSetup.java:57)
        at junit.extensions.TestDecorator.basicRun(TestDecorator.java:24)
        at junit.extensions.TestSetup$1.protect(TestSetup.java:21)
        at junit.extensions.TestSetup.run(TestSetup.java:25)
        at junit.extensions.TestDecorator.basicRun(TestDecorator.java:24)
        at junit.extensions.TestSetup$1.protect(TestSetup.java:21)
        at junit.extensions.TestSetup.run(TestSetup.java:25)
        at org.apache.derbyTesting.junit.BaseTestSetup.run(BaseTestSetup.java:57)
Caused by: org.apache.derby.client.am.SqlException: A lock could not be obtained within the
time requested
        at org.apache.derby.client.am.Statement.completeSqlca(Unknown Source)
        at org.apache.derby.client.net.NetStatementReply.parseOpenQueryError(Unknown Source)
        at org.apache.derby.client.net.NetStatementReply.parseOPNQRYreply(Unknown Source)
        at org.apache.derby.client.net.NetStatementReply.readOpenQuery(Unknown Source)
        at org.apache.derby.client.net.StatementReply.readOpenQuery(Unknown Source)
        at org.apache.derby.client.net.NetStatement.readOpenQuery_(Unknown Source)
        at org.apache.derby.client.am.Statement.readOpenQuery(Unknown Source)
        at org.apache.derby.client.am.Statement.flowExecute(Unknown Source)
        at org.apache.derby.client.am.Statement.executeQueryX(Unknown Source)
        ... 40 more


> XATransactionTest gets XaException: Error executing a XAResource.commit(), server returned
XAER_PROTO.
> ------------------------------------------------------------------------------------------------------
>
>                 Key: DERBY-2871
>                 URL: https://issues.apache.org/jira/browse/DERBY-2871
>             Project: Derby
>          Issue Type: Bug
>          Components: JDBC
>    Affects Versions: 10.3.1.0
>         Environment: OS: HP-UX v1.11 i 
> JDK: HP 1.5.0.03 
>            Reporter: Henri van de Scheur
>            Assignee: Julius Stroffek
>            Priority: Minor
>             Fix For: 10.3.1.1
>
>         Attachments: d2871.diff, d2871.stat
>
>
> Method: org.apache.derbyTesting.functionTests.tests.jdbcapi.XATransactionTest
> Signature:
> %XAER_PROTO : Error executing a XAResource.commit(), server returned XAER_PROTO%
> Also see: http://dbtg.thresher.com/derby/test/10.3.1.0_RC/jvm1.5/testing/testlog/hpux/548006-suitesAll_diff.txt

-- 
This message is automatically generated by JIRA.
-
You can reply to this email to add a comment to the issue online.


Mime
View raw message