db-derby-dev mailing list archives

Site index · List index
Message view « Date » · « Thread »
Top « Date » · « Thread »
From "Sean Qiu" <sean.xx....@gmail.com>
Subject [test] there are some junit test fail
Date Mon, 25 Jun 2007 03:19:50 GMT
Hi, guys
I run the junit test for derby,but it can not pass all the cases.
Am i missing some configurations?

>>>>>>>>>>>>>>>>>>>>>>>>>>>>>>>>>>
     [java]     [junit] Running
org.apache.derbyTesting.functionTests.tests.jdbcapi.AutoloadTest
     [java]     [junit] Tests run: 3, Failures: 0, Errors: 1, Time
elapsed: 2.958 sec
     [java]     [junit] Test
org.apache.derbyTesting.functionTests.tests.jdbcapi.AutoloadTest
FAILED
     [java]     [junit] Running
org.apache.derbyTesting.functionTests.tests.jdbcapi.JDBCDriversEmbeddedTest
     [java]     [junit] Tests run: 6, Failures: 0, Errors: 0, Time
elapsed: 3.883 sec
     [java]     [junit] Running
org.apache.derbyTesting.functionTests.tests.jdbcapi.JDBCDriversClientTest
     [java]     [junit] Tests run: 4, Failures: 0, Errors: 0, Time
elapsed: 2.315 sec
     [java]     [junit] Running
org.apache.derbyTesting.functionTests.tests.jdbcapi.JDBCDriversAllTest
     [java]     [junit] Tests run: 10, Failures: 0, Errors: 0, Time
elapsed: 302.198 sec
     [java]     [junit] Running
org.apache.derbyTesting.functionTests.tests.derbynet._Suite
     [java]     [junit] Tests run: 63, Failures: 3, Errors: 0, Time
elapsed: 49.631 sec
     [java]     [junit] Test
org.apache.derbyTesting.functionTests.tests.derbynet._Suite FAILED
     [java]     [junit] Running
org.apache.derbyTesting.functionTests.tests.tools._Suite
     [java]     [junit] Tests run: 66, Failures: 0, Errors: 0, Time
elapsed: 70.394 sec
     [java]     [junit] Running
org.apache.derbyTesting.functionTests.tests.lang._Suite
     [java]     [junit] Tests run: 812, Failures: 32, Errors: 0, Time
elapsed: 1,815.822 sec
     [java]     [junit] Test
org.apache.derbyTesting.functionTests.tests.lang._Suite FAILED
     [java]     [junit] Running
org.apache.derbyTesting.functionTests.tests.jdbcapi._Suite
     [java]     [junit] Tests run: 2279, Failures: 105, Errors: 46,
Time elapsed: 1,221.102 sec
     [java]     [junit] Test
org.apache.derbyTesting.functionTests.tests.jdbcapi._Suite FAILED
     [java]     [junit] Running
org.apache.derbyTesting.functionTests.tests.store._Suite
     [java]     [junit] Tests run: 6, Failures: 3, Errors: 0, Time
elapsed: 3.887 sec
     [java]     [junit] Test
org.apache.derbyTesting.functionTests.tests.store._Suite FAILED
     [java]     [junit] Running
org.apache.derbyTesting.functionTests.tests.upgradeTests._Suite
     [java]     [junit] Tests run: 91, Failures: 31, Errors: 8, Time
elapsed: 537.966 sec
     [java]     [junit] Test
org.apache.derbyTesting.functionTests.tests.upgradeTests._Suite FAILED
     [java]     [junit] Running
org.apache.derbyTesting.functionTests.suites.EncryptionSuite
     [java]     [junit] Tests run: 0, Failures: 11, Errors: 0, Time
elapsed: 2.322 sec
     [java]     [junit] Test
org.apache.derbyTesting.functionTests.suites.EncryptionSuite FAILED

-- 
Sean Qiu

Mime
View raw message