db-derby-dev mailing list archives

Site index · List index
Message view « Date » · « Thread »
Top « Date » · « Thread »
From "Myrna van Lunteren (JIRA)" <j...@apache.org>
Subject [jira] Closed: (DERBY-2759) J2ME (weme 6.1) testImportTableExportTableLobsInUnqalifiedExtFile failure: Import error on line 2 of file extinout\books.del: Java exception: 'java.io.CharConversionException: '.
Date Mon, 04 Jun 2007 22:02:28 GMT

     [ https://issues.apache.org/jira/browse/DERBY-2759?page=com.atlassian.jira.plugin.system.issuetabpanels:all-tabpanel
]

Myrna van Lunteren closed DERBY-2759.
-------------------------------------

    Resolution: Duplicate

duplicate of DERBY-2546.

I think I will disable the test until I can spend time figuring out if this is a jvm bug,
or if there's something in the setup.

> J2ME (weme 6.1)  testImportTableExportTableLobsInUnqalifiedExtFile failure: Import error
on line 2 of file extinout\books.del: Java exception: 'java.io.CharConversionException: '.

> ------------------------------------------------------------------------------------------------------------------------------------------------------------------------------------
>
>                 Key: DERBY-2759
>                 URL: https://issues.apache.org/jira/browse/DERBY-2759
>             Project: Derby
>          Issue Type: Bug
>          Components: Regression Test Failure, Tools
>    Affects Versions: 10.3.0.0
>            Reporter: Kathey Marsden
>
> Import/Export related failure on J2ME 
>  10.3.0.0 alpha - (543689)
> testImportTableExportTableLobsInUnqalifiedExtFile(org.apache.derbyTesting.functionTests.tests.tools.ImportExportLobTest)
failed:
> java.sql.SQLException: Import error on line 2 of file extinout\books.del: Java exception:
'java.io.CharConversionException: '. 
> 	at org.apache.derby.impl.jdbc.SQLExceptionFactory.getSQLException(Unknown Source)
> 	at org.apache.derby.impl.jdbc.Util.newEmbedSQLException(Unknown Source)
> 	at org.apache.derby.impl.jdbc.Util.seeNextException(Unknown Source)
> 	at org.apache.derby.impl.jdbc.TransactionResourceImpl.wrapInSQLException(Unknown Source)
> 	at org.apache.derby.impl.jdbc.TransactionResourceImpl.handleException(Unknown Source)
> 	at org.apache.derby.impl.jdbc.EmbedConnection.handleException(Unknown Source)
> 	at org.apache.derby.impl.jdbc.ConnectionChild.handleException(Unknown Source)
> 	at org.apache.derby.impl.jdbc.EmbedStatement.executeStatement(Unknown Source)
> 	at org.apache.derby.impl.jdbc.EmbedPreparedStatement.executeStatement(Unknown Source)
> 	at org.apache.derby.impl.jdbc.EmbedPreparedStatement.execute(Unknown Source)
> 	at org.apache.derbyTesting.functionTests.tests.tools.ImportExportBaseTest.doImportTableLobsFromExtFile(ImportExportBaseTest.java:225)
> 	at org.apache.derbyTesting.functionTests.tests.tools.ImportExportLobTest.testImportTableExportTableLobsInUnqalifiedExtFile(ImportExportLobTest.java:291)
> 	at java.lang.reflect.AccessibleObject.invokeV(AccessibleObject.java:205)
> 	at java.lang.reflect.Method.invoke(Method.java:253)
> 	at junit.framework.TestCase.runTest(TestCase.java:154)
> 	at junit.framework.TestCase.runBare(TestCase.java:127)
> 	at org.apache.derbyTesting.junit.BaseTestCase.runBare(BaseTestCase.java:88)
> 	at junit.framework.TestResult$1.protect(TestResult.java:106)
> 	at junit.framework.TestResult.runProtected(TestResult.java:124)
> 	at junit.framework.TestResult.run(TestResult.java:109)
> 	at junit.framework.TestCase.run(TestCase.java:118)
> 	at junit.framework.TestSuite.runTest(TestSuite.java:208)
> 	at junit.framework.TestSuite.run(TestSuite.java:203)
> 	at junit.extensions.TestDecorator.basicRun(TestDecorator.java:22)
> 	at junit.extensions.TestSetup$1.protect(TestSetup.java:19)
> 	at junit.framework.TestResult.runProtected(TestResult.java:124)
> 	at junit.extensions.TestSetup.run(TestSetup.java:23)
> 	at junit.extensions.TestDecorator.basicRun(TestDecorator.java:22)
> 	at junit.extensions.TestSetup$1.protect(TestSetup.java:19)
> 	at junit.framework.TestResult.runProtected(TestResult.java:124)
> 	at junit.extensions.TestSetup.run(TestSetup.java:23)
> 	at org.apache.derbyTesting.junit.BaseTestSetup.run(BaseTestSetup.java:57)
> 	at junit.framework.TestSuite.runTest(TestSuite.java:208)
> 	at junit.framework.TestSuite.run(TestSuite.java:203)
> 	at junit.framework.TestSuite.runTest(TestSuite.java:208)
> 	at junit.framework.TestSuite.run(TestSuite.java:203)
> 	at junit.framework.TestSuite.runTest(TestSuite.java:208)
> 	at junit.framework.TestSuite.run(TestSuite.java:203)
> 	at SuitesAllRunner.main(SuitesAllRunner.java:29)
> Caused by: java.sql.SQLException: Java exception: 'java.io.CharConversionException: '.
> 	at org.apache.derby.impl.jdbc.SQLExceptionFactory.getSQLException(Unknown Source)
> 	at org.apache.derby.impl.jdbc.Util.newEmbedSQLException(Unknown Source)
> 	at org.apache.derby.impl.jdbc.Util.seeNextException(Unknown Source)
> 	at org.apache.derby.impl.jdbc.TransactionResourceImpl.wrapInSQLException(Unknown Source)
> 	at org.apache.derby.impl.jdbc.TransactionResourceImpl.handleException(Unknown Source)
> 	at org.apache.derby.impl.jdbc.EmbedConnection.handleException(Unknown Source)
> 	at org.apache.derby.impl.jdbc.ConnectionChild.handleException(Unknown Source)
> 	at org.apache.derby.impl.jdbc.EmbedStatement.executeStatement(Unknown Source)
> 	at org.apache.derby.impl.jdbc.EmbedPreparedStatement.executeStatement(Unknown Source)
> 	at org.apache.derby.impl.jdbc.EmbedPreparedStatement.executeUpdate(Unknown Source)
> 	at org.apache.derby.impl.load.Import.performImport(Unknown Source)
> 	at org.apache.derby.impl.load.Import.importTable(Unknown Source)
> 	at org.apache.derby.catalog.SystemProcedures.SYSCS_IMPORT_TABLE_LOBS_FROM_EXTFILE(Unknown
Source)
> 	at org.apache.derby.exe.ac70670d08x0112xecaax2899xffffa0e5bf741.g0(Unknown Source)
> 	at java.lang.reflect.AccessibleObject.invokeV(AccessibleObject.java:205)
> 	at java.lang.reflect.Method.invoke(Method.java:253)
> 	at org.apache.derby.impl.services.reflect.ReflectMethod.invoke(Unknown Source)
> 	at org.apache.derby.impl.sql.execute.CallStatementResultSet.open(Unknown Source)
> 	at org.apache.derby.impl.sql.GenericPreparedStatement.execute(Unknown Source)
> 	... 32 more
> Caused by: java.sql.SQLException: Java exception: ': java.io.CharConversionException'.
> 	at org.apache.derby.impl.jdbc.SQLExceptionFactory.getSQLException(Unknown Source)
> 	at org.apache.derby.impl.jdbc.Util.newEmbedSQLException(Unknown Source)
> 	at org.apache.derby.impl.jdbc.Util.javaException(Unknown Source)
> 	at org.apache.derby.impl.jdbc.TransactionResourceImpl.wrapInSQLException(Unknown Source)
> 	... 48 more
> Caused by: java.io.CharConversionException
> 	at java.io.InputStreamReader.convert(InputStreamReader.java:119)
> 	at java.io.InputStreamReader.read(InputStreamReader.java:201)
> 	at org.apache.derby.impl.load.ImportLobFile.getString(Unknown Source)
> 	at org.apache.derby.impl.load.ImportReadData.getClobColumnFromExtFileAsString(Unknown
Source)
> 	at org.apache.derby.impl.load.ImportAbstract.getString(Unknown Source)
> 	at org.apache.derby.iapi.types.SQLChar.setValueFromResultSet(Unknown Source)
> 	at org.apache.derby.impl.sql.execute.VTIResultSet.populateFromResultSet(Unknown Source)
> 	at org.apache.derby.impl.sql.execute.VTIResultSet.getNextRowCore(Unknown Source)
> 	at org.apache.derby.impl.sql.execute.ProjectRestrictResultSet.getNextRowCore(Unknown
Source)
> 	at org.apache.derby.impl.sql.execute.NormalizeResultSet.getNextRowCore(Unknown Source)
> 	at org.apache.derby.impl.sql.execute.NoPutResultSetImpl.getNextRowFromRowSource(Unknown
Source)
> 	at org.apache.derby.impl.store.access.heap.HeapController.load(Unknown Source)
> 	at org.apache.derby.impl.store.access.heap.Heap.load(Unknown Source)
> 	at org.apache.derby.impl.store.access.RAMTransaction.loadConglomerate(Unknown Source)
> 	at org.apache.derby.impl.store.access.RAMTransaction.recreateAndLoadConglomerate(Unknown
Source)
> 	at org.apache.derby.impl.sql.execute.InsertResultSet.bulkInsertCore(Unknown Source)
> 	at org.apache.derby.impl.sql.execute.InsertResultSet.open(Unknown Source)
> 	at org.apache.derby.impl.sql.GenericPreparedStatement.execute(Unknown Source)
> 	... 44 more
> ImportExportProcedureTest failed:
> junit.framework.AssertionFailedError: extinout\t1.dat
> 	at java.lang.Throwable.<init>(Throwable.java:57)
> 	at java.lang.Throwable.<init>(Throwable.java:68)
> 	at junit.framework.AssertionFailedError.<init>(AssertionFailedError.java:11)
> 	at junit.framework.Assert.fail(Assert.java:47)
> 	at junit.framework.Assert.assertTrue(Assert.java:20)
> 	at org.apache.derbyTesting.junit.DropDatabaseSetup.removeDir(DropDatabaseSetup.java:129)
> 	at org.apache.derbyTesting.junit.DropDatabaseSetup.access$000(DropDatabaseSetup.java:38)
> 	at org.apache.derbyTesting.junit.DropDatabaseSetup$1.run(DropDatabaseSetup.java:104)
> 	at java.security.AccessController.doPrivileged(AccessController.java:191)
> 	at org.apache.derbyTesting.junit.DropDatabaseSetup.removeDirectory(DropDatabaseSetup.java:101)
> 	at org.apache.derbyTesting.junit.SupportFilesSetup.tearDown(SupportFilesSetup.java:127)
> 	at junit.extensions.TestSetup$1.protect(TestSetup.java:20)
> 	at junit.framework.TestResult.runProtected(TestResult.java:124)
> 	at junit.extensions.TestSetup.run(TestSetup.java:23)
> 	at junit.framework.TestSuite.runTest(TestSuite.java:208)
> 	at junit.framework.TestSuite.run(TestSuite.java:203)
> 	at junit.framework.TestSuite.runTest(TestSuite.java:208)
> 	at junit.framework.TestSuite.run(TestSuite.java:203)
> 	at junit.framework.TestSuite.runTest(TestSuite.java:208)
> 	at junit.framework.TestSuite.run(TestSuite.java:203)
> 	at SuitesAllRunner.main(SuitesAllRunner.java:29)

-- 
This message is automatically generated by JIRA.
-
You can reply to this email to add a comment to the issue online.


Mime
View raw message