db-derby-dev mailing list archives

Site index · List index
Message view « Date » · « Thread »
Top « Date » · « Thread »
From "Tomohito Nakayama (JIRA)" <j...@apache.org>
Subject [jira] Updated: (DERBY-2608) Compilation Error of manual in Apache FOP
Date Fri, 04 May 2007 09:25:15 GMT

     [ https://issues.apache.org/jira/browse/DERBY-2608?page=com.atlassian.jira.plugin.system.issuetabpanels:all-tabpanel
]

Tomohito Nakayama updated DERBY-2608:
-------------------------------------

    Attachment: DERBY-2608.patch

This patch add format attribute whose value is html to xref element where error happens.

This patch seems to resolve error found in DERBY-2608.

// But the error of  DERBY-2473 happens yet .....

> Compilation Error of manual in Apache FOP
> -----------------------------------------
>
>                 Key: DERBY-2608
>                 URL: https://issues.apache.org/jira/browse/DERBY-2608
>             Project: Derby
>          Issue Type: Bug
>          Components: Build tools, Documentation
>            Reporter: Tomohito Nakayama
>            Priority: Blocker
>         Attachments: DERBY-2608.patch
>
>
> When I compiled whole manual with ant -emacs all command, I encountered next errors :
> BUILD FAILED
> /home/naka/derby/dev.doc.DERBY-2261/trunk/build.xml:212: The following error occurred
while executing this line:
> /home/naka/derby/dev.doc.DERBY-2261/trunk/build.xml:231: The following error occurred
while executing this line:
> /home/naka/derby/dev.doc.DERBY-2261/trunk/DITA-OT1.1.2.1/conductor.xml:209: The following
error occurred while executing this line:
> /home/naka/derby/dev.doc.DERBY-2261/trunk/DITA-OT1.1.2.1/ditatargets.xml:78: javax.xml.transform.TransformerException:
org.apache.fop.fo.ValidationException: file:///home/naka/derby/dev.doc.DERBY-2261/trunk/out/ref/refderby.fo:6140:127:
Error(6140/127): fo:basic-link, Missing attribute:  Either external-destination or internal-destination
must be specified.
> There seems that same error happens at   http://dbtg.thresher.com/derby/test/DerbyDocs/index.html
:
> BUILD FAILED
> /home/os136789/Derby/Docs/trunk/build.xml:212: The following error occurred while executing
this line:
> /home/os136789/Derby/Docs/trunk/build.xmlhttp://dbtg.thresher.com/derby/test/DerbyDocs/index.html:231:
The following error occurred while executing this line:
> /home/os136789/Derby/Docs/trunk/DITA-OT1.1.2.1/conductor.xml:209: The following error
occurred while executing this line:
> /home/os136789/Derby/Docs/trunk/DITA-OT1.1.2.1/ditatargets.xml:78: javax.xml.transform.TransformerException:
org.apache.fop.fo.ValidationException: file:///home/os136789/Derby/Docs/trunk/out/ref/refderby.fo:6140:127:
Error(6140/127): fo:basic-link, Missing attribute:  Either external-destination or internal-destination
must be specified.
> Total time: 22 minutes 53 seconds
> Sat Apr 28 02:08:54 CEST 2007
> Reading error messages, error seem to happen around processing of Apache FOP.

-- 
This message is automatically generated by JIRA.
-
You can reply to this email to add a comment to the issue online.


Mime
View raw message