db-derby-dev mailing list archives

Site index · List index
Message view « Date » · « Thread »
Top « Date » · « Thread »
From "Mike Matrigali (JIRA)" <derby-...@db.apache.org>
Subject [jira] Updated: (DERBY-1870) stress/stress.multi: Cannot issue rollback in a nested connection when there is a pending operation in the parent connection.
Date Wed, 20 Sep 2006 14:38:22 GMT
     [ http://issues.apache.org/jira/browse/DERBY-1870?page=all ]

Mike Matrigali updated DERBY-1870:
----------------------------------


can you include the derby.log for this run?  If at all possible it is best to either zip up
the entire stress dir and it's children
or if it is available publicly provide a pointer to where it is.  Sometimes there is info
in derby.log, sometimes in the individual 
test logs, sometimes being able to access the db is interesting.


> stress/stress.multi: Cannot issue rollback in a nested connection when there is a pending
operation in the parent connection.
> -----------------------------------------------------------------------------------------------------------------------------
>
>                 Key: DERBY-1870
>                 URL: http://issues.apache.org/jira/browse/DERBY-1870
>             Project: Derby
>          Issue Type: Test
>    Affects Versions: 10.2.1.0
>         Environment: Solaris 10 1/06 s10s_u1wos_19a SPARC 64bits
> SunOS 5.10 Generic_118822-25
> 2 X sun4u sparcv9 (UltraSPARC-IIIi (portid 1 impl 0x16 ver 0x24 clock 1002 MHz)): 1002
MHz, unknown cache.  2048 Megabytes Total Memory.
> ------------------ Java Information ------------------
> Java Version:    1.6.0-rc
> Java Vendor:     Sun Microsystems Inc.
> Java home:       /usr/local/java/jdk1.6.0_b98/jre
> Java classpath:  /export/home/tmp/jagtmp/autoderbyN_regression/install/lib/derby.jar:/export/home/tmp/jagtmp/autoderbyN_regression/install/lib/derbyLocale_de_DE.jar:/export/home/tmp/jagtmp/autoderbyN_regression/install/lib/derbyLocale_es.jar:/export/home/tmp/jagtmp/autoderbyN_regression/install/lib/derbyLocale_fr.jar:/export/home/tmp/jagtmp/autoderbyN_regression/install/lib/derbyLocale_it.jar:/export/home/tmp/jagtmp/autoderbyN_regression/install/lib/derbyLocale_ja_JP.jar:/export/home/tmp/jagtmp/autoderbyN_regression/install/lib/derbyLocale_ko_KR.jar:/export/home/tmp/jagtmp/autoderbyN_regression/install/lib/derbyLocale_pt_BR.jar:/export/home/tmp/jagtmp/autoderbyN_regression/install/lib/derbyLocale_zh_CN.jar:/export/home/tmp/jagtmp/autoderbyN_regression/install/lib/derbyLocale_zh_TW.jar:/export/home/tmp/jagtmp/autoderbyN_regression/install/lib/derbyTesting.jar:/export/home/tmp/jagtmp/autoderbyN_regression/install/lib/derbyclient.jar:/export/home/tmp/jagtmp/autoderbyN_regression/install/lib/derbynet.jar:/export/home/tmp/jagtmp/autoderbyN_regression/install/lib/derbyrun.jar:/export/home/tmp/jagtmp/autoderbyN_regression/install/lib/derbytools.jar:/export/home/tmp/jagtmp/autoderbyN_regression/install/lib/test/activation.jar:/export/home/tmp/jagtmp/autoderbyN_regression/install/lib/test/commons-logging.jar:/export/home/tmp/jagtmp/autoderbyN_regression/install/lib/test/db2jcc.jar:/export/home/tmp/jagtmp/autoderbyN_regression/install/lib/test/db2jcc_license_c.jar:/export/home/tmp/jagtmp/autoderbyN_regression/install/lib/test/dbprocedures.jar:/export/home/tmp/jagtmp/autoderbyN_regression/install/lib/test/Dots.jar:/export/home/tmp/jagtmp/autoderbyN_regression/install/lib/test/GenCfg.jar:/export/home/tmp/jagtmp/autoderbyN_regression/install/lib/test/hadbjdbc4.jar:/export/home/tmp/jagtmp/autoderbyN_regression/install/lib/test/jagclient.jar:/export/home/tmp/jagtmp/autoderbyN_regression/install/lib/test/jag.jar:/export/home/tmp/jagtmp/autoderbyN_regression/install/lib/test/jagops.jar:/export/home/tmp/jagtmp/autoderbyN_regression/install/lib/test/jagutils.jar:/export/home/tmp/jagtmp/autoderbyN_regression/install/lib/test/jakarta-oro-2.0.8.jar:/export/home/tmp/jagtmp/autoderbyN_regression/install/lib/test/javadbtests.jar:/export/home/tmp/jagtmp/autoderbyN_regression/install/lib/test/jdmkrt.jar:/export/home/tmp/jagtmp/autoderbyN_regression/install/lib/test/jetbatch.jar:/export/home/tmp/jagtmp/autoderbyN_regression/install/lib/test/jet.jar:/export/home/tmp/jagtmp/autoderbyN_regression/install/lib/test/jmx.jar:/export/home/tmp/jagtmp/autoderbyN_regression/install/lib/test/jmxremote.jar:/export/home/tmp/jagtmp/autoderbyN_regression/install/lib/test/jmxremote_optional.jar:/export/home/tmp/jagtmp/autoderbyN_regression/install/lib/test/junit.jar:/export/home/tmp/jagtmp/autoderbyN_regression/install/lib/test/mail.jar:/export/home/tmp/jagtmp/autoderbyN_regression/install/lib/test/Perfmon.jar:
> OS name:         SunOS
> OS architecture: sparc
> OS version:      5.10
> Java user name:  jaguser
> Java user home:  /home/jaguser
> Java user dir:   /export/home/tmp/jagtmp/autoderbyN_regression/derbylang_2/log
> java.specification.name: Java Platform API Specification
> java.specification.version: 1.6
> --------- Derby Information --------
> JRE - JDBC: Java SE 6 - JDBC 4.0
> [/export/home/tmp/jagtmp/autoderbyN_regression/install/lib/derby.jar] 10.2.1.3 beta -
(441574)
> [/export/home/tmp/jagtmp/autoderbyN_regression/install/lib/derbytools.jar] 10.2.1.3 beta
- (441574)
> [/export/home/tmp/jagtmp/autoderbyN_regression/install/lib/derbynet.jar] 10.2.1.3 beta
- (441574)
> [/export/home/tmp/jagtmp/autoderbyN_regression/install/lib/derbyclient.jar] 10.2.1.3
beta - (441574)
> [/export/home/tmp/jagtmp/autoderbyN_regression/install/lib/test/db2jcc.jar] 2.4 - (17)
> [/export/home/tmp/jagtmp/autoderbyN_regression/install/lib/test/db2jcc_license_c.jar]
2.4 - (17)
> ------------------------------------------------------
> ----------------- Locale Information -----------------
> Current Locale :  [English/United States [en_US]]
> Found support for locale: [de_DE]
> 	 version: 10.2.1.3 - (441574)
> Found support for locale: [es]
> 	 version: 10.2.1.3 - (441574)
> Found support for locale: [fr]
> 	 version: 10.2.1.3 - (441574)
> Found support for locale: [it]
> 	 version: 10.2.1.3 - (441574)
> Found support for locale: [ja_JP]
> 	 version: 10.2.1.3 - (441574)
> Found support for locale: [ko_KR]
> 	 version: 10.2.1.3 - (441574)
> Found support for locale: [pt_BR]
> 	 version: 10.2.1.3 - (441574)
> Found support for locale: [zh_CN]
> 	 version: 10.2.1.3 - (441574)
> Found support for locale: [zh_TW]
> 	 version: 10.2.1.3 - (441574)
> ------------------------------------------------------
> Test environment information:
> COMMAND LINE STYLE: jdk13
>            Reporter: Henri van de Scheur
>            Priority: Minor
>
> I am not sure if this is a test- or a product-bug. I think I have seen ti before, but
could not find any JIRA-issue resembling this failure.
> From derbyall/multi/stress.log:
> .....
> Tester2: SELECT2 Tue Sep 12 22:43:24 MEST 2006
> Tester3: SELECT1 Tue Sep 12 22:43:24 MEST 2006
> Tester8: roll Tue Sep 12 22:43:24 MEST 2006
> Tester5: TERMINATING due to unexpected error:
> FatalException: X0Y67: Cannot issue rollback in a nested connection when there is a pending
operation in the parent connection.
> Tester9: TERMINATING due to unexpected error:
> FatalException: X0Y67: Cannot issue rollback in a nested connection when there is a pending
operation in the parent connection.
> Tester4: SELECT2 Tue Sep 12 22:43:26 MEST 2006
> Tester8: TERMINATING due to unexpected error:
> FatalException: 08003: No current connection.
> Tester1: stopping on request after 359 iterations
> Tester2: stopping on request after 372 iterations
> Tester4: stopping on request after 420 iterations
> Tester3: stopping on request after 389 iterations
> Tester7: stopping on request after 407 iterations
> Tester6: stopping on request after 329 iterations
> Tester10: TERMINATING due to unexpected error:
> FatalException: XJ001: Java exception: ': java.lang.NullPointerException'.
> test ran 169196 ms
> total memory is 32702464
> free memory  is 13274472
> Deleting Tester1.out(/export/home/tmp/jagtmp/autoderbyN_regression/derbyall_1/log/derbyall/multi)
> Deleting Tester2.out(/export/home/tmp/jagtmp/autoderbyN_regression/derbyall_1/log/derbyall/multi)
> Deleting Tester3.out(/export/home/tmp/jagtmp/autoderbyN_regression/derbyall_1/log/derbyall/multi)
> Deleting Tester4.out(/export/home/tmp/jagtmp/autoderbyN_regression/derbyall_1/log/derbyall/multi)
> Tester5 failed.
> Deleting Tester6.out(/export/home/tmp/jagtmp/autoderbyN_regression/derbyall_1/log/derbyall/multi)
> Deleting Tester7.out(/export/home/tmp/jagtmp/autoderbyN_regression/derbyall_1/log/derbyall/multi)
> Tester8 failed.
> Tester9 failed.
> Tester10 failed.

-- 
This message is automatically generated by JIRA.
-
If you think it was sent incorrectly contact one of the administrators: http://issues.apache.org/jira/secure/Administrators.jspa
-
For more information on JIRA, see: http://www.atlassian.com/software/jira

       

Mime
View raw message