db-derby-dev mailing list archives

Site index · List index
Message view « Date » · « Thread »
Top « Date » · « Thread »
From "Ole Solberg (JIRA)" <derby-...@db.apache.org>
Subject [jira] Updated: (DERBY-1800) testSetBinaryStreamLengthLessOnBlobTooLong fails with 'Unexpected SQL state. expected:<22001> but was:<58009>'
Date Fri, 01 Sep 2006 13:21:24 GMT
     [ http://issues.apache.org/jira/browse/DERBY-1800?page=all ]

Ole Solberg updated DERBY-1800:
-------------------------------

    Description: 
Has failed since 438528, changes:  http://www.multinet.no/~solberg/public/Apache/Daily/jvm1.6/UpdateInfo/438528.txt

Logs in http://www.multinet.no/~solberg/public/Apache/Daily/jvm1.6/Limited/testSummary-438528.html.
E.g.
*** Start: _Suite jdk1.6.0-rc DerbyNetClient derbynetclientmats:jdbc40 2006-08-31 02:52:09
***
0 add
> ............................F.............
> There was 1 failure:
> 1) testSetBinaryStreamLengthLessOnBlobTooLong(org.apache.derbyTesting.functionTests.tests.jdbc4.PreparedStatementTest)junit.framework.ComparisonFailure:
Unexpected SQL state. expected:<22001> but was:<58009>
> FAILURES!!!
> Tests run: 2048,  Failures: 1,  Errors: 0
Test Failed.
*** End:   _Suite jdk1.6.0-rc DerbyNetClient derbynetclientmats:jdbc40 2006-08-31 02:52:26
***


  was:
Has failed since 438528, changes:  https://clustra.norway.sun.com/~os136789/DBTG_QA_Derby/Daily/jvm1.6/testing/UpdateInfo/438528.txt

*** Start: _Suite jdk1.6.0-rc DerbyNetClient derbynetclientmats:jdbc40 2006-08-31 02:52:09
***
0 add
> ............................F.............
> There was 1 failure:
> 1) testSetBinaryStreamLengthLessOnBlobTooLong(org.apache.derbyTesting.functionTests.tests.jdbc4.PreparedStatementTest)junit.framework.ComparisonFailure:
Unexpected SQL state. expected:<22001> but was:<58009>
> FAILURES!!!
> Tests run: 2048,  Failures: 1,  Errors: 0
Test Failed.
*** End:   _Suite jdk1.6.0-rc DerbyNetClient derbynetclientmats:jdbc40 2006-08-31 02:52:26
***



> testSetBinaryStreamLengthLessOnBlobTooLong fails with 'Unexpected SQL state. expected:<22001>
but was:<58009>'
> --------------------------------------------------------------------------------------------------------------
>
>                 Key: DERBY-1800
>                 URL: http://issues.apache.org/jira/browse/DERBY-1800
>             Project: Derby
>          Issue Type: Bug
>          Components: Regression Test Failure
>    Affects Versions: 10.3.0.0
>         Environment: All
>            Reporter: Ole Solberg
>            Priority: Minor
>
> Has failed since 438528, changes:  http://www.multinet.no/~solberg/public/Apache/Daily/jvm1.6/UpdateInfo/438528.txt
> Logs in http://www.multinet.no/~solberg/public/Apache/Daily/jvm1.6/Limited/testSummary-438528.html.
> E.g.
> *** Start: _Suite jdk1.6.0-rc DerbyNetClient derbynetclientmats:jdbc40 2006-08-31 02:52:09
***
> 0 add
> > ............................F.............
> > There was 1 failure:
> > 1) testSetBinaryStreamLengthLessOnBlobTooLong(org.apache.derbyTesting.functionTests.tests.jdbc4.PreparedStatementTest)junit.framework.ComparisonFailure:
Unexpected SQL state. expected:<22001> but was:<58009>
> > FAILURES!!!
> > Tests run: 2048,  Failures: 1,  Errors: 0
> Test Failed.
> *** End:   _Suite jdk1.6.0-rc DerbyNetClient derbynetclientmats:jdbc40 2006-08-31 02:52:26
***

-- 
This message is automatically generated by JIRA.
-
If you think it was sent incorrectly contact one of the administrators: http://issues.apache.org/jira/secure/Administrators.jspa
-
For more information on JIRA, see: http://www.atlassian.com/software/jira

        

Mime
View raw message