db-derby-dev mailing list archives

Site index · List index
Message view « Date » · « Thread »
Top « Date » · « Thread »
From "Knut Anders Hatlen (JIRA)" <derby-...@db.apache.org>
Subject [jira] Commented: (DERBY-1750) encryption/stress.multi fails with FatalException: XJ001: Java exception: ': java.lang.AbstractMethodError'. on Linux and Windows XP
Date Fri, 25 Aug 2006 18:21:23 GMT
    [ http://issues.apache.org/jira/browse/DERBY-1750?page=comments#action_12430569 ] 
            
Knut Anders Hatlen commented on DERBY-1750:
-------------------------------------------

I don't know if it helps (no stack trace), but here's the last part of Tester10.log:

835 rows selected
ij> disconnect;
ij> --------------createz.sql-----------------
ij version 10.2
CONNECTION0* -  jdbc:derby:mydb
* = current connection
ij> autocommit off;
ij> create table z (x int);
0 rows inserted/updated/deleted
ij> insert into z values (1);
1 row inserted/updated/deleted
ij> insert into z values (1);
1 row inserted/updated/deleted
ij> insert into z values (1);
1 row inserted/updated/deleted
ij> insert into z values (1);
ERROR 38000: The exception 'java.lang.AbstractMethodError' was thrown while evaluating an
expression.
ERROR XJ001: Java exception: ': java.lang.AbstractMethodError'.

> encryption/stress.multi fails with FatalException: XJ001: Java exception: ': java.lang.AbstractMethodError'.
on Linux and Windows XP
> ------------------------------------------------------------------------------------------------------------------------------------
>
>                 Key: DERBY-1750
>                 URL: http://issues.apache.org/jira/browse/DERBY-1750
>             Project: Derby
>          Issue Type: Bug
>          Components: Regression Test Failure
>    Affects Versions: 10.2.1.0
>         Environment: 2 X  AMD Opteron(tm) Processor 244:  1792.052 MHz,  1024 KB cache.
2055844 kB Total Memory.
> Red Hat Enterprise Linux AS release 4 (Nahant Update 3) 64bits
> Linux 2.6.9-34.ELsmp #1 SMP Fri Feb 24 16:56:28 EST 2006 GNU/Linux
> ------------------ Java Information ------------------
> Java Version:    1.6.0-rc
> Java Vendor:     Sun Microsystems Inc.
> Java home:       /usr/local/java/jdk1.6.0_b95/jre
> Java classpath:  /export/home/tmp/jagtmp/autoderbyN_regression/install/lib/test/junit.jar:/export/home/tmp/jagtmp/autoderbyN_regression/install/lib/test/dbprocedures.jar:/export/home/tmp/jagtmp/autoderbyN_regression/install/lib/test/jmxremote.jar:/export/home/tmp/jagtmp/autoderbyN_regression/install/lib/test/javadbtests.jar:/export/home/tmp/jagtmp/autoderbyN_regression/install/lib/test/Dots.jar:/export/home/tmp/jagtmp/autoderbyN_regression/install/lib/test/mail.jar:/export/home/tmp/jagtmp/autoderbyN_regression/install/lib/test/activation.jar:/export/home/tmp/jagtmp/autoderbyN_regression/install/lib/test/Perfmon.jar:/export/home/tmp/jagtmp/autoderbyN_regression/install/lib/test/jakarta-oro-2.0.8.jar:/export/home/tmp/jagtmp/autoderbyN_regression/install/lib/test/commons-logging.jar:/export/home/tmp/jagtmp/autoderbyN_regression/install/lib/test/jagops.jar:/export/home/tmp/jagtmp/autoderbyN_regression/install/lib/test/jdmkrt.jar:/export/home/tmp/jagtmp/autoderbyN_regression/install/lib/test/db2jcc_license_c.jar:/export/home/tmp/jagtmp/autoderbyN_regression/install/lib/test/jet.jar:/export/home/tmp/jagtmp/autoderbyN_regression/install/lib/test/jetbatch.jar:/export/home/tmp/jagtmp/autoderbyN_regression/install/lib/test/db2jcc.jar:/export/home/tmp/jagtmp/autoderbyN_regression/install/lib/test/jag.jar:/export/home/tmp/jagtmp/autoderbyN_regression/install/lib/test/jagclient.jar:/export/home/tmp/jagtmp/autoderbyN_regression/install/lib/test/jagutils.jar:/export/home/tmp/jagtmp/autoderbyN_regression/install/lib/test/GenCfg.jar:/export/home/tmp/jagtmp/autoderbyN_regression/install/lib/test/jmxremote_optional.jar:/export/home/tmp/jagtmp/autoderbyN_regression/install/lib/test/jmx.jar:/export/home/tmp/jagtmp/autoderbyN_regression/install/lib/test/hadbjdbc4.jar:/export/home/tmp/jagtmp/autoderbyN_regression/install/lib/derbyTesting.jar:/export/home/tmp/jagtmp/autoderbyN_regression/install/lib/derby.jar:/export/home/tmp/jagtmp/autoderbyN_regression/install/lib/derbyLocale_zh_TW.jar:/export/home/tmp/jagtmp/autoderbyN_regression/install/lib/derbytools.jar:/export/home/tmp/jagtmp/autoderbyN_regression/install/lib/derbyLocale_ko_KR.jar:/export/home/tmp/jagtmp/autoderbyN_regression/install/lib/derbyLocale_zh_CN.jar:/export/home/tmp/jagtmp/autoderbyN_regression/install/lib/derbyLocale_es.jar:/export/home/tmp/jagtmp/autoderbyN_regression/install/lib/derbyLocale_de_DE.jar:/export/home/tmp/jagtmp/autoderbyN_regression/install/lib/derbyLocale_ja_JP.jar:/export/home/tmp/jagtmp/autoderbyN_regression/install/lib/derbynet.jar:/export/home/tmp/jagtmp/autoderbyN_regression/install/lib/derbyLocale_pt_BR.jar:/export/home/tmp/jagtmp/autoderbyN_regression/install/lib/derbyclient.jar:/export/home/tmp/jagtmp/autoderbyN_regression/install/lib/derbyLocale_fr.jar:/export/home/tmp/jagtmp/autoderbyN_regression/install/lib/derbyrun.jar:/export/home/tmp/jagtmp/autoderbyN_regression/install/lib/derbyLocale_it.jar:
> OS name:         Linux
> OS architecture: i386
> OS version:      2.6.9-34.ELsmp
> Java user name:  jaguser
> Java user home:  /home/jaguser
> Java user dir:   /export/home/tmp/jagtmp/autoderbyN_regression/encryption_6/log
> java.specification.name: Java Platform API Specification
> java.specification.version: 1.6
> --------- Derby Information --------
> JRE - JDBC: Java SE 6 - JDBC 4.0
> [/export/home/tmp/jagtmp/autoderbyN_regression/install/lib/derby.jar] 10.2.1.0 beta -
(430903)
> [/export/home/tmp/jagtmp/autoderbyN_regression/install/lib/derbytools.jar] 10.2.1.0 beta
- (430903)
> [/export/home/tmp/jagtmp/autoderbyN_regression/install/lib/derbynet.jar] 10.2.1.0 beta
- (430903)
> [/export/home/tmp/jagtmp/autoderbyN_regression/install/lib/derbyclient.jar] 10.2.1.0
beta - (430903)
> [/export/home/tmp/jagtmp/autoderbyN_regression/install/lib/test/db2jcc_license_c.jar]
2.4 - (17)
> [/export/home/tmp/jagtmp/autoderbyN_regression/install/lib/test/db2jcc.jar] 2.4 - (17)
> ------------------------------------------------------
> ----------------- Locale Information -----------------
> Current Locale :  [English/United States [en_US]]
> Found support for locale: [de_DE]
> 	 version: 10.2.1.0 - (430903)
> Found support for locale: [es]
> 	 version: 10.2.1.0 - (430903)
> Found support for locale: [fr]
> 	 version: 10.2.1.0 - (430903)
> Found support for locale: [it]
> 	 version: 10.2.1.0 - (430903)
> Found support for locale: [ja_JP]
> 	 version: 10.2.1.0 - (430903)
> Found support for locale: [ko_KR]
> 	 version: 10.2.1.0 - (430903)
> Found support for locale: [pt_BR]
> 	 version: 10.2.1.0 - (430903)
> Found support for locale: [zh_CN]
> 	 version: 10.2.1.0 - (430903)
> Found support for locale: [zh_TW]
> 	 version: 10.2.1.0 - (430903)
> ------------------------------------------------------
> encryption fail *************************************************************
> encryption/encryption.fail:stress/stress.multi
> encryption fail *************************************************************
> Generating report for RunSuite encryption  null null null true 
> ------------------ Java Information ------------------
> Java Version:    1.6.0-rc
> Java Vendor:     Sun Microsystems Inc.
> Java home:       c:\java\jdk1.6.0\jre
> Java classpath:  C:\cludev\jagtmp\autoderbyN_regression\install\lib\derby.jar;C:\cludev\jagtmp\autoderbyN_regression\install\lib\derbyclient.jar;C:\cludev\jagtmp\autoderbyN_regression\install\lib\derbyLocale_de_DE.jar;C:\cludev\jagtmp\autoderbyN_regression\install\lib\derbyLocale_es.jar;C:\cludev\jagtmp\autoderbyN_regression\install\lib\derbyLocale_fr.jar;C:\cludev\jagtmp\autoderbyN_regression\install\lib\derbyLocale_it.jar;C:\cludev\jagtmp\autoderbyN_regression\install\lib\derbyLocale_ja_JP.jar;C:\cludev\jagtmp\autoderbyN_regression\install\lib\derbyLocale_ko_KR.jar;C:\cludev\jagtmp\autoderbyN_regression\install\lib\derbyLocale_pt_BR.jar;C:\cludev\jagtmp\autoderbyN_regression\install\lib\derbyLocale_zh_CN.jar;C:\cludev\jagtmp\autoderbyN_regression\install\lib\derbyLocale_zh_TW.jar;C:\cludev\jagtmp\autoderbyN_regression\install\lib\derbynet.jar;C:\cludev\jagtmp\autoderbyN_regression\install\lib\derbyrun.jar;C:\cludev\jagtmp\autoderbyN_regression\install\lib\derbyTesting.jar;C:\cludev\jagtmp\autoderbyN_regression\install\lib\derbytools.jar;C:\cludev\jagtmp\autoderbyN_regression\install\lib\test\activation.jar;C:\cludev\jagtmp\autoderbyN_regression\install\lib\test\commons-logging.jar;C:\cludev\jagtmp\autoderbyN_regression\install\lib\test\db2jcc.jar;C:\cludev\jagtmp\autoderbyN_regression\install\lib\test\db2jcc_license_c.jar;C:\cludev\jagtmp\autoderbyN_regression\install\lib\test\dbprocedures.jar;C:\cludev\jagtmp\autoderbyN_regression\install\lib\test\Dots.jar;C:\cludev\jagtmp\autoderbyN_regression\install\lib\test\GenCfg.jar;C:\cludev\jagtmp\autoderbyN_regression\install\lib\test\hadbjdbc4.jar;C:\cludev\jagtmp\autoderbyN_regression\install\lib\test\jag.jar;C:\cludev\jagtmp\autoderbyN_regression\install\lib\test\jagclient.jar;C:\cludev\jagtmp\autoderbyN_regression\install\lib\test\jagops.jar;C:\cludev\jagtmp\autoderbyN_regression\install\lib\test\jagutils.jar;C:\cludev\jagtmp\autoderbyN_regression\install\lib\test\jakarta-oro-2.0.8.jar;C:\cludev\jagtmp\autoderbyN_regression\install\lib\test\javadbtests.jar;C:\cludev\jagtmp\autoderbyN_regression\install\lib\test\jdmkrt.jar;C:\cludev\jagtmp\autoderbyN_regression\install\lib\test\jet.jar;C:\cludev\jagtmp\autoderbyN_regression\install\lib\test\jetbatch.jar;C:\cludev\jagtmp\autoderbyN_regression\install\lib\test\jmx.jar;C:\cludev\jagtmp\autoderbyN_regression\install\lib\test\jmxremote.jar;C:\cludev\jagtmp\autoderbyN_regression\install\lib\test\jmxremote_optional.jar;C:\cludev\jagtmp\autoderbyN_regression\install\lib\test\junit.jar;C:\cludev\jagtmp\autoderbyN_regression\install\lib\test\mail.jar;C:\cludev\jagtmp\autoderbyN_regression\install\lib\test\Perfmon.jar;
> OS name:         Windows XP
> OS architecture: x86
> OS version:      5.1
> Java user name:  jaguser
> Java user home:  C:\Documents and Settings\jaguser
> Java user dir:   C:\cludev\jagtmp\autoderbyN_regression\encryption_6\log
> java.specification.name: Java Platform API Specification
> java.specification.version: 1.6
> --------- Derby Information --------
> JRE - JDBC: Java SE 6 - JDBC 4.0
> [C:\cludev\jagtmp\autoderbyN_regression\install\lib\derby.jar] 10.2.1.0 beta - (430903)
> [C:\cludev\jagtmp\autoderbyN_regression\install\lib\derbytools.jar] 10.2.1.0 beta - (430903)
> [C:\cludev\jagtmp\autoderbyN_regression\install\lib\derbynet.jar] 10.2.1.0 beta - (430903)
> [C:\cludev\jagtmp\autoderbyN_regression\install\lib\derbyclient.jar] 10.2.1.0 beta -
(430903)
> [C:\cludev\jagtmp\autoderbyN_regression\install\lib\test\db2jcc.jar] 2.4 - (17)
> [C:\cludev\jagtmp\autoderbyN_regression\install\lib\test\db2jcc_license_c.jar] 2.4 -
(17)
> ------------------------------------------------------
> ----------------- Locale Information -----------------
> Current Locale :  [English/United States [en_US]]
> Found support for locale: [de_DE]
> 	 version: 10.2.1.0 - (430903)
> Found support for locale: [es]
> 	 version: 10.2.1.0 - (430903)
> Found support for locale: [fr]
> 	 version: 10.2.1.0 - (430903)
> Found support for locale: [it]
> 	 version: 10.2.1.0 - (430903)
> Found support for locale: [ja_JP]
> 	 version: 10.2.1.0 - (430903)
> Found support for locale: [ko_KR]
> 	 version: 10.2.1.0 - (430903)
> Found support for locale: [pt_BR]
> 	 version: 10.2.1.0 - (430903)
> Found support for locale: [zh_CN]
> 	 version: 10.2.1.0 - (430903)
> Found support for locale: [zh_TW]
> 	 version: 10.2.1.0 - (430903)
> ------------------------------------------------------
>            Reporter: Henri van de Scheur
>
> encryption/encryption.fail:stress/stress.multi
> ********* Diff file encryption/multi/stress.diff
> *** Start: stress jdk1.6.0-rc encryption:multi 2006-08-14 13:33:14 ***
> 6 del
> < TEST CASE SUMMARY: normal termination
> 7 del
> < ...running last checks via final.sql
> 7 add
> > TEST CASE SUMMARY: abnormal termination due to error(s) -- see test log (./stress/stress.log)
for details 
> Test Failed.
> *** End:   stress jdk1.6.0-rc encryption:multi 2006-08-14 13:39:02 ***
> ------------------------------------------------------
> From stress.log:
> .....
> Tester6: SELECT1 Mon Aug 14 13:38:25 CEST 2006
> Tester4: insert Mon Aug 14 13:38:25 CEST 2006
> Tester10: TERMINATING due to unexpected error:
> FatalException: XJ001: Java exception: ': java.lang.AbstractMethodError'.
> Tester1: update Mon Aug 14 13:38:25 CEST 2006
> Tester1: roll Mon Aug 14 13:38:25 CEST 2006
> .....
> Deleting Tester9.out(/export/home/tmp/jagtmp/autoderbyN_regression/encryption_6/log/encryption/multi)
> Tester10 failed.

-- 
This message is automatically generated by JIRA.
-
If you think it was sent incorrectly contact one of the administrators: http://issues.apache.org/jira/secure/Administrators.jspa
-
For more information on JIRA, see: http://www.atlassian.com/software/jira

       

Mime
View raw message