db-derby-dev mailing list archives

Site index · List index
Message view « Date » · « Thread »
Top « Date » · « Thread »
From Myrna van Lunteren <m.v.lunte...@gmail.com>
Subject Re: [jira] Updated: (DERBY-934) create a set of JUnit tests for Scrollable Updatable Resultsets
Date Fri, 17 Feb 2006 01:46:57 GMT
Hi,

First off, the test SURTest.junit and SURQueryMixTest.junit both appear both
in derbynetclientmats.runall and jdbcapi.runall. That's double, because
jdbcapi is already included in the suites in derbynetclientmats.properties.

Also, the SURTest doesn't pass with ibm14. They *do* work with ibm15.

Here's the diff with ibm14, shall I log a case in jira?

thx,
myrna
*** Start: SURTest jdk1.4.2 DerbyNetClient
derbynetclientmats:derbynetclientmats 2006-02-16 04:54:55 ***
19a20,25
> ... 24 more
> 2) testIndexedScrollInsensitiveUpdateCursorWithForUpdate1(
org.apache.derbyTesting.functionTests.tests.jdbcapi.SURTest)java.sql.SQLException:
ResultSet is not updatable.
> Caused by: org.apache.derby.client.am.SqlException: ResultSet is not
updatable.
> ... 24 more
> 3) testPrimaryKeyUpdate1(
org.apache.derbyTesting.functionTests.tests.jdbcapi.SURTest)java.sql.SQLException:
ResultSet is not updatable.
> Caused by: org.apache.derby.client.am.SqlException: ResultSet is not
updatable.
21,26d26
< 2) testIndexedScrollInsensitiveUpdateCursorWithForUpdate1(
org.apache.derbyTesting.functionTests.tests.jdbcapi.SURTest)java.sql.SQLException:
ResultSet is not updatable.
< Caused by: org.apache.derby.client.am.SqlException: ResultSet is not
updatable.
< ... 23 more
< 3) testPrimaryKeyUpdate1(
org.apache.derbyTesting.functionTests.tests.jdbcapi.SURTest)java.sql.SQLException:
ResultSet is not updatable.
< Caused by: org.apache.derby.client.am.SqlException: ResultSet is not
updatable.
< ... 22 more
29 del
< ... 22 more
29a29
> ... 23 more
32,49d31
< ... 22 more
< 6) testMultipleKeyUpdates(
org.apache.derbyTesting.functionTests.tests.jdbcapi.SURTest)java.sql.SQLException:
ResultSet is not updatable.
< Caused by: org.apache.derby.client.am.SqlException: ResultSet is not
updatable.
< ... 22 more
< 7) testSecondaryIndexKeyUpdate1(
org.apache.derbyTesting.functionTests.tests.jdbcapi.SURTest)java.sql.SQLException:
ResultSet is not updatable.
< Caused by: org.apache.derby.client.am.SqlException: ResultSet is not
updatable.
< ... 22 more
< 8) testOtherSecondaryKeyUpdate1(
org.apache.derbyTesting.functionTests.tests.jdbcapi.SURTest)java.sql.SQLException:
ResultSet is not updatable.
< Caused by: org.apache.derby.client.am.SqlException: ResultSet is not
updatable.
< ... 22 more
< 9) testScrollablePositionedUpdateWithForUpdate1(
org.apache.derbyTesting.functionTests.tests.jdbcapi.SURTest)java.sql.SQLException:
Execution failed due to a distribution protocol error that caused
deallocation of the conversation.  A PROTOCOL Data Stream Syntax Error was
detected.  Reason: 0x3
< Caused by: org.apache.derby.client.am.DisconnectException: Execution
failed due to a distribution protocol error that caused deallocation of the
conversation.  A PROTOCOL Data Stream Syntax Error was detected.  Reason:
0x3
< ... 22 more
< 10) testScrollInsensitiveConcurUpdatableWithForUpdate1(
org.apache.derbyTesting.functionTests.tests.jdbcapi.SURTest)java.sql.SQLException:
ResultSet is not updatable.
< Caused by: org.apache.derby.client.am.SqlException: ResultSet is not
updatable.
< ... 24 more
< 11) testScrollInsensitiveConcurUpdatableWithForUpdate3(
org.apache.derbyTesting.functionTests.tests.jdbcapi.SURTest)java.sql.SQLException:
ResultSet is not updatable.
< Caused by: org.apache.derby.client.am.SqlException: ResultSet is not
updatable.
50a33,50
> 6) testMultipleKeyUpdates(
org.apache.derbyTesting.functionTests.tests.jdbcapi.SURTest)java.sql.SQLException:
ResultSet is not updatable.
> Caused by: org.apache.derby.client.am.SqlException: ResultSet is not
updatable.
> ... 23 more
> 7) testSecondaryIndexKeyUpdate1(
org.apache.derbyTesting.functionTests.tests.jdbcapi.SURTest)java.sql.SQLException:
ResultSet is not updatable.
> Caused by: org.apache.derby.client.am.SqlException: ResultSet is not
updatable.
> ... 23 more
> 8) testOtherSecondaryKeyUpdate1(
org.apache.derbyTesting.functionTests.tests.jdbcapi.SURTest)java.sql.SQLException:
ResultSet is not updatable.
> Caused by: org.apache.derby.client.am.SqlException: ResultSet is not
updatable.
> ... 23 more
> 9) testScrollablePositionedUpdateWithForUpdate1(
org.apache.derbyTesting.functionTests.tests.jdbcapi.SURTest)java.sql.SQLException:
Execution failed due to a distribution protocol error that caused
deallocation of the conversation.  A PROTOCOL Data Stream Syntax Error was
detected.  Reason: 0x3
> Caused by: org.apache.derby.client.am.DisconnectException: Execution
failed due to a distribution protocol error that caused deallocation of the
conversation.  A PROTOCOL Data Stream Syntax Error was detected.  Reason:
0x3
> ... 23 more
> 10) testScrollInsensitiveConcurUpdatableWithForUpdate1(
org.apache.derbyTesting.functionTests.tests.jdbcapi.SURTest)java.sql.SQLException:
ResultSet is not updatable.
> Caused by: org.apache.derby.client.am.SqlException: ResultSet is not
updatable.
> ... 25 more
> 11) testScrollInsensitiveConcurUpdatableWithForUpdate3(
org.apache.derbyTesting.functionTests.tests.jdbcapi.SURTest)java.sql.SQLException:
ResultSet is not updatable.
> Caused by: org.apache.derby.client.am.SqlException: ResultSet is not
updatable.
> ... 24 more
52a53,58
> ... 25 more
> 13) testScrollInsensitiveConcurUpdatableWithoutForUpdate2(
org.apache.derbyTesting.functionTests.tests.jdbcapi.SURTest)java.sql.SQLException:
ResultSet is not updatable.
> Caused by: org.apache.derby.client.am.SqlException: ResultSet is not
updatable.
> ... 25 more
> 14) testScrollInsensitiveConcurUpdatableWithoutForUpdate3(
org.apache.derbyTesting.functionTests.tests.jdbcapi.SURTest)java.sql.SQLException:
ResultSet is not updatable.
> Caused by: org.apache.derby.client.am.SqlException: ResultSet is not
updatable.
54,59d59
< 13) testScrollInsensitiveConcurUpdatableWithoutForUpdate2(
org.apache.derbyTesting.functionTests.tests.jdbcapi.SURTest)java.sql.SQLException:
ResultSet is not updatable.
< Caused by: org.apache.derby.client.am.SqlException: ResultSet is not
updatable.
< ... 24 more
< 14) testScrollInsensitiveConcurUpdatableWithoutForUpdate3(
org.apache.derbyTesting.functionTests.tests.jdbcapi.SURTest)java.sql.SQLException:
ResultSet is not updatable.
< Caused by: org.apache.derby.client.am.SqlException: ResultSet is not
updatable.
< ... 23 more
61a62,67
> ... 24 more
> 16) testIndexedScrollInsensitiveUpdateCursorWithForUpdate1(
org.apache.derbyTesting.functionTests.tests.jdbcapi.SURTest)java.sql.SQLException:
ResultSet is not updatable.
> Caused by: org.apache.derby.client.am.SqlException: ResultSet is not
updatable.
> ... 24 more
> 17) testPrimaryKeyUpdate1(
org.apache.derbyTesting.functionTests.tests.jdbcapi.SURTest)java.sql.SQLException:
ResultSet is not updatable.
> Caused by: org.apache.derby.client.am.SqlException: ResultSet is not
updatable.
63,68d68
< 16) testIndexedScrollInsensitiveUpdateCursorWithForUpdate1(
org.apache.derbyTesting.functionTests.tests.jdbcapi.SURTest)java.sql.SQLException:
ResultSet is not updatable.
< Caused by: org.apache.derby.client.am.SqlException: ResultSet is not
updatable.
< ... 23 more
< 17) testPrimaryKeyUpdate1(
org.apache.derbyTesting.functionTests.tests.jdbcapi.SURTest)java.sql.SQLException:
ResultSet is not updatable.
< Caused by: org.apache.derby.client.am.SqlException: ResultSet is not
updatable.
< ... 22 more
71 del
< ... 22 more
71a71
> ... 23 more
74,91d73
< ... 22 more
< 20) testMultipleKeyUpdates(
org.apache.derbyTesting.functionTests.tests.jdbcapi.SURTest)java.sql.SQLException:
ResultSet is not updatable.
< Caused by: org.apache.derby.client.am.SqlException: ResultSet is not
updatable.
< ... 22 more
< 21) testSecondaryIndexKeyUpdate1(
org.apache.derbyTesting.functionTests.tests.jdbcapi.SURTest)java.sql.SQLException:
ResultSet is not updatable.
< Caused by: org.apache.derby.client.am.SqlException: ResultSet is not
updatable.
< ... 22 more
< 22) testOtherSecondaryKeyUpdate1(
org.apache.derbyTesting.functionTests.tests.jdbcapi.SURTest)java.sql.SQLException:
ResultSet is not updatable.
< Caused by: org.apache.derby.client.am.SqlException: ResultSet is not
updatable.
< ... 22 more
< 23) testScrollablePositionedUpdateWithForUpdate1(
org.apache.derbyTesting.functionTests.tests.jdbcapi.SURTest)java.sql.SQLException:
Execution failed due to a distribution protocol error that caused
deallocation of the conversation.  A PROTOCOL Data Stream Syntax Error was
detected.  Reason: 0x3
< Caused by: org.apache.derby.client.am.DisconnectException: Execution
failed due to a distribution protocol error that caused deallocation of the
conversation.  A PROTOCOL Data Stream Syntax Error was detected.  Reason:
0x3
< ... 22 more
< 24) testScrollInsensitiveConcurUpdatableWithForUpdate1(
org.apache.derbyTesting.functionTests.tests.jdbcapi.SURTest)java.sql.SQLException:
ResultSet is not updatable.
< Caused by: org.apache.derby.client.am.SqlException: ResultSet is not
updatable.
< ... 24 more
< 25) testScrollInsensitiveConcurUpdatableWithForUpdate3(
org.apache.derbyTesting.functionTests.tests.jdbcapi.SURTest)java.sql.SQLException:
ResultSet is not updatable.
< Caused by: org.apache.derby.client.am.SqlException: ResultSet is not
updatable.
92a75,92
> 20) testMultipleKeyUpdates(
org.apache.derbyTesting.functionTests.tests.jdbcapi.SURTest)java.sql.SQLException:
ResultSet is not updatable.
> Caused by: org.apache.derby.client.am.SqlException: ResultSet is not
updatable.
> ... 23 more
> 21) testSecondaryIndexKeyUpdate1(
org.apache.derbyTesting.functionTests.tests.jdbcapi.SURTest)java.sql.SQLException:
ResultSet is not updatable.
> Caused by: org.apache.derby.client.am.SqlException: ResultSet is not
updatable.
> ... 23 more
> 22) testOtherSecondaryKeyUpdate1(
org.apache.derbyTesting.functionTests.tests.jdbcapi.SURTest)java.sql.SQLException:
ResultSet is not updatable.
> Caused by: org.apache.derby.client.am.SqlException: ResultSet is not
updatable.
> ... 23 more
> 23) testScrollablePositionedUpdateWithForUpdate1(
org.apache.derbyTesting.functionTests.tests.jdbcapi.SURTest)java.sql.SQLException:
Execution failed due to a distribution protocol error that caused
deallocation of the conversation.  A PROTOCOL Data Stream Syntax Error was
detected.  Reason: 0x3
> Caused by: org.apache.derby.client.am.DisconnectException: Execution
failed due to a distribution protocol error that caused deallocation of the
conversation.  A PROTOCOL Data Stream Syntax Error was detected.  Reason:
0x3
> ... 23 more
> 24) testScrollInsensitiveConcurUpdatableWithForUpdate1(
org.apache.derbyTesting.functionTests.tests.jdbcapi.SURTest)java.sql.SQLException:
ResultSet is not updatable.
> Caused by: org.apache.derby.client.am.SqlException: ResultSet is not
updatable.
> ... 25 more
> 25) testScrollInsensitiveConcurUpdatableWithForUpdate3(
org.apache.derbyTesting.functionTests.tests.jdbcapi.SURTest)java.sql.SQLException:
ResultSet is not updatable.
> Caused by: org.apache.derby.client.am.SqlException: ResultSet is not
updatable.
> ... 24 more
94a95,100
> ... 25 more
> 27) testScrollInsensitiveConcurUpdatableWithoutForUpdate2(
org.apache.derbyTesting.functionTests.tests.jdbcapi.SURTest)java.sql.SQLException:
ResultSet is not updatable.
> Caused by: org.apache.derby.client.am.SqlException: ResultSet is not
updatable.
> ... 25 more
> 28) testScrollInsensitiveConcurUpdatableWithoutForUpdate3(
org.apache.derbyTesting.functionTests.tests.jdbcapi.SURTest)java.sql.SQLException:
ResultSet is not updatable.
> Caused by: org.apache.derby.client.am.SqlException: ResultSet is not
updatable.
96,101d101
< 27) testScrollInsensitiveConcurUpdatableWithoutForUpdate2(
org.apache.derbyTesting.functionTests.tests.jdbcapi.SURTest)java.sql.SQLException:
ResultSet is not updatable.
< Caused by: org.apache.derby.client.am.SqlException: ResultSet is not
updatable.
< ... 24 more
< 28) testScrollInsensitiveConcurUpdatableWithoutForUpdate3(
org.apache.derbyTesting.functionTests.tests.jdbcapi.SURTest)java.sql.SQLException:
ResultSet is not updatable.
< Caused by: org.apache.derby.client.am.SqlException: ResultSet is not
updatable.
< ... 23 more
103a104,109
> ... 24 more
> 30) testIndexedScrollInsensitiveUpdateCursorWithForUpdate1(
org.apache.derbyTesting.functionTests.tests.jdbcapi.SURTest)java.sql.SQLException:
ResultSet is not updatable.
> Caused by: org.apache.derby.client.am.SqlException: ResultSet is not
updatable.
> ... 24 more
> 31) testPrimaryKeyUpdate1(
org.apache.derbyTesting.functionTests.tests.jdbcapi.SURTest)java.sql.SQLException:
ResultSet is not updatable.
> Caused by: org.apache.derby.client.am.SqlException: ResultSet is not
updatable.
105,110d110
< 30) testIndexedScrollInsensitiveUpdateCursorWithForUpdate1(
org.apache.derbyTesting.functionTests.tests.jdbcapi.SURTest)java.sql.SQLException:
ResultSet is not updatable.
< Caused by: org.apache.derby.client.am.SqlException: ResultSet is not
updatable.
< ... 23 more
< 31) testPrimaryKeyUpdate1(
org.apache.derbyTesting.functionTests.tests.jdbcapi.SURTest)java.sql.SQLException:
ResultSet is not updatable.
< Caused by: org.apache.derby.client.am.SqlException: ResultSet is not
updatable.
< ... 22 more
113 del
< ... 22 more
113a113
> ... 23 more
116,133d115
< ... 22 more
< 34) testMultipleKeyUpdates(
org.apache.derbyTesting.functionTests.tests.jdbcapi.SURTest)java.sql.SQLException:
ResultSet is not updatable.
< Caused by: org.apache.derby.client.am.SqlException: ResultSet is not
updatable.
< ... 22 more
< 35) testSecondaryIndexKeyUpdate1(
org.apache.derbyTesting.functionTests.tests.jdbcapi.SURTest)java.sql.SQLException:
ResultSet is not updatable.
< Caused by: org.apache.derby.client.am.SqlException: ResultSet is not
updatable.
< ... 22 more
< 36) testOtherSecondaryKeyUpdate1(
org.apache.derbyTesting.functionTests.tests.jdbcapi.SURTest)java.sql.SQLException:
ResultSet is not updatable.
< Caused by: org.apache.derby.client.am.SqlException: ResultSet is not
updatable.
< ... 22 more
< 37) testScrollablePositionedUpdateWithForUpdate1(
org.apache.derbyTesting.functionTests.tests.jdbcapi.SURTest)java.sql.SQLException:
Execution failed due to a distribution protocol error that caused
deallocation of the conversation.  A PROTOCOL Data Stream Syntax Error was
detected.  Reason: 0x3
< Caused by: org.apache.derby.client.am.DisconnectException: Execution
failed due to a distribution protocol error that caused deallocation of the
conversation.  A PROTOCOL Data Stream Syntax Error was detected.  Reason:
0x3
< ... 22 more
< 38) testScrollInsensitiveConcurUpdatableWithForUpdate1(
org.apache.derbyTesting.functionTests.tests.jdbcapi.SURTest)java.sql.SQLException:
ResultSet is not updatable.
< Caused by: org.apache.derby.client.am.SqlException: ResultSet is not
updatable.
< ... 24 more
< 39) testScrollInsensitiveConcurUpdatableWithForUpdate3(
org.apache.derbyTesting.functionTests.tests.jdbcapi.SURTest)java.sql.SQLException:
ResultSet is not updatable.
< Caused by: org.apache.derby.client.am.SqlException: ResultSet is not
updatable.
134a117,134
> 34) testMultipleKeyUpdates(
org.apache.derbyTesting.functionTests.tests.jdbcapi.SURTest)java.sql.SQLException:
ResultSet is not updatable.
> Caused by: org.apache.derby.client.am.SqlException: ResultSet is not
updatable.
> ... 23 more
> 35) testSecondaryIndexKeyUpdate1(
org.apache.derbyTesting.functionTests.tests.jdbcapi.SURTest)java.sql.SQLException:
ResultSet is not updatable.
> Caused by: org.apache.derby.client.am.SqlException: ResultSet is not
updatable.
> ... 23 more
> 36) testOtherSecondaryKeyUpdate1(
org.apache.derbyTesting.functionTests.tests.jdbcapi.SURTest)java.sql.SQLException:
ResultSet is not updatable.
> Caused by: org.apache.derby.client.am.SqlException: ResultSet is not
updatable.
> ... 23 more
> 37) testScrollablePositionedUpdateWithForUpdate1(
org.apache.derbyTesting.functionTests.tests.jdbcapi.SURTest)java.sql.SQLException:
Execution failed due to a distribution protocol error that caused
deallocation of the conversation.  A PROTOCOL Data Stream Syntax Error was
detected.  Reason: 0x3
> Caused by: org.apache.derby.client.am.DisconnectException: Execution
failed due to a distribution protocol error that caused deallocation of the
conversation.  A PROTOCOL Data Stream Syntax Error was detected.  Reason:
0x3
> ... 23 more
> 38) testScrollInsensitiveConcurUpdatableWithForUpdate1(
org.apache.derbyTesting.functionTests.tests.jdbcapi.SURTest)java.sql.SQLException:
ResultSet is not updatable.
> Caused by: org.apache.derby.client.am.SqlException: ResultSet is not
updatable.
> ... 25 more
> 39) testScrollInsensitiveConcurUpdatableWithForUpdate3(
org.apache.derbyTesting.functionTests.tests.jdbcapi.SURTest)java.sql.SQLException:
ResultSet is not updatable.
> Caused by: org.apache.derby.client.am.SqlException: ResultSet is not
updatable.
> ... 24 more
136a137,142
> ... 25 more
> 41) testScrollInsensitiveConcurUpdatableWithoutForUpdate2(
org.apache.derbyTesting.functionTests.tests.jdbcapi.SURTest)java.sql.SQLException:
ResultSet is not updatable.
> Caused by: org.apache.derby.client.am.SqlException: ResultSet is not
updatable.
> ... 25 more
> 42) testScrollInsensitiveConcurUpdatableWithoutForUpdate3(
org.apache.derbyTesting.functionTests.tests.jdbcapi.SURTest)java.sql.SQLException:
ResultSet is not updatable.
> Caused by: org.apache.derby.client.am.SqlException: ResultSet is not
updatable.
138,143d143
< 41) testScrollInsensitiveConcurUpdatableWithoutForUpdate2(
org.apache.derbyTesting.functionTests.tests.jdbcapi.SURTest)java.sql.SQLException:
ResultSet is not updatable.
< Caused by: org.apache.derby.client.am.SqlException: ResultSet is not
updatable.
< ... 24 more
< 42) testScrollInsensitiveConcurUpdatableWithoutForUpdate3(
org.apache.derbyTesting.functionTests.tests.jdbcapi.SURTest)java.sql.SQLException:
ResultSet is not updatable.
< Caused by: org.apache.derby.client.am.SqlException: ResultSet is not
updatable.
< ... 23 more
145a146,151
> ... 24 more
> 44) testIndexedScrollInsensitiveUpdateCursorWithForUpdate1(
org.apache.derbyTesting.functionTests.tests.jdbcapi.SURTest)java.sql.SQLException:
ResultSet is not updatable.
> Caused by: org.apache.derby.client.am.SqlException: ResultSet is not
updatable.
> ... 24 more
> 45) testPrimaryKeyUpdate1(
org.apache.derbyTesting.functionTests.tests.jdbcapi.SURTest)java.sql.SQLException:
ResultSet is not updatable.
> Caused by: org.apache.derby.client.am.SqlException: ResultSet is not
updatable.
147,152d152
< 44) testIndexedScrollInsensitiveUpdateCursorWithForUpdate1(
org.apache.derbyTesting.functionTests.tests.jdbcapi.SURTest)java.sql.SQLException:
ResultSet is not updatable.
< Caused by: org.apache.derby.client.am.SqlException: ResultSet is not
updatable.
< ... 23 more
< 45) testPrimaryKeyUpdate1(
org.apache.derbyTesting.functionTests.tests.jdbcapi.SURTest)java.sql.SQLException:
ResultSet is not updatable.
< Caused by: org.apache.derby.client.am.SqlException: ResultSet is not
updatable.
< ... 22 more
155 del
< ... 22 more
155a155
> ... 23 more
158,175d157
< ... 22 more
< 48) testMultipleKeyUpdates(
org.apache.derbyTesting.functionTests.tests.jdbcapi.SURTest)java.sql.SQLException:
ResultSet is not updatable.
< Caused by: org.apache.derby.client.am.SqlException: ResultSet is not
updatable.
< ... 22 more
< 49) testSecondaryIndexKeyUpdate1(
org.apache.derbyTesting.functionTests.tests.jdbcapi.SURTest)java.sql.SQLException:
ResultSet is not updatable.
< Caused by: org.apache.derby.client.am.SqlException: ResultSet is not
updatable.
< ... 22 more
< 50) testOtherSecondaryKeyUpdate1(
org.apache.derbyTesting.functionTests.tests.jdbcapi.SURTest)java.sql.SQLException:
ResultSet is not updatable.
< Caused by: org.apache.derby.client.am.SqlException: ResultSet is not
updatable.
< ... 22 more
< 51) testScrollablePositionedUpdateWithForUpdate1(
org.apache.derbyTesting.functionTests.tests.jdbcapi.SURTest)java.sql.SQLException:
Execution failed due to a distribution protocol error that caused
deallocation of the conversation.  A PROTOCOL Data Stream Syntax Error was
detected.  Reason: 0x3
< Caused by: org.apache.derby.client.am.DisconnectException: Execution
failed due to a distribution protocol error that caused deallocation of the
conversation.  A PROTOCOL Data Stream Syntax Error was detected.  Reason:
0x3
< ... 22 more
< 52) testScrollInsensitiveConcurUpdatableWithForUpdate1(
org.apache.derbyTesting.functionTests.tests.jdbcapi.SURTest)java.sql.SQLException:
ResultSet is not updatable.
< Caused by: org.apache.derby.client.am.SqlException: ResultSet is not
updatable.
< ... 24 more
< 53) testScrollInsensitiveConcurUpdatableWithForUpdate3(
org.apache.derbyTesting.functionTests.tests.jdbcapi.SURTest)java.sql.SQLException:
ResultSet is not updatable.
< Caused by: org.apache.derby.client.am.SqlException: ResultSet is not
updatable.
176a159,176
> 48) testMultipleKeyUpdates(
org.apache.derbyTesting.functionTests.tests.jdbcapi.SURTest)java.sql.SQLException:
ResultSet is not updatable.
> Caused by: org.apache.derby.client.am.SqlException: ResultSet is not
updatable.
> ... 23 more
> 49) testSecondaryIndexKeyUpdate1(
org.apache.derbyTesting.functionTests.tests.jdbcapi.SURTest)java.sql.SQLException:
ResultSet is not updatable.
> Caused by: org.apache.derby.client.am.SqlException: ResultSet is not
updatable.
> ... 23 more
> 50) testOtherSecondaryKeyUpdate1(
org.apache.derbyTesting.functionTests.tests.jdbcapi.SURTest)java.sql.SQLException:
ResultSet is not updatable.
> Caused by: org.apache.derby.client.am.SqlException: ResultSet is not
updatable.
> ... 23 more
> 51) testScrollablePositionedUpdateWithForUpdate1(
org.apache.derbyTesting.functionTests.tests.jdbcapi.SURTest)java.sql.SQLException:
Execution failed due to a distribution protocol error that caused
deallocation of the conversation.  A PROTOCOL Data Stream Syntax Error was
detected.  Reason: 0x3
> Caused by: org.apache.derby.client.am.DisconnectException: Execution
failed due to a distribution protocol error that caused deallocation of the
conversation.  A PROTOCOL Data Stream Syntax Error was detected.  Reason:
0x3
> ... 23 more
> 52) testScrollInsensitiveConcurUpdatableWithForUpdate1(
org.apache.derbyTesting.functionTests.tests.jdbcapi.SURTest)java.sql.SQLException:
ResultSet is not updatable.
> Caused by: org.apache.derby.client.am.SqlException: ResultSet is not
updatable.
> ... 25 more
> 53) testScrollInsensitiveConcurUpdatableWithForUpdate3(
org.apache.derbyTesting.functionTests.tests.jdbcapi.SURTest)java.sql.SQLException:
ResultSet is not updatable.
> Caused by: org.apache.derby.client.am.SqlException: ResultSet is not
updatable.
> ... 24 more
178a179,184
> ... 25 more
> 55) testScrollInsensitiveConcurUpdatableWithoutForUpdate2(
org.apache.derbyTesting.functionTests.tests.jdbcapi.SURTest)java.sql.SQLException:
ResultSet is not updatable.
> Caused by: org.apache.derby.client.am.SqlException: ResultSet is not
updatable.
> ... 25 more
> 56) testScrollInsensitiveConcurUpdatableWithoutForUpdate3(
org.apache.derbyTesting.functionTests.tests.jdbcapi.SURTest)java.sql.SQLException:
ResultSet is not updatable.
> Caused by: org.apache.derby.client.am.SqlException: ResultSet is not
updatable.
180,185d185
< 55) testScrollInsensitiveConcurUpdatableWithoutForUpdate2(
org.apache.derbyTesting.functionTests.tests.jdbcapi.SURTest)java.sql.SQLException:
ResultSet is not updatable.
< Caused by: org.apache.derby.client.am.SqlException: ResultSet is not
updatable.
< ... 24 more
< 56) testScrollInsensitiveConcurUpdatableWithoutForUpdate3(
org.apache.derbyTesting.functionTests.tests.jdbcapi.SURTest)java.sql.SQLException:
ResultSet is not updatable.
< Caused by: org.apache.derby.client.am.SqlException: ResultSet is not
updatable.
< ... 23 more
Test Failed.
*** End:   SURTest jdk1.4.2 DerbyNetClient
derbynetclientmats:derbynetclientmats 2006-02-16 04:55:56 ***
********* Diff file
derbyall/derbynetclientmats/DerbyNetClient/derbynetmats/jdbc20/batchUpdate.diff
*** Start: batchUpdate jdk1.4.2 DerbyNetClient derbynetmats:jdbc20
2006-02-16 06:53:37 ***
Test skipped: listed in DerbyNetClient.exclude file, skipping test:
jdbcapi/batchUpdate.java
*** End:   batchUpdate jdk1.4.2 DerbyNetClient derbynetmats:jdbc20
2006-02-16 06:53:37 ***
********* Diff file
derbyall/derbynetclientmats/DerbyNetClient/derbynetmats/jdbc20/dataSourceReference.diff
*** Start: dataSourceReference jdk1.4.2 DerbyNetClient derbynetmats:jdbc20
2006-02-16 06:56:10 ***
Test skipped: listed in DerbyNetClient.exclude file, skipping test:
jdbcapi/dataSourceReference.java
*** End:   dataSourceReference jdk1.4.2 DerbyNetClient derbynetmats:jdbc20
2006-02-16 06:56:10 ***
********* Diff file
derbyall/derbynetclientmats/DerbyNetClient/derbynetmats/jdbc20/statementJdbc20.diff
*** Start: statementJdbc20 jdk1.4.2 DerbyNetClient derbynetmats:jdbc20
2006-02-16 06:54:14 ***
Test skipped: listed in DerbyNetClient.exclude file, skipping test:
jdbcapi/statementJdbc20.java
*** End:   statementJdbc20 jdk1.4.2 DerbyNetClient derbynetmats:jdbc20
2006-02-16 06:54:14 ***
********* Diff file
derbyall/derbynetclientmats/DerbyNetClient/derbynetmats/jdbcapi/SURTest.diff
*** Start: SURTest jdk1.4.2 DerbyNetClient derbynetmats:jdbcapi 2006-02-16
06:50:39 ***
19a20,25
> ... 24 more
> 2) testIndexedScrollInsensitiveUpdateCursorWithForUpdate1(
org.apache.derbyTesting.functionTests.tests.jdbcapi.SURTest)java.sql.SQLException:
ResultSet is not updatable.
> Caused by: org.apache.derby.client.am.SqlException: ResultSet is not
updatable.
> ... 24 more
> 3) testPrimaryKeyUpdate1(
org.apache.derbyTesting.functionTests.tests.jdbcapi.SURTest)java.sql.SQLException:
ResultSet is not updatable.
> Caused by: org.apache.derby.client.am.SqlException: ResultSet is not
updatable.
21,26d26
< 2) testIndexedScrollInsensitiveUpdateCursorWithForUpdate1(
org.apache.derbyTesting.functionTests.tests.jdbcapi.SURTest)java.sql.SQLException:
ResultSet is not updatable.
< Caused by: org.apache.derby.client.am.SqlException: ResultSet is not
updatable.
< ... 23 more
< 3) testPrimaryKeyUpdate1(
org.apache.derbyTesting.functionTests.tests.jdbcapi.SURTest)java.sql.SQLException:
ResultSet is not updatable.
< Caused by: org.apache.derby.client.am.SqlException: ResultSet is not
updatable.
< ... 22 more
29 del
< ... 22 more
29a29
> ... 23 more
32,49d31
< ... 22 more
< 6) testMultipleKeyUpdates(
org.apache.derbyTesting.functionTests.tests.jdbcapi.SURTest)java.sql.SQLException:
ResultSet is not updatable.
< Caused by: org.apache.derby.client.am.SqlException: ResultSet is not
updatable.
< ... 22 more
< 7) testSecondaryIndexKeyUpdate1(
org.apache.derbyTesting.functionTests.tests.jdbcapi.SURTest)java.sql.SQLException:
ResultSet is not updatable.
< Caused by: org.apache.derby.client.am.SqlException: ResultSet is not
updatable.
< ... 22 more
< 8) testOtherSecondaryKeyUpdate1(
org.apache.derbyTesting.functionTests.tests.jdbcapi.SURTest)java.sql.SQLException:
ResultSet is not updatable.
< Caused by: org.apache.derby.client.am.SqlException: ResultSet is not
updatable.
< ... 22 more
< 9) testScrollablePositionedUpdateWithForUpdate1(
org.apache.derbyTesting.functionTests.tests.jdbcapi.SURTest)java.sql.SQLException:
Execution failed due to a distribution protocol error that caused
deallocation of the conversation.  A PROTOCOL Data Stream Syntax Error was
detected.  Reason: 0x3
< Caused by: org.apache.derby.client.am.DisconnectException: Execution
failed due to a distribution protocol error that caused deallocation of the
conversation.  A PROTOCOL Data Stream Syntax Error was detected.  Reason:
0x3
< ... 22 more
< 10) testScrollInsensitiveConcurUpdatableWithForUpdate1(
org.apache.derbyTesting.functionTests.tests.jdbcapi.SURTest)java.sql.SQLException:
ResultSet is not updatable.
< Caused by: org.apache.derby.client.am.SqlException: ResultSet is not
updatable.
< ... 24 more
< 11) testScrollInsensitiveConcurUpdatableWithForUpdate3(
org.apache.derbyTesting.functionTests.tests.jdbcapi.SURTest)java.sql.SQLException:
ResultSet is not updatable.
< Caused by: org.apache.derby.client.am.SqlException: ResultSet is not
updatable.
50a33,50
> 6) testMultipleKeyUpdates(
org.apache.derbyTesting.functionTests.tests.jdbcapi.SURTest)java.sql.SQLException:
ResultSet is not updatable.
> Caused by: org.apache.derby.client.am.SqlException: ResultSet is not
updatable.
> ... 23 more
> 7) testSecondaryIndexKeyUpdate1(
org.apache.derbyTesting.functionTests.tests.jdbcapi.SURTest)java.sql.SQLException:
ResultSet is not updatable.
> Caused by: org.apache.derby.client.am.SqlException: ResultSet is not
updatable.
> ... 23 more
> 8) testOtherSecondaryKeyUpdate1(
org.apache.derbyTesting.functionTests.tests.jdbcapi.SURTest)java.sql.SQLException:
ResultSet is not updatable.
> Caused by: org.apache.derby.client.am.SqlException: ResultSet is not
updatable.
> ... 23 more
> 9) testScrollablePositionedUpdateWithForUpdate1(
org.apache.derbyTesting.functionTests.tests.jdbcapi.SURTest)java.sql.SQLException:
Execution failed due to a distribution protocol error that caused
deallocation of the conversation.  A PROTOCOL Data Stream Syntax Error was
detected.  Reason: 0x3
> Caused by: org.apache.derby.client.am.DisconnectException: Execution
failed due to a distribution protocol error that caused deallocation of the
conversation.  A PROTOCOL Data Stream Syntax Error was detected.  Reason:
0x3
> ... 23 more
> 10) testScrollInsensitiveConcurUpdatableWithForUpdate1(
org.apache.derbyTesting.functionTests.tests.jdbcapi.SURTest)java.sql.SQLException:
ResultSet is not updatable.
> Caused by: org.apache.derby.client.am.SqlException: ResultSet is not
updatable.
> ... 25 more
> 11) testScrollInsensitiveConcurUpdatableWithForUpdate3(
org.apache.derbyTesting.functionTests.tests.jdbcapi.SURTest)java.sql.SQLException:
ResultSet is not updatable.
> Caused by: org.apache.derby.client.am.SqlException: ResultSet is not
updatable.
> ... 24 more
52a53,58
> ... 25 more
> 13) testScrollInsensitiveConcurUpdatableWithoutForUpdate2(
org.apache.derbyTesting.functionTests.tests.jdbcapi.SURTest)java.sql.SQLException:
ResultSet is not updatable.
> Caused by: org.apache.derby.client.am.SqlException: ResultSet is not
updatable.
> ... 25 more
> 14) testScrollInsensitiveConcurUpdatableWithoutForUpdate3(
org.apache.derbyTesting.functionTests.tests.jdbcapi.SURTest)java.sql.SQLException:
ResultSet is not updatable.
> Caused by: org.apache.derby.client.am.SqlException: ResultSet is not
updatable.
54,59d59
< 13) testScrollInsensitiveConcurUpdatableWithoutForUpdate2(
org.apache.derbyTesting.functionTests.tests.jdbcapi.SURTest)java.sql.SQLException:
ResultSet is not updatable.
< Caused by: org.apache.derby.client.am.SqlException: ResultSet is not
updatable.
< ... 24 more
< 14) testScrollInsensitiveConcurUpdatableWithoutForUpdate3(
org.apache.derbyTesting.functionTests.tests.jdbcapi.SURTest)java.sql.SQLException:
ResultSet is not updatable.
< Caused by: org.apache.derby.client.am.SqlException: ResultSet is not
updatable.
< ... 23 more
61a62,67
> ... 24 more
> 16) testIndexedScrollInsensitiveUpdateCursorWithForUpdate1(
org.apache.derbyTesting.functionTests.tests.jdbcapi.SURTest)java.sql.SQLException:
ResultSet is not updatable.
> Caused by: org.apache.derby.client.am.SqlException: ResultSet is not
updatable.
> ... 24 more
> 17) testPrimaryKeyUpdate1(
org.apache.derbyTesting.functionTests.tests.jdbcapi.SURTest)java.sql.SQLException:
ResultSet is not updatable.
> Caused by: org.apache.derby.client.am.SqlException: ResultSet is not
updatable.
63,68d68
< 16) testIndexedScrollInsensitiveUpdateCursorWithForUpdate1(
org.apache.derbyTesting.functionTests.tests.jdbcapi.SURTest)java.sql.SQLException:
ResultSet is not updatable.
< Caused by: org.apache.derby.client.am.SqlException: ResultSet is not
updatable.
< ... 23 more
< 17) testPrimaryKeyUpdate1(
org.apache.derbyTesting.functionTests.tests.jdbcapi.SURTest)java.sql.SQLException:
ResultSet is not updatable.
< Caused by: org.apache.derby.client.am.SqlException: ResultSet is not
updatable.
< ... 22 more
71 del
< ... 22 more
71a71
> ... 23 more
74,91d73
< ... 22 more
< 20) testMultipleKeyUpdates(
org.apache.derbyTesting.functionTests.tests.jdbcapi.SURTest)java.sql.SQLException:
ResultSet is not updatable.
< Caused by: org.apache.derby.client.am.SqlException: ResultSet is not
updatable.
< ... 22 more
< 21) testSecondaryIndexKeyUpdate1(
org.apache.derbyTesting.functionTests.tests.jdbcapi.SURTest)java.sql.SQLException:
ResultSet is not updatable.
< Caused by: org.apache.derby.client.am.SqlException: ResultSet is not
updatable.
< ... 22 more
< 22) testOtherSecondaryKeyUpdate1(
org.apache.derbyTesting.functionTests.tests.jdbcapi.SURTest)java.sql.SQLException:
ResultSet is not updatable.
< Caused by: org.apache.derby.client.am.SqlException: ResultSet is not
updatable.
< ... 22 more
< 23) testScrollablePositionedUpdateWithForUpdate1(
org.apache.derbyTesting.functionTests.tests.jdbcapi.SURTest)java.sql.SQLException:
Execution failed due to a distribution protocol error that caused
deallocation of the conversation.  A PROTOCOL Data Stream Syntax Error was
detected.  Reason: 0x3
< Caused by: org.apache.derby.client.am.DisconnectException: Execution
failed due to a distribution protocol error that caused deallocation of the
conversation.  A PROTOCOL Data Stream Syntax Error was detected.  Reason:
0x3
< ... 22 more
< 24) testScrollInsensitiveConcurUpdatableWithForUpdate1(
org.apache.derbyTesting.functionTests.tests.jdbcapi.SURTest)java.sql.SQLException:
ResultSet is not updatable.
< Caused by: org.apache.derby.client.am.SqlException: ResultSet is not
updatable.
< ... 24 more
< 25) testScrollInsensitiveConcurUpdatableWithForUpdate3(
org.apache.derbyTesting.functionTests.tests.jdbcapi.SURTest)java.sql.SQLException:
ResultSet is not updatable.
< Caused by: org.apache.derby.client.am.SqlException: ResultSet is not
updatable.
92a75,92
> 20) testMultipleKeyUpdates(
org.apache.derbyTesting.functionTests.tests.jdbcapi.SURTest)java.sql.SQLException:
ResultSet is not updatable.
> Caused by: org.apache.derby.client.am.SqlException: ResultSet is not
updatable.
> ... 23 more
> 21) testSecondaryIndexKeyUpdate1(
org.apache.derbyTesting.functionTests.tests.jdbcapi.SURTest)java.sql.SQLException:
ResultSet is not updatable.
> Caused by: org.apache.derby.client.am.SqlException: ResultSet is not
updatable.
> ... 23 more
> 22) testOtherSecondaryKeyUpdate1(
org.apache.derbyTesting.functionTests.tests.jdbcapi.SURTest)java.sql.SQLException:
ResultSet is not updatable.
> Caused by: org.apache.derby.client.am.SqlException: ResultSet is not
updatable.
> ... 23 more
> 23) testScrollablePositionedUpdateWithForUpdate1(
org.apache.derbyTesting.functionTests.tests.jdbcapi.SURTest)java.sql.SQLException:
Execution failed due to a distribution protocol error that caused
deallocation of the conversation.  A PROTOCOL Data Stream Syntax Error was
detected.  Reason: 0x3
> Caused by: org.apache.derby.client.am.DisconnectException: Execution
failed due to a distribution protocol error that caused deallocation of the
conversation.  A PROTOCOL Data Stream Syntax Error was detected.  Reason:
0x3
> ... 23 more
> 24) testScrollInsensitiveConcurUpdatableWithForUpdate1(
org.apache.derbyTesting.functionTests.tests.jdbcapi.SURTest)java.sql.SQLException:
ResultSet is not updatable.
> Caused by: org.apache.derby.client.am.SqlException: ResultSet is not
updatable.
> ... 25 more
> 25) testScrollInsensitiveConcurUpdatableWithForUpdate3(
org.apache.derbyTesting.functionTests.tests.jdbcapi.SURTest)java.sql.SQLException:
ResultSet is not updatable.
> Caused by: org.apache.derby.client.am.SqlException: ResultSet is not
updatable.
> ... 24 more
94a95,100
> ... 25 more
> 27) testScrollInsensitiveConcurUpdatableWithoutForUpdate2(
org.apache.derbyTesting.functionTests.tests.jdbcapi.SURTest)java.sql.SQLException:
ResultSet is not updatable.
> Caused by: org.apache.derby.client.am.SqlException: ResultSet is not
updatable.
> ... 25 more
> 28) testScrollInsensitiveConcurUpdatableWithoutForUpdate3(
org.apache.derbyTesting.functionTests.tests.jdbcapi.SURTest)java.sql.SQLException:
ResultSet is not updatable.
> Caused by: org.apache.derby.client.am.SqlException: ResultSet is not
updatable.
96,101d101
< 27) testScrollInsensitiveConcurUpdatableWithoutForUpdate2(
org.apache.derbyTesting.functionTests.tests.jdbcapi.SURTest)java.sql.SQLException:
ResultSet is not updatable.
< Caused by: org.apache.derby.client.am.SqlException: ResultSet is not
updatable.
< ... 24 more
< 28) testScrollInsensitiveConcurUpdatableWithoutForUpdate3(
org.apache.derbyTesting.functionTests.tests.jdbcapi.SURTest)java.sql.SQLException:
ResultSet is not updatable.
< Caused by: org.apache.derby.client.am.SqlException: ResultSet is not
updatable.
< ... 23 more
103a104,109
> ... 24 more
> 30) testIndexedScrollInsensitiveUpdateCursorWithForUpdate1(
org.apache.derbyTesting.functionTests.tests.jdbcapi.SURTest)java.sql.SQLException:
ResultSet is not updatable.
> Caused by: org.apache.derby.client.am.SqlException: ResultSet is not
updatable.
> ... 24 more
> 31) testPrimaryKeyUpdate1(
org.apache.derbyTesting.functionTests.tests.jdbcapi.SURTest)java.sql.SQLException:
ResultSet is not updatable.
> Caused by: org.apache.derby.client.am.SqlException: ResultSet is not
updatable.
105,110d110
< 30) testIndexedScrollInsensitiveUpdateCursorWithForUpdate1(
org.apache.derbyTesting.functionTests.tests.jdbcapi.SURTest)java.sql.SQLException:
ResultSet is not updatable.
< Caused by: org.apache.derby.client.am.SqlException: ResultSet is not
updatable.
< ... 23 more
< 31) testPrimaryKeyUpdate1(
org.apache.derbyTesting.functionTests.tests.jdbcapi.SURTest)java.sql.SQLException:
ResultSet is not updatable.
< Caused by: org.apache.derby.client.am.SqlException: ResultSet is not
updatable.
< ... 22 more
113 del
< ... 22 more
113a113
> ... 23 more
116,133d115
< ... 22 more
< 34) testMultipleKeyUpdates(
org.apache.derbyTesting.functionTests.tests.jdbcapi.SURTest)java.sql.SQLException:
ResultSet is not updatable.
< Caused by: org.apache.derby.client.am.SqlException: ResultSet is not
updatable.
< ... 22 more
< 35) testSecondaryIndexKeyUpdate1(
org.apache.derbyTesting.functionTests.tests.jdbcapi.SURTest)java.sql.SQLException:
ResultSet is not updatable.
< Caused by: org.apache.derby.client.am.SqlException: ResultSet is not
updatable.
< ... 22 more
< 36) testOtherSecondaryKeyUpdate1(
org.apache.derbyTesting.functionTests.tests.jdbcapi.SURTest)java.sql.SQLException:
ResultSet is not updatable.
< Caused by: org.apache.derby.client.am.SqlException: ResultSet is not
updatable.
< ... 22 more
< 37) testScrollablePositionedUpdateWithForUpdate1(
org.apache.derbyTesting.functionTests.tests.jdbcapi.SURTest)java.sql.SQLException:
Execution failed due to a distribution protocol error that caused
deallocation of the conversation.  A PROTOCOL Data Stream Syntax Error was
detected.  Reason: 0x3
< Caused by: org.apache.derby.client.am.DisconnectException: Execution
failed due to a distribution protocol error that caused deallocation of the
conversation.  A PROTOCOL Data Stream Syntax Error was detected.  Reason:
0x3
< ... 22 more
< 38) testScrollInsensitiveConcurUpdatableWithForUpdate1(
org.apache.derbyTesting.functionTests.tests.jdbcapi.SURTest)java.sql.SQLException:
ResultSet is not updatable.
< Caused by: org.apache.derby.client.am.SqlException: ResultSet is not
updatable.
< ... 24 more
< 39) testScrollInsensitiveConcurUpdatableWithForUpdate3(
org.apache.derbyTesting.functionTests.tests.jdbcapi.SURTest)java.sql.SQLException:
ResultSet is not updatable.
< Caused by: org.apache.derby.client.am.SqlException: ResultSet is not
updatable.
134a117,134
> 34) testMultipleKeyUpdates(
org.apache.derbyTesting.functionTests.tests.jdbcapi.SURTest)java.sql.SQLException:
ResultSet is not updatable.
> Caused by: org.apache.derby.client.am.SqlException: ResultSet is not
updatable.
> ... 23 more
> 35) testSecondaryIndexKeyUpdate1(
org.apache.derbyTesting.functionTests.tests.jdbcapi.SURTest)java.sql.SQLException:
ResultSet is not updatable.
> Caused by: org.apache.derby.client.am.SqlException: ResultSet is not
updatable.
> ... 23 more
> 36) testOtherSecondaryKeyUpdate1(
org.apache.derbyTesting.functionTests.tests.jdbcapi.SURTest)java.sql.SQLException:
ResultSet is not updatable.
> Caused by: org.apache.derby.client.am.SqlException: ResultSet is not
updatable.
> ... 23 more
> 37) testScrollablePositionedUpdateWithForUpdate1(
org.apache.derbyTesting.functionTests.tests.jdbcapi.SURTest)java.sql.SQLException:
Execution failed due to a distribution protocol error that caused
deallocation of the conversation.  A PROTOCOL Data Stream Syntax Error was
detected.  Reason: 0x3
> Caused by: org.apache.derby.client.am.DisconnectException: Execution
failed due to a distribution protocol error that caused deallocation of the
conversation.  A PROTOCOL Data Stream Syntax Error was detected.  Reason:
0x3
> ... 23 more
> 38) testScrollInsensitiveConcurUpdatableWithForUpdate1(
org.apache.derbyTesting.functionTests.tests.jdbcapi.SURTest)java.sql.SQLException:
ResultSet is not updatable.
> Caused by: org.apache.derby.client.am.SqlException: ResultSet is not
updatable.
> ... 25 more
> 39) testScrollInsensitiveConcurUpdatableWithForUpdate3(
org.apache.derbyTesting.functionTests.tests.jdbcapi.SURTest)java.sql.SQLException:
ResultSet is not updatable.
> Caused by: org.apache.derby.client.am.SqlException: ResultSet is not
updatable.
> ... 24 more
136a137,142
> ... 25 more
> 41) testScrollInsensitiveConcurUpdatableWithoutForUpdate2(
org.apache.derbyTesting.functionTests.tests.jdbcapi.SURTest)java.sql.SQLException:
ResultSet is not updatable.
> Caused by: org.apache.derby.client.am.SqlException: ResultSet is not
updatable.
> ... 25 more
> 42) testScrollInsensitiveConcurUpdatableWithoutForUpdate3(
org.apache.derbyTesting.functionTests.tests.jdbcapi.SURTest)java.sql.SQLException:
ResultSet is not updatable.
> Caused by: org.apache.derby.client.am.SqlException: ResultSet is not
updatable.
138,143d143
< 41) testScrollInsensitiveConcurUpdatableWithoutForUpdate2(
org.apache.derbyTesting.functionTests.tests.jdbcapi.SURTest)java.sql.SQLException:
ResultSet is not updatable.
< Caused by: org.apache.derby.client.am.SqlException: ResultSet is not
updatable.
< ... 24 more
< 42) testScrollInsensitiveConcurUpdatableWithoutForUpdate3(
org.apache.derbyTesting.functionTests.tests.jdbcapi.SURTest)java.sql.SQLException:
ResultSet is not updatable.
< Caused by: org.apache.derby.client.am.SqlException: ResultSet is not
updatable.
< ... 23 more
145a146,151
> ... 24 more
> 44) testIndexedScrollInsensitiveUpdateCursorWithForUpdate1(
org.apache.derbyTesting.functionTests.tests.jdbcapi.SURTest)java.sql.SQLException:
ResultSet is not updatable.
> Caused by: org.apache.derby.client.am.SqlException: ResultSet is not
updatable.
> ... 24 more
> 45) testPrimaryKeyUpdate1(
org.apache.derbyTesting.functionTests.tests.jdbcapi.SURTest)java.sql.SQLException:
ResultSet is not updatable.
> Caused by: org.apache.derby.client.am.SqlException: ResultSet is not
updatable.
147,152d152
< 44) testIndexedScrollInsensitiveUpdateCursorWithForUpdate1(
org.apache.derbyTesting.functionTests.tests.jdbcapi.SURTest)java.sql.SQLException:
ResultSet is not updatable.
< Caused by: org.apache.derby.client.am.SqlException: ResultSet is not
updatable.
< ... 23 more
< 45) testPrimaryKeyUpdate1(
org.apache.derbyTesting.functionTests.tests.jdbcapi.SURTest)java.sql.SQLException:
ResultSet is not updatable.
< Caused by: org.apache.derby.client.am.SqlException: ResultSet is not
updatable.
< ... 22 more
155 del
< ... 22 more
155a155
> ... 23 more
158,175d157
< ... 22 more
< 48) testMultipleKeyUpdates(
org.apache.derbyTesting.functionTests.tests.jdbcapi.SURTest)java.sql.SQLException:
ResultSet is not updatable.
< Caused by: org.apache.derby.client.am.SqlException: ResultSet is not
updatable.
< ... 22 more
< 49) testSecondaryIndexKeyUpdate1(
org.apache.derbyTesting.functionTests.tests.jdbcapi.SURTest)java.sql.SQLException:
ResultSet is not updatable.
< Caused by: org.apache.derby.client.am.SqlException: ResultSet is not
updatable.
< ... 22 more
< 50) testOtherSecondaryKeyUpdate1(
org.apache.derbyTesting.functionTests.tests.jdbcapi.SURTest)java.sql.SQLException:
ResultSet is not updatable.
< Caused by: org.apache.derby.client.am.SqlException: ResultSet is not
updatable.
< ... 22 more
< 51) testScrollablePositionedUpdateWithForUpdate1(
org.apache.derbyTesting.functionTests.tests.jdbcapi.SURTest)java.sql.SQLException:
Execution failed due to a distribution protocol error that caused
deallocation of the conversation.  A PROTOCOL Data Stream Syntax Error was
detected.  Reason: 0x3
< Caused by: org.apache.derby.client.am.DisconnectException: Execution
failed due to a distribution protocol error that caused deallocation of the
conversation.  A PROTOCOL Data Stream Syntax Error was detected.  Reason:
0x3
< ... 22 more
< 52) testScrollInsensitiveConcurUpdatableWithForUpdate1(
org.apache.derbyTesting.functionTests.tests.jdbcapi.SURTest)java.sql.SQLException:
ResultSet is not updatable.
< Caused by: org.apache.derby.client.am.SqlException: ResultSet is not
updatable.
< ... 24 more
< 53) testScrollInsensitiveConcurUpdatableWithForUpdate3(
org.apache.derbyTesting.functionTests.tests.jdbcapi.SURTest)java.sql.SQLException:
ResultSet is not updatable.
< Caused by: org.apache.derby.client.am.SqlException: ResultSet is not
updatable.
176a159,176
> 48) testMultipleKeyUpdates(
org.apache.derbyTesting.functionTests.tests.jdbcapi.SURTest)java.sql.SQLException:
ResultSet is not updatable.
> Caused by: org.apache.derby.client.am.SqlException: ResultSet is not
updatable.
> ... 23 more
> 49) testSecondaryIndexKeyUpdate1(
org.apache.derbyTesting.functionTests.tests.jdbcapi.SURTest)java.sql.SQLException:
ResultSet is not updatable.
> Caused by: org.apache.derby.client.am.SqlException: ResultSet is not
updatable.
> ... 23 more
> 50) testOtherSecondaryKeyUpdate1(
org.apache.derbyTesting.functionTests.tests.jdbcapi.SURTest)java.sql.SQLException:
ResultSet is not updatable.
> Caused by: org.apache.derby.client.am.SqlException: ResultSet is not
updatable.
> ... 23 more
> 51) testScrollablePositionedUpdateWithForUpdate1(
org.apache.derbyTesting.functionTests.tests.jdbcapi.SURTest)java.sql.SQLException:
Execution failed due to a distribution protocol error that caused
deallocation of the conversation.  A PROTOCOL Data Stream Syntax Error was
detected.  Reason: 0x3
> Caused by: org.apache.derby.client.am.DisconnectException: Execution
failed due to a distribution protocol error that caused deallocation of the
conversation.  A PROTOCOL Data Stream Syntax Error was detected.  Reason:
0x3
> ... 23 more
> 52) testScrollInsensitiveConcurUpdatableWithForUpdate1(
org.apache.derbyTesting.functionTests.tests.jdbcapi.SURTest)java.sql.SQLException:
ResultSet is not updatable.
> Caused by: org.apache.derby.client.am.SqlException: ResultSet is not
updatable.
> ... 25 more
> 53) testScrollInsensitiveConcurUpdatableWithForUpdate3(
org.apache.derbyTesting.functionTests.tests.jdbcapi.SURTest)java.sql.SQLException:
ResultSet is not updatable.
> Caused by: org.apache.derby.client.am.SqlException: ResultSet is not
updatable.
> ... 24 more
178a179,184
> ... 25 more
> 55) testScrollInsensitiveConcurUpdatableWithoutForUpdate2(
org.apache.derbyTesting.functionTests.tests.jdbcapi.SURTest)java.sql.SQLException:
ResultSet is not updatable.
> Caused by: org.apache.derby.client.am.SqlException: ResultSet is not
updatable.
> ... 25 more
> 56) testScrollInsensitiveConcurUpdatableWithoutForUpdate3(
org.apache.derbyTesting.functionTests.tests.jdbcapi.SURTest)java.sql.SQLException:
ResultSet is not updatable.
> Caused by: org.apache.derby.client.am.SqlException: ResultSet is not
updatable.
180,185d185
< 55) testScrollInsensitiveConcurUpdatableWithoutForUpdate2(
org.apache.derbyTesting.functionTests.tests.jdbcapi.SURTest)java.sql.SQLException:
ResultSet is not updatable.
< Caused by: org.apache.derby.client.am.SqlException: ResultSet is not
updatable.
< ... 24 more
< 56) testScrollInsensitiveConcurUpdatableWithoutForUpdate3(
org.apache.derbyTesting.functionTests.tests.jdbcapi.SURTest)java.sql.SQLException:
ResultSet is not updatable.
< Caused by: org.apache.derby.client.am.SqlException: ResultSet is not
updatable.
< ... 23 more



On 2/16/06, Andreas Korneliussen <Andreas.Korneliussen@sun.com> wrote:
>
> Myrna van Lunteren wrote:
> > oy, I get better results after svn update than I got with the patches.
> > I'll check with various jvms now.
> >
>
> Hi,
> I do not expect the tests to pass in j2me, since they use DriverManager.
> I did experiement a bit with using ij.startJBMS() to get the Connection,
> however it just returned null, so I guess it failed somewhere and
> swallowed the excpetion. Maybe the TestUtil class could be used instead
> (I have already used it for getting jdbc url etc)
>
> Andreas
>
>

Mime
View raw message