db-derby-dev mailing list archives

Site index · List index
Message view « Date » · « Thread »
Top « Date » · « Thread »
From Kathey Marsden <kmarsdende...@sbcglobal.net>
Subject build issue with XATestUtil?
Date Sat, 18 Feb 2006 23:11:01 GMT
I am seeing this build issue with XATestUtil.
Is it just me?


compile:
    [javac] Compiling 31 source files to D:\p4\marsden_patch\classes
    [javac]
D:\p4\marsden_patch\opensource\java\testing\org\apache\derbyTesting\functionTests\util\XATestUtil.java:29:
package javax.transaction.xa does not exist
    [javac] import javax.transaction.xa.XAException;
    [javac]                             ^
    [javac]
D:\p4\marsden_patch\opensource\java\testing\org\apache\derbyTesting\functionTests\util\XATestUtil.java:30:
package javax.transaction.xa does not exist
    [javac] import javax.transaction.xa.Xid;
    [javac]                             ^
    [javac]
D:\p4\marsden_patch\opensource\java\testing\org\apache\derbyTesting\functionTests\util\XATestUtil.java:39:
cannot resolve symbol
    [javac] symbol  : class Xid
    [javac] location: class
org.apache.derbyTesting.functionTests.util.XATestUtil
    [javac]     public static Xid getXid(int xid, int b1, int b2) {
    [javac]                   ^
    [javac]
D:\p4\marsden_patch\opensource\java\testing\org\apache\derbyTesting\functionTests\util\XATestUtil.java:48:
cannot resolve symbol
    [javac] symbol  : class XAException
    [javac] location: class
org.apache.derbyTesting.functionTests.util.XATestUtil
    [javac]     public static void dumpXAException(String tag,
XAException xae) {
    [javac]                                                    ^
    [javac]
D:\p4\marsden_patch\opensource\java\testing\org\apache\derbyTesting\functionTests\util\XATestUtil.java:89:
cannot resolve symbol
    [javac] symbol  : class XAException
    [javac] location: class
org.apache.derbyTesting.functionTests.util.XATestUtil
    [javac]     public static String errorCode(XAException e)
    [javac]                                    ^
    [javac]
D:\p4\marsden_patch\opensource\java\testing\org\apache\derbyTesting\functionTests\util\XATestUtil.java:127:
cannot resolve symbol
    [javac] symbol  : class Xid
    [javac] location: class
org.apache.derbyTesting.functionTests.util.utilXid
    [javac] class utilXid implements Xid, Serializable {
    [javac]                          ^
    [javac]
D:\p4\marsden_patch\opensource\java\testing\org\apache\derbyTesting\functionTests\util\XATestUtil.java:94:
cannot resolve symbol
    [javac] symbol  : variable XAException
    [javac] location: class
org.apache.derbyTesting.functionTests.util.XATestUtil
    [javac]         case XAException.XA_HEURCOM : error = "XA_HEURCOM ";
break;
    [javac]              ^
    [javac]
D:\p4\marsden_patch\opensource\java\testing\org\apache\derbyTesting\functionTests\util\XATestUtil.java:95:
cannot resolve symbol
    [javac] symbol  : variable XAException
    [javac] location: class
org.apache.derbyTesting.functionTests.util.XATestUtil
    [javac]         case XAException.XA_HEURHAZ : error = "XA_HEURHAZ";
break;
    [javac]              ^
    [javac]
D:\p4\marsden_patch\opensource\java\testing\org\apache\derbyTesting\functionTests\util\XATestUtil.java:96:
cannot resolve symbol
    [javac] symbol  : variable XAException
    [javac] location: class
org.apache.derbyTesting.functionTests.util.XATestUtil
    [javac]         case XAException.XA_HEURMIX : error = "XA_HEURMIX";
break;
    [javac]              ^
    [javac]
D:\p4\marsden_patch\opensource\java\testing\org\apache\derbyTesting\functionTests\util\XATestUtil.java:97:
cannot resolve symbol
    [javac] symbol  : variable XAException
    [javac] location: class
org.apache.derbyTesting.functionTests.util.XATestUtil
    [javac]         case XAException.XA_HEURRB : error = "XA_HEURRB ";
break;
    [javac]              ^
    [javac]
D:\p4\marsden_patch\opensource\java\testing\org\apache\derbyTesting\functionTests\util\XATestUtil.java:98:
cannot resolve symbol
    [javac] symbol  : variable XAException
    [javac] location: class
org.apache.derbyTesting.functionTests.util.XATestUtil
    [javac]         case XAException.XA_NOMIGRATE : error =
"XA_NOMIGRATE "; break;
    [javac]              ^
    [javac]
D:\p4\marsden_patch\opensource\java\testing\org\apache\derbyTesting\functionTests\util\XATestUtil.java:99:
cannot resolve symbol
    [javac] symbol  : variable XAException
    [javac] location: class
org.apache.derbyTesting.functionTests.util.XATestUtil
    [javac]         case XAException.XA_RBCOMMFAIL : error =
"XA_RBCOMMFAIL "; break;
    [javac]              ^
    [javac]
D:\p4\marsden_patch\opensource\java\testing\org\apache\derbyTesting\functionTests\util\XATestUtil.java:100:
cannot resolve symbol
    [javac] symbol  : variable XAException
    [javac] location: class
org.apache.derbyTesting.functionTests.util.XATestUtil
    [javac]         case XAException.XA_RBDEADLOCK : error =
"XA_RBDEADLOCK "; break;
    [javac]              ^
    [javac]
D:\p4\marsden_patch\opensource\java\testing\org\apache\derbyTesting\functionTests\util\XATestUtil.java:101:
cannot resolve symbol
    [javac] symbol  : variable XAException
    [javac] location: class
org.apache.derbyTesting.functionTests.util.XATestUtil
    [javac]         case XAException.XA_RBINTEGRITY : error =
"XA_RBINTEGRITY "; break;
    [javac]              ^
    [javac]
D:\p4\marsden_patch\opensource\java\testing\org\apache\derbyTesting\functionTests\util\XATestUtil.java:102:
cannot resolve symbol
    [javac] symbol  : variable XAException
    [javac] location: class
org.apache.derbyTesting.functionTests.util.XATestUtil
    [javac]         case XAException.XA_RBOTHER : error = "XA_RBOTHER ";
break;
    [javac]              ^
    [javac]
D:\p4\marsden_patch\opensource\java\testing\org\apache\derbyTesting\functionTests\util\XATestUtil.java:103:
cannot resolve symbol
    [javac] symbol  : variable XAException
    [javac] location: class
org.apache.derbyTesting.functionTests.util.XATestUtil
    [javac]         case XAException.XA_RBPROTO : error = "XA_RBPROTO ";
break;
    [javac]              ^
    [javac]
D:\p4\marsden_patch\opensource\java\testing\org\apache\derbyTesting\functionTests\util\XATestUtil.java:104:
cannot resolve symbol
    [javac] symbol  : variable XAException
    [javac] location: class
org.apache.derbyTesting.functionTests.util.XATestUtil
    [javac]         case XAException.XA_RBROLLBACK : error =
"XA_RBROLLBACK "; break;
    [javac]              ^
    [javac]
D:\p4\marsden_patch\opensource\java\testing\org\apache\derbyTesting\functionTests\util\XATestUtil.java:105:
cannot resolve symbol
    [javac] symbol  : variable XAException
    [javac] location: class
org.apache.derbyTesting.functionTests.util.XATestUtil
    [javac]         case XAException.XA_RBTIMEOUT : error =
"XA_RBTIMEOUT "; break;
    [javac]              ^
    [javac]
D:\p4\marsden_patch\opensource\java\testing\org\apache\derbyTesting\functionTests\util\XATestUtil.java:106:
cannot resolve symbol
    [javac] symbol  : variable XAException
    [javac] location: class
org.apache.derbyTesting.functionTests.util.XATestUtil
    [javac]         case XAException.XA_RBTRANSIENT : error =
"XA_RBTRANSIENT "; break;
    [javac]              ^
    [javac]
D:\p4\marsden_patch\opensource\java\testing\org\apache\derbyTesting\functionTests\util\XATestUtil.java:107:
cannot resolve symbol
    [javac] symbol  : variable XAException
    [javac] location: class
org.apache.derbyTesting.functionTests.util.XATestUtil
    [javac]         case XAException.XA_RDONLY : error = "XA_RDONLY ";
break;
    [javac]              ^
    [javac]
D:\p4\marsden_patch\opensource\java\testing\org\apache\derbyTesting\functionTests\util\XATestUtil.java:108:
cannot resolve symbol
    [javac] symbol  : variable XAException
    [javac] location: class
org.apache.derbyTesting.functionTests.util.XATestUtil
    [javac]         case XAException.XA_RETRY : error = "XA_RETRY "; break;
    [javac]              ^
    [javac]
D:\p4\marsden_patch\opensource\java\testing\org\apache\derbyTesting\functionTests\util\XATestUtil.java:109:
cannot resolve symbol
    [javac] symbol  : variable XAException
    [javac] location: class
org.apache.derbyTesting.functionTests.util.XATestUtil
    [javac]         case XAException.XAER_ASYNC : error = "XAER_ASYNC ";
break;
    [javac]              ^
    [javac]
D:\p4\marsden_patch\opensource\java\testing\org\apache\derbyTesting\functionTests\util\XATestUtil.java:110:
cannot resolve symbol
    [javac] symbol  : variable XAException
    [javac] location: class
org.apache.derbyTesting.functionTests.util.XATestUtil
    [javac]         case XAException.XAER_DUPID : error = "XAER_DUPID ";
break;
    [javac]              ^
    [javac]
D:\p4\marsden_patch\opensource\java\testing\org\apache\derbyTesting\functionTests\util\XATestUtil.java:111:
cannot resolve symbol
    [javac] symbol  : variable XAException
    [javac] location: class
org.apache.derbyTesting.functionTests.util.XATestUtil
    [javac]         case XAException.XAER_INVAL : error = "XAER_INVAL ";
break;
    [javac]              ^
    [javac]
D:\p4\marsden_patch\opensource\java\testing\org\apache\derbyTesting\functionTests\util\XATestUtil.java:112:
cannot resolve symbol
    [javac] symbol  : variable XAException
    [javac] location: class
org.apache.derbyTesting.functionTests.util.XATestUtil
    [javac]         case XAException.XAER_NOTA : error = "XAER_NOTA ";
break;
    [javac]              ^
    [javac]
D:\p4\marsden_patch\opensource\java\testing\org\apache\derbyTesting\functionTests\util\XATestUtil.java:113:
cannot resolve symbol
    [javac] symbol  : variable XAException
    [javac] location: class
org.apache.derbyTesting.functionTests.util.XATestUtil
    [javac]         case XAException.XAER_OUTSIDE : error =
"XAER_OUTSIDE "; break;
    [javac]              ^
    [javac]
D:\p4\marsden_patch\opensource\java\testing\org\apache\derbyTesting\functionTests\util\XATestUtil.java:114:
cannot resolve symbol
    [javac] symbol  : variable XAException
    [javac] location: class
org.apache.derbyTesting.functionTests.util.XATestUtil
    [javac]         case XAException.XAER_PROTO : error = "XAER_PROTO ";
break;
    [javac]              ^
    [javac]
D:\p4\marsden_patch\opensource\java\testing\org\apache\derbyTesting\functionTests\util\XATestUtil.java:115:
cannot resolve symbol
    [javac] symbol  : variable XAException
    [javac] location: class
org.apache.derbyTesting.functionTests.util.XATestUtil
    [javac]         case XAException.XAER_RMERR : error = "XAER_RMERR ";
break;
    [javac]              ^
    [javac]
D:\p4\marsden_patch\opensource\java\testing\org\apache\derbyTesting\functionTests\util\XATestUtil.java:116:
cannot resolve symbol
    [javac] symbol  : variable XAException
    [javac] location: class
org.apache.derbyTesting.functionTests.util.XATestUtil
    [javac]         case XAException.XAER_RMFAIL : error = "XAER_RMFAIL
"; break;
    [javac]              ^
    [javac]
D:\p4\marsden_patch\opensource\java\testing\org\apache\derbyTesting\functionTests\util\XATestUtil.java:138:
cannot resolve symbol
    [javac] symbol  : variable Xid
    [javac] location: class
org.apache.derbyTesting.functionTests.util.utilXid
    [javac]         global_id = new byte[Xid.MAXGTRIDSIZE];
    [javac]                              ^
    [javac]
D:\p4\marsden_patch\opensource\java\testing\org\apache\derbyTesting\functionTests\util\XATestUtil.java:139:
cannot resolve symbol
    [javac] symbol  : variable Xid
    [javac] location: class
org.apache.derbyTesting.functionTests.util.utilXid
    [javac]         branch_id = new byte[Xid.MAXBQUALSIZE];
    [javac]                              ^
    [javac] 31 errors
    [javac] 3 warnings

BUILD FAILED
D:\p4\marsden_patch\build.xml:276: The following error occurred while
executing this line:
D:\p4\marsden_patch\build.xml:283: The following error occurred while
executing this line:
D:\p4\marsden_patch\opensource\build.xml:319: The following error
occurred while executing this line:
D:\p4\marsden_patch\opensource\java\testing\build.xml:45: The following
error occurred while executing this line:
D:\p4\marsden_patch\opensource\java\testing\org\apache\derbyTesting\functionTests\util\build.xml:56:
Compile failed; see the compiler error output for details.

Total time: 13 minutes 45 seconds



Mime
View raw message