cxf-users mailing list archives

Site index · List index
Message view « Date » · « Thread »
Top « Date » · « Thread »
From dave11 <davidg.1...@hotmail.com>
Subject Re: Maven errors while importing CXF 2.7.3 source code in eclipse
Date Sun, 10 Feb 2013 13:13:55 GMT
I checked out cxf sources from svn 2.7.x-fixes branch. 

I followed this http://cxf.apache.org/setting-up-eclipse.html guide to
create eclipse workspace for it.

Then I tried to build the code from command line following guide at
http://cxf.apache.org/building.html 

But when I build with 

mvn install

I get following errors.




[INFO] BUILD FAILURE
[INFO]
------------------------------------------------------------------------
[INFO] Total time: 30:45.219s
[INFO] Finished at: Sun Feb 10 18:31:11 IST 2013
[INFO] Final Memory: 107M/360M
[INFO]
------------------------------------------------------------------------
[ERROR] Failed to execute goal
org.apache.maven.plugins:maven-surefire-plugin:2.12.2:test (default-test) on
project cxf-rt-transports-udp: There are test failures.
[ERROR] 
[ERROR] Please refer to
/cxf_src/cxf/rt/transports/udp/target/surefire-reports for the individual
test results.
[ERROR] -> [Help 1]
org.apache.maven.lifecycle.LifecycleExecutionException: Failed to execute
goal org.apache.maven.plugins:maven-surefire-plugin:2.12.2:test
(default-test) on project cxf-rt-transports-udp: There are test failures.

Please refer to /cxf_src/cxf/rt/transports/udp/target/surefire-reports for
the individual test results.
	at
org.apache.maven.lifecycle.internal.MojoExecutor.execute(MojoExecutor.java:213)
	at
org.apache.maven.lifecycle.internal.MojoExecutor.execute(MojoExecutor.java:153)
	at
org.apache.maven.lifecycle.internal.MojoExecutor.execute(MojoExecutor.java:145)
	at
org.apache.maven.lifecycle.internal.LifecycleModuleBuilder.buildProject(LifecycleModuleBuilder.java:84)
	at
org.apache.maven.lifecycle.internal.LifecycleModuleBuilder.buildProject(LifecycleModuleBuilder.java:59)
	at
org.apache.maven.lifecycle.internal.LifecycleStarter.singleThreadedBuild(LifecycleStarter.java:183)
	at
org.apache.maven.lifecycle.internal.LifecycleStarter.execute(LifecycleStarter.java:161)
	at org.apache.maven.DefaultMaven.doExecute(DefaultMaven.java:320)
	at org.apache.maven.DefaultMaven.execute(DefaultMaven.java:156)
	at org.apache.maven.cli.MavenCli.execute(MavenCli.java:537)
	at org.apache.maven.cli.MavenCli.doMain(MavenCli.java:196)
	at org.apache.maven.cli.MavenCli.main(MavenCli.java:141)
	at sun.reflect.NativeMethodAccessorImpl.invoke0(Native Method)
	at
sun.reflect.NativeMethodAccessorImpl.invoke(NativeMethodAccessorImpl.java:57)
	at
sun.reflect.DelegatingMethodAccessorImpl.invoke(DelegatingMethodAccessorImpl.java:43)
	at java.lang.reflect.Method.invoke(Method.java:601)
	at
org.codehaus.plexus.classworlds.launcher.Launcher.launchEnhanced(Launcher.java:290)
	at
org.codehaus.plexus.classworlds.launcher.Launcher.launch(Launcher.java:230)
	at
org.codehaus.plexus.classworlds.launcher.Launcher.mainWithExitCode(Launcher.java:409)
	at
org.codehaus.plexus.classworlds.launcher.Launcher.main(Launcher.java:352)
Caused by: org.apache.maven.plugin.MojoFailureException: There are test
failures.

Please refer to /cxf_src/cxf/rt/transports/udp/target/surefire-reports for
the individual test results.
	at
org.apache.maven.plugin.surefire.SurefireHelper.reportExecution(SurefireHelper.java:83)
	at
org.apache.maven.plugin.surefire.SurefirePlugin.writeSummary(SurefirePlugin.java:185)
	at
org.apache.maven.plugin.surefire.SurefirePlugin.handleSummary(SurefirePlugin.java:159)
	at
org.apache.maven.plugin.surefire.AbstractSurefireMojo.executeAfterPreconditionsChecked(AbstractSurefireMojo.java:626)
	at
org.apache.maven.plugin.surefire.AbstractSurefireMojo.execute(AbstractSurefireMojo.java:587)
	at
org.apache.maven.plugin.DefaultBuildPluginManager.executeMojo(DefaultBuildPluginManager.java:101)
	at
org.apache.maven.lifecycle.internal.MojoExecutor.execute(MojoExecutor.java:209)
	... 19 more
[ERROR] 
[ERROR] 
[ERROR] For more information about the errors and possible solutions, please
read the following articles:
[ERROR] [Help 1]
http://cwiki.apache.org/confluence/display/MAVEN/MojoFailureException
[ERROR] 
[ERROR] After correcting the problems, you can resume the build with the
command
[ERROR]   mvn <goals> -rf :cxf-rt-transports-udp




--
View this message in context: http://cxf.547215.n5.nabble.com/Maven-errors-while-importing-CXF-2-7-3-source-code-in-eclipse-tp5722902p5722970.html
Sent from the cxf-user mailing list archive at Nabble.com.

Mime
View raw message