cxf-users mailing list archives

Site index · List index
Message view « Date » · « Thread »
Top « Date » · « Thread »
From Sergey Beryozkin <sberyoz...@gmail.com>
Subject Re: Apache CXF Build failure on 2.6.x-fixes Branch and Trunk
Date Fri, 20 Jul 2012 15:59:18 GMT
Hi
On 20/07/12 16:01, Gina Choi wrote:
> Hi All,
>
> I try to get recent fix to my project but it is not included in
> 2.6.2-snapshot(
> https://repository.apache.org/content/groups/snapshots/org/apache/cxf/services/sts/cxf-services-sts-core/2.6.2-SNAPSHOT/),
> so I checked out code and ran build, but it is failing. I ran build on both
> jdk1.6.0_24 and jdk1.6.0_33, but it didn't make any difference. Both are
> clean jdk. Did anyone successfully run build  today?
>
> testCustomSchemaJaxbContextPrefixes(org.apache.cxf.jaxrs.model.wadl.WadlGeneratorTest)

I think it is to do with the way JAXB generates the schema based on the 
information it gets from XmlSchema annotation which the test depends upon.
As you can see from https://builds.apache.org/job/CXF-2.6.x/ (which uses 
JDK 1.5), the test passes and so it does on the trunk (see
https://builds.apache.org/job/CXF-Trunk-JDK16/lastBuild/org.apache.cxf$cxf-rt-frontend-jaxrs/).

are you running it on Windows ?

You can do 'mvn -Pfastinstall' to avoid this issue blocking you.

Cheers, Sergey

> Time elapsed: 0.192 sec<<<  FAILURE
> java.lang.AssertionError: expected:<1>  but was:<0>
>          at org.junit.Assert.fail(Assert.java:91)
>          at org.junit.Assert.failNotEquals(Assert.java:645)
>          at org.junit.Assert.assertEquals(Assert.java:126)
>          at org.junit.Assert.assertEquals(Assert.java:470)
>          at org.junit.Assert.assertEquals(Assert.java:454)
>          at
> org.apache.cxf.jaxrs.model.wadl.WadlGeneratorTest.verifyParameters(WadlGeneratorTest.java:613)
>          at
> org.apache.cxf.jaxrs.model.wadl.WadlGeneratorTest.checkBookStoreInfo(WadlGeneratorTest.java:452)
>          at
> org.apache.cxf.jaxrs.model.wadl.WadlGeneratorTest.checkBookStoreInfo(WadlGeneratorTest.java:427)
>          at
> org.apache.cxf.jaxrs.model.wadl.WadlGeneratorTest.testCustomSchemaJaxbContextPrefixes(WadlGeneratorTest.java:91)
>          at sun.reflect.NativeMethodAccessorImpl.invoke0(Native Method)
>          at
> sun.reflect.NativeMethodAccessorImpl.invoke(NativeMethodAccessorImpl.java:39)
>          at
> sun.reflect.DelegatingMethodAccessorImpl.invoke(DelegatingMethodAccessorImpl.java:25)
>          at java.lang.reflect.Method.invoke(Method.java:597)
>          at
> org.junit.runners.model.FrameworkMethod$1.runReflectiveCall(FrameworkMethod.java:44)
>          at
> org.junit.internal.runners.model.ReflectiveCallable.run(ReflectiveCallable.java:15)
>          at
> org.junit.runners.model.FrameworkMethod.invokeExplosively(FrameworkMethod.java:41)
>          at
> org.junit.internal.runners.statements.InvokeMethod.evaluate(InvokeMethod.java:20)
>          at
> org.junit.internal.runners.statements.RunBefores.evaluate(RunBefores.java:28)
>          at
> org.junit.runners.BlockJUnit4ClassRunner.runNotIgnored(BlockJUnit4ClassRunner.java:79)
>          at
> org.junit.runners.BlockJUnit4ClassRunner.runChild(BlockJUnit4ClassRunner.java:71)
>          at
> org.junit.runners.BlockJUnit4ClassRunner.runChild(BlockJUnit4ClassRunner.java:49)
>          at org.junit.runners.ParentRunner$3.run(ParentRunner.java:193)
>          at org.junit.runners.ParentRunner$1.schedule(ParentRunner.java:52)
>          at org.junit.runners.ParentRunner.runChildren(ParentRunner.java:191)
>          at org.junit.runners.ParentRunner.access$000(ParentRunner.java:42)
>          at org.junit.runners.ParentRunner$2.evaluate(ParentRunner.java:184)
>          at org.junit.runners.ParentRunner.run(ParentRunner.java:236)
>          at
> org.apache.maven.surefire.junit4.JUnit4Provider.execute(JUnit4Provider.java:236)
>          at
> org.apache.maven.surefire.junit4.JUnit4Provider.executeTestSet(JUnit4Provider.java:134)
>          at
> org.apache.maven.surefire.junit4.JUnit4Provider.invoke(JUnit4Provider.java:113)
>          at sun.reflect.NativeMethodAccessorImpl.invoke0(Native Method)
>          at
> sun.reflect.NativeMethodAccessorImpl.invoke(NativeMethodAccessorImpl.java:39)
>          at
> sun.reflect.DelegatingMethodAccessorImpl.invoke(DelegatingMethodAccessorImpl.java:25)
>          at java.lang.reflect.Method.invoke(Method.java:597)
>          at
> org.apache.maven.surefire.util.ReflectionUtils.invokeMethodWithArray(ReflectionUtils.java:189)
>          at
> org.apache.maven.surefire.booter.ProviderFactory$ProviderProxy.invoke(ProviderFactory.java:165)
>          at
> org.apache.maven.surefire.booter.ProviderFactory.invokeProvider(ProviderFactory.java:85)
>          at
> org.apache.maven.surefire.booter.ForkedBooter.runSuitesInProcess(ForkedBooter.java:103)
>          at
> org.apache.maven.surefire.booter.ForkedBooter.main(ForkedBooter.java:74)
> testExternalSchemaJaxbContextPrefixes(org.apache.cxf.jaxrs.model.wadl.WadlGeneratorTest)
> Time elapsed: 0.222 sec<<<  FAILU
> java.lang.AssertionError: expected:<1>  but was:<0>
>          at org.junit.Assert.fail(Assert.java:91)
>          at org.junit.Assert.failNotEquals(Assert.java:645)
>          at org.junit.Assert.assertEquals(Assert.java:126)
>          at org.junit.Assert.assertEquals(Assert.java:470)
>          at org.junit.Assert.assertEquals(Assert.java:454)
>          at
> org.apache.cxf.jaxrs.model.wadl.WadlGeneratorTest.verifyParameters(WadlGeneratorTest.java:613)
>          at
> org.apache.cxf.jaxrs.model.wadl.WadlGeneratorTest.checkBookStoreInfo(WadlGeneratorTest.java:452)
>          at
> org.apache.cxf.jaxrs.model.wadl.WadlGeneratorTest.checkBookStoreInfo(WadlGeneratorTest.java:427)
>          at
> org.apache.cxf.jaxrs.model.wadl.WadlGeneratorTest.testExternalSchemaJaxbContextPrefixes(WadlGeneratorTest.java:14
>          at sun.reflect.NativeMethodAccessorImpl.invoke0(Native Method)
>          at
> sun.reflect.NativeMethodAccessorImpl.invoke(NativeMethodAccessorImpl.java:39)
>          at
> sun.reflect.DelegatingMethodAccessorImpl.invoke(DelegatingMethodAccessorImpl.java:25)
>          at java.lang.reflect.Method.invoke(Method.java:597)
>          at
> org.junit.runners.model.FrameworkMethod$1.runReflectiveCall(FrameworkMethod.java:44)
>          at
> org.junit.internal.runners.model.ReflectiveCallable.run(ReflectiveCallable.java:15)
>          at
> org.junit.runners.model.FrameworkMethod.invokeExplosively(FrameworkMethod.java:41)
>          at
> org.junit.internal.runners.statements.InvokeMethod.evaluate(InvokeMethod.java:20)
>          at
> org.junit.internal.runners.statements.RunBefores.evaluate(RunBefores.java:28)
>          at
> org.junit.runners.BlockJUnit4ClassRunner.runNotIgnored(BlockJUnit4ClassRunner.java:79)
>          at
> org.junit.runners.BlockJUnit4ClassRunner.runChild(BlockJUnit4ClassRunner.java:71)
>          at
> org.junit.runners.BlockJUnit4ClassRunner.runChild(BlockJUnit4ClassRunner.java:49)
>          at org.junit.runners.ParentRunner$3.run(ParentRunner.java:193)
>          at org.junit.runners.ParentRunner$1.schedule(ParentRunner.java:52)
>          at org.junit.runners.ParentRunner.runChildren(ParentRunner.java:191)
>          at org.junit.runners.ParentRunner.access$000(ParentRunner.java:42)
>          at org.junit.runners.ParentRunner$2.evaluate(ParentRunner.java:184)
>          at org.junit.runners.ParentRunner.run(ParentRunner.java:236)
>          at
> org.apache.maven.surefire.junit4.JUnit4Provider.execute(JUnit4Provider.java:236)
>          at
> org.apache.maven.surefire.junit4.JUnit4Provider.executeTestSet(JUnit4Provider.java:134)
>          at
> org.apache.maven.surefire.junit4.JUnit4Provider.invoke(JUnit4Provider.java:113)
>          at sun.reflect.NativeMethodAccessorImpl.invoke0(Native Method)
>          at
> sun.reflect.NativeMethodAccessorImpl.invoke(NativeMethodAccessorImpl.java:39)
>          at
> sun.reflect.DelegatingMethodAccessorImpl.invoke(DelegatingMethodAccessorImpl.java:25)
>          at java.lang.reflect.Method.invoke(Method.java:597)
>          at
> org.apache.maven.surefire.util.ReflectionUtils.invokeMethodWithArray(ReflectionUtils.java:189)
>          at
> org.apache.maven.surefire.booter.ProviderFactory$ProviderProxy.invoke(ProviderFactory.java:165)
>          at
> org.apache.maven.surefire.booter.ProviderFactory.invokeProvider(ProviderFactory.java:85)
>          at
> org.apache.maven.surefire.booter.ForkedBooter.runSuitesInProcess(ForkedBooter.java:103)
>          at
> org.apache.maven.surefire.booter.ForkedBooter.main(ForkedBooter.java:74)
> testExternalRelativeSchemaJaxbContextPrefixes(org.apache.cxf.jaxrs.model.wadl.WadlGeneratorTest)
> Time elapsed: 0.018 sec<
> java.lang.AssertionError: expected:<1>  but was:<0>
>          at org.junit.Assert.fail(Assert.java:91)
>          at org.junit.Assert.failNotEquals(Assert.java:645)
>          at org.junit.Assert.assertEquals(Assert.java:126)
>          at org.junit.Assert.assertEquals(Assert.java:470)
>          at org.junit.Assert.assertEquals(Assert.java:454)
>          at
> org.apache.cxf.jaxrs.model.wadl.WadlGeneratorTest.verifyParameters(WadlGeneratorTest.java:613)
>          at
> org.apache.cxf.jaxrs.model.wadl.WadlGeneratorTest.checkBookStoreInfo(WadlGeneratorTest.java:452)
>          at
> org.apache.cxf.jaxrs.model.wadl.WadlGeneratorTest.checkBookStoreInfo(WadlGeneratorTest.java:427)
>          at
> org.apache.cxf.jaxrs.model.wadl.WadlGeneratorTest.testExternalRelativeSchemaJaxbContextPrefixes(WadlGeneratorTest
>          at sun.reflect.NativeMethodAccessorImpl.invoke0(Native Method)
>          at
> sun.reflect.NativeMethodAccessorImpl.invoke(NativeMethodAccessorImpl.java:39)
>          at
> sun.reflect.DelegatingMethodAccessorImpl.invoke(DelegatingMethodAccessorImpl.java:25)
>          at java.lang.reflect.Method.invoke(Method.java:597)
>          at
> org.junit.runners.model.FrameworkMethod$1.runReflectiveCall(FrameworkMethod.java:44)
>          at
> org.junit.internal.runners.model.ReflectiveCallable.run(ReflectiveCallable.java:15)
>          at
> org.junit.runners.model.FrameworkMethod.invokeExplosively(FrameworkMethod.java:41)
>          at
> org.junit.internal.runners.statements.InvokeMethod.evaluate(InvokeMethod.java:20)
>          at
> org.junit.internal.runners.statements.RunBefores.evaluate(RunBefores.java:28)
>          at
> org.junit.runners.BlockJUnit4ClassRunner.runNotIgnored(BlockJUnit4ClassRunner.java:79)
>          at
> org.junit.runners.BlockJUnit4ClassRunner.runChild(BlockJUnit4ClassRunner.java:71)
>          at
> org.junit.runners.BlockJUnit4ClassRunner.runChild(BlockJUnit4ClassRunner.java:49)
>          at org.junit.runners.ParentRunner$3.run(ParentRunner.java:193)
>          at org.junit.runners.ParentRunner$1.schedule(ParentRunner.java:52)
>          at org.junit.runners.ParentRunner.runChildren(ParentRunner.java:191)
>          at org.junit.runners.ParentRunner.access$000(ParentRunner.java:42)
>          at org.junit.runners.ParentRunner$2.evaluate(ParentRunner.java:184)
>          at org.junit.runners.ParentRunner.run(ParentRunner.java:236)
>          at
> org.apache.maven.surefire.junit4.JUnit4Provider.execute(JUnit4Provider.java:236)
>          at
> org.apache.maven.surefire.junit4.JUnit4Provider.executeTestSet(JUnit4Provider.java:134)
>          at
> org.apache.maven.surefire.junit4.JUnit4Provider.invoke(JUnit4Provider.java:113)
>          at sun.reflect.NativeMethodAccessorImpl.invoke0(Native Method)
>          at
> sun.reflect.NativeMethodAccessorImpl.invoke(NativeMethodAccessorImpl.java:39)
>          at
> sun.reflect.DelegatingMethodAccessorImpl.invoke(DelegatingMethodAccessorImpl.java:25)
>          at java.lang.reflect.Method.invoke(Method.java:597)
>          at
> org.apache.maven.surefire.util.ReflectionUtils.invokeMethodWithArray(ReflectionUtils.java:189)
>          at
> org.apache.maven.surefire.booter.ProviderFactory$ProviderProxy.invoke(ProviderFactory.java:165)
>          at
> org.apache.maven.surefire.booter.ProviderFactory.invokeProvider(ProviderFactory.java:85)
>          at
> org.apache.maven.surefire.booter.ForkedBooter.runSuitesInProcess(ForkedBooter.java:103)
>          at
> org.apache.maven.surefire.booter.ForkedBooter.main(ForkedBooter.java:74)
> testExternalSchemaCustomPrefix(org.apache.cxf.jaxrs.model.wadl.WadlGeneratorTest)
> Time elapsed: 0.097 sec<<<  FAILURE!
> java.lang.AssertionError: expected:<1>  but was:<0>
>          at org.junit.Assert.fail(Assert.java:91)
>          at org.junit.Assert.failNotEquals(Assert.java:645)
>          at org.junit.Assert.assertEquals(Assert.java:126)
>          at org.junit.Assert.assertEquals(Assert.java:470)
>          at org.junit.Assert.assertEquals(Assert.java:454)
>          at
> org.apache.cxf.jaxrs.model.wadl.WadlGeneratorTest.verifyParameters(WadlGeneratorTest.java:613)
>          at
> org.apache.cxf.jaxrs.model.wadl.WadlGeneratorTest.checkBookStoreInfo(WadlGeneratorTest.java:452)
>          at
> org.apache.cxf.jaxrs.model.wadl.WadlGeneratorTest.checkBookStoreInfo(WadlGeneratorTest.java:427)
>          at
> org.apache.cxf.jaxrs.model.wadl.WadlGeneratorTest.testExternalSchemaCustomPrefix(WadlGeneratorTest.java:181)
>          at sun.reflect.NativeMethodAccessorImpl.invoke0(Native Method)
>          at
> sun.reflect.NativeMethodAccessorImpl.invoke(NativeMethodAccessorImpl.java:39)
>          at
> sun.reflect.DelegatingMethodAccessorImpl.invoke(DelegatingMethodAccessorImpl.java:25)
>          at java.lang.reflect.Method.invoke(Method.java:597)
>          at
> org.junit.runners.model.FrameworkMethod$1.runReflectiveCall(FrameworkMethod.java:44)
>          at
> org.junit.internal.runners.model.ReflectiveCallable.run(ReflectiveCallable.java:15)
>          at
> org.junit.runners.model.FrameworkMethod.invokeExplosively(FrameworkMethod.java:41)
>          at
> org.junit.internal.runners.statements.InvokeMethod.evaluate(InvokeMethod.java:20)
>          at
> org.junit.internal.runners.statements.RunBefores.evaluate(RunBefores.java:28)
>          at
> org.junit.runners.BlockJUnit4ClassRunner.runNotIgnored(BlockJUnit4ClassRunner.java:79)
>          at
> org.junit.runners.BlockJUnit4ClassRunner.runChild(BlockJUnit4ClassRunner.java:71)
>          at
> org.junit.runners.BlockJUnit4ClassRunner.runChild(BlockJUnit4ClassRunner.java:49)
>          at org.junit.runners.ParentRunner$3.run(ParentRunner.java:193)
>          at org.junit.runners.ParentRunner$1.schedule(ParentRunner.java:52)
>          at org.junit.runners.ParentRunner.runChildren(ParentRunner.java:191)
>          at org.junit.runners.ParentRunner.access$000(ParentRunner.java:42)
>          at org.junit.runners.ParentRunner$2.evaluate(ParentRunner.java:184)
>          at org.junit.runners.ParentRunner.run(ParentRunner.java:236)
>          at
> org.apache.maven.surefire.junit4.JUnit4Provider.execute(JUnit4Provider.java:236)
>          at
> org.apache.maven.surefire.junit4.JUnit4Provider.executeTestSet(JUnit4Provider.java:134)
>          at
> org.apache.maven.surefire.junit4.JUnit4Provider.invoke(JUnit4Provider.java:113)
>          at sun.reflect.NativeMethodAccessorImpl.invoke0(Native Method)
>          at
> sun.reflect.NativeMethodAccessorImpl.invoke(NativeMethodAccessorImpl.java:39)
>          at
> sun.reflect.DelegatingMethodAccessorImpl.invoke(DelegatingMethodAccessorImpl.java:25)
>          at java.lang.reflect.Method.invoke(Method.java:597)
>          at
> org.apache.maven.surefire.util.ReflectionUtils.invokeMethodWithArray(ReflectionUtils.java:189)
>          at
> org.apache.maven.surefire.booter.ProviderFactory$ProviderProxy.invoke(ProviderFactory.java:165)
>          at
> org.apache.maven.surefire.booter.ProviderFactory.invokeProvider(ProviderFactory.java:85)
>          at
> org.apache.maven.surefire.booter.ForkedBooter.runSuitesInProcess(ForkedBooter.java:103)
>          at
> org.apache.maven.surefire.booter.ForkedBooter.main(ForkedBooter.java:74)
> testCustomSchemaAndSchemaPrefixes(org.apache.cxf.jaxrs.model.wadl.WadlGeneratorTest)
> Time elapsed: 0.027 sec<<<  FAILURE!
> java.lang.AssertionError: expected:<1>  but was:<0>
>          at org.junit.Assert.fail(Assert.java:91)
>          at org.junit.Assert.failNotEquals(Assert.java:645)
>          at org.junit.Assert.assertEquals(Assert.java:126)
>          at org.junit.Assert.assertEquals(Assert.java:470)
>          at org.junit.Assert.assertEquals(Assert.java:454)
>          at
> org.apache.cxf.jaxrs.model.wadl.WadlGeneratorTest.verifyParameters(WadlGeneratorTest.java:613)
>          at
> org.apache.cxf.jaxrs.model.wadl.WadlGeneratorTest.checkBookStoreInfo(WadlGeneratorTest.java:452)
>          at
> org.apache.cxf.jaxrs.model.wadl.WadlGeneratorTest.checkBookStoreInfo(WadlGeneratorTest.java:427)
>          at
> org.apache.cxf.jaxrs.model.wadl.WadlGeneratorTest.testCustomSchemaAndSchemaPrefixes(WadlGeneratorTest.java:199)
>          at sun.reflect.NativeMethodAccessorImpl.invoke0(Native Method)
>          at
> sun.reflect.NativeMethodAccessorImpl.invoke(NativeMethodAccessorImpl.java:39)
>          at
> sun.reflect.DelegatingMethodAccessorImpl.invoke(DelegatingMethodAccessorImpl.java:25)
>
> Failed tests:
> testCustomSchemaJaxbContextPrefixes(org.apache.cxf.jaxrs.model.wadl.WadlGeneratorTest):
> expected:<1>  but was:<0>
>
> testExternalSchemaJaxbContextPrefixes(org.apache.cxf.jaxrs.model.wadl.WadlGeneratorTest):
> expected:<1>  but was:<0>
>
> testExternalRelativeSchemaJaxbContextPrefixes(org.apache.cxf.jaxrs.model.wadl.WadlGeneratorTest):
> expected:<1>  but was:<0>
>
> testExternalSchemaCustomPrefix(org.apache.cxf.jaxrs.model.wadl.WadlGeneratorTest):
> expected:<1>  but was:<0>
>
> testCustomSchemaAndSchemaPrefixes(org.apache.cxf.jaxrs.model.wadl.WadlGeneratorTest):
> expected:<1>  but was:<0>
>
> testSingleRootResource(org.apache.cxf.jaxrs.model.wadl.WadlGeneratorTest):
> expected:<1>  but was:<0>
>
> testMultipleRootResources(org.apache.cxf.jaxrs.model.wadl.WadlGeneratorTest):
> expected:<1>  but was:<0>
>
> Tests run: 703, Failures: 7, Errors: 0, Skipped: 4
>
> [INFO]
> ------------------------------------------------------------------------
> [INFO] Reactor Summary:
> [INFO]
> [INFO] Apache CXF ........................................ SUCCESS [1.700s]
> [INFO] Apache CXF Parent ................................. SUCCESS [1.977s]
> [INFO] Apache CXF API .................................... SUCCESS
> [2:21.148s]
> [INFO] Apache CXF Woodstox/MSV Schema Validation ......... SUCCESS [2.767s]
> [INFO] Apache CXF XML Schema Validation with Xerces ...... SUCCESS [2.059s]
> [INFO] Apache CXF Common ................................. SUCCESS [0.035s]
> [INFO] Apache CXF Runtime Core ........................... SUCCESS [23.804s]
> [INFO] Apache CXF Command Line Tools Common .............. SUCCESS [10.018s]
> [INFO] Apache CXF Runtime JAXB DataBinding ............... SUCCESS [10.344s]
> [INFO] Apache CXF Runtime SOAP Binding ................... SUCCESS [11.865s]
> [INFO] Apache CXF Command Line Tools Validator ........... SUCCESS [5.597s]
> [INFO] Apache CXF Command Line Tools WSDLTo Core ......... SUCCESS [3.463s]
> [INFO] Apache CXF Command Line Tools WSDLTo JAXWS Frontend  SUCCESS
> [20.050s]
> [INFO] Apache CXF Runtime JavaScript Client Generator Projects  SUCCESS
> [0.128s]
> [INFO] Apache CXF Runtime JavaScript Client Generator .... SUCCESS [4.638s]
> [INFO] Apache CXF Command Line Tools WSDL to JavaScript Front End  SUCCESS
> [7.603s]
> [INFO] Apache CXF Command Line Tools WSDLTo JAXB Databinding  SUCCESS
> [3.264s]
> [INFO] Apache CXF Maven Plugins .......................... SUCCESS [0.258s]
> [INFO] Apache CXF WSDL Validator Maven2 Plugin ........... SUCCESS [7.050s]
> [INFO] Apache CXF Code Generation Maven2 Plugins ......... SUCCESS [8.605s]
> [INFO] Apache CXF Test Utilities ......................... SUCCESS
> [2:09.844s]
> [INFO] Apache CXF Runtime Management ..................... SUCCESS [17.245s]
> [INFO] Apache CXF Runtime JMS Transport .................. SUCCESS [38.176s]
> [INFO] Apache CXF Runtime XML Binding .................... SUCCESS [3.540s]
> [INFO] Apache CXF Runtime Local Transport ................ SUCCESS [2.094s]
> [INFO] Apache CXF Runtime WS Policy ...................... SUCCESS [22.238s]
> [INFO] Apache CXF Runtime HTTP Transport ................. SUCCESS [14.250s]
> [INFO] Apache CXF Runtime HTTP Jetty Transport ........... SUCCESS [10.448s]
> [INFO] Apache CXF Runtime Simple Frontend ................ SUCCESS [6.758s]
> [INFO] Apache CXF Runtime WS Addressing .................. SUCCESS [5.654s]
> [INFO] Apache CXF Runtime JAX-WS Frontend ................ SUCCESS [41.588s]
> [INFO] Apache CXF Runtime XmlBeans DataBinding ........... SUCCESS [23.493s]
> [INFO] Apache CXF Command Line Tools WSDLTo Test ......... SUCCESS [50.915s]
> [INFO] Apache CXF Command Line Tools WSDLTo Misctools .... SUCCESS [6.187s]
> [INFO] Apache CXF Command Line Tools ..................... SUCCESS [0.017s]
> [INFO] Apache CXF Command Line Tools WSDLTo .............. SUCCESS [0.018s]
> [INFO] Apache CXF Runtime Aegis Databinding .............. SUCCESS [32.307s]
> [INFO] Apache CXF Command Line Tools JavaTo WS ........... SUCCESS [27.786s]
> [INFO] Apache CXF Command Line Tools JavaTo .............. SUCCESS [0.035s]
> *[INFO] Apache CXF Runtime JAX-RS Frontend ................ FAILURE
> [34.601s]*
> [INFO] Apache CXF Command Line Tools WADLTo JAXRS Frontend  SKIPPED
> [INFO] Apache CXF Command Line Tools WADLTo .............. SKIPPED
> [INFO] Apache CXF Runtime CORBA Binding .................. SKIPPED
> [INFO] Apache CXF Command Line Tools CORBA ............... SKIPPED
> [INFO] Apache CXF Runtime SDO DataBinding ................ SKIPPED
> [INFO] Apache CXF Runtime JiBX DataBinding ............... SKIPPED
> [INFO] Apache CXF Runtime Object Binding ................. SKIPPED
> [INFO] Apache CXF Runtime Colocated Binding .............. SKIPPED
> [INFO] Apache CXF Runtime ................................ SKIPPED
> [INFO] Apache CXF Runtime Bindings ....................... SKIPPED
>


-- 
Sergey Beryozkin

Talend Community Coders
http://coders.talend.com/

Blog: http://sberyozkin.blogspot.com

Mime
View raw message