cxf-notifications mailing list archives

Site index · List index
Message view « Date » · « Thread »
Top « Date » · « Thread »
From Apache Jenkins Server <jenk...@builds.apache.org>
Subject Build failed in Jenkins: CXF-trunk-deploy #4223
Date Thu, 20 Aug 2020 16:34:10 GMT
See <https://builds.apache.org/job/CXF-trunk-deploy/4223/display/redirect?page=changes>

Changes:

[dkulp] [maven-release-plugin] prepare release cxf-3.4.0

[dkulp] [maven-release-plugin] prepare for next development iteration


------------------------------------------
[...truncated 2.55 MB...]
No mail will be sent out, as 'CXF-trunk-deploy » Hello World Client Demo using JavaScript
#4223' does not have a result yet. Please make sure you set a proper result in case of pipeline/build
scripts.
No mail will be sent out, as 'CXF-trunk-deploy » Apache CXF JAX-RS Servlet Container Initializer
#4223' does not have a result yet. Please make sure you set a proper result in case of pipeline/build
scripts.
No mail will be sent out, as 'CXF-trunk-deploy » Apache CXF WS-Transfer System Tests #4223'
does not have a result yet. Please make sure you set a proper result in case of pipeline/build
scripts.
No mail will be sent out, as 'CXF-trunk-deploy » JAX-RS Basic Oidc Demo #4223' does not
have a result yet. Please make sure you set a proper result in case of pipeline/build scripts.
No mail will be sent out, as 'CXF-trunk-deploy » Apache CXF Runtime WS Addressing #4223'
does not have a result yet. Please make sure you set a proper result in case of pipeline/build
scripts.
No mail will be sent out, as 'CXF-trunk-deploy » Apache CXF Command Line Tools WSDLTo #4223'
does not have a result yet. Please make sure you set a proper result in case of pipeline/build
scripts.
No mail will be sent out, as 'CXF-trunk-deploy » JAX-RS Spring Security Demo #4223' does
not have a result yet. Please make sure you set a proper result in case of pipeline/build
scripts.
No mail will be sent out, as 'CXF-trunk-deploy » Apache CXF BOM #4223' does not have a
result yet. Please make sure you set a proper result in case of pipeline/build scripts.
No mail will be sent out, as 'CXF-trunk-deploy » Apache CXF Command Line Tools WSDL to
JavaScript Front End #4223' does not have a result yet. Please make sure you set a proper
result in case of pipeline/build scripts.
No mail will be sent out, as 'CXF-trunk-deploy » JAX-RS Basic Demo #4223' does not have
a result yet. Please make sure you set a proper result in case of pipeline/build scripts.
No mail will be sent out, as 'CXF-trunk-deploy » CXF WS-Security UT Demo #4223' does not
have a result yet. Please make sure you set a proper result in case of pipeline/build scripts.
No mail will be sent out, as 'CXF-trunk-deploy » WS-SecurityPolicy UT Demo #4223' does
not have a result yet. Please make sure you set a proper result in case of pipeline/build
scripts.
No mail will be sent out, as 'CXF-trunk-deploy » Apache CXF Runtime Local Transport #4223'
does not have a result yet. Please make sure you set a proper result in case of pipeline/build
scripts.
No mail will be sent out, as 'CXF-trunk-deploy » Spring Boot CXF Web Services Sample #4223'
does not have a result yet. Please make sure you set a proper result in case of pipeline/build
scripts.
No mail will be sent out, as 'CXF-trunk-deploy » CXF sample using WRAPPED Style in XML
Binding (pure XML over HTTP) #4223' does not have a result yet. Please make sure you set a
proper result in case of pipeline/build scripts.
No mail will be sent out, as 'CXF-trunk-deploy » CXF Sample of Stream GZIP Interceptor
#4223' does not have a result yet. Please make sure you set a proper result in case of pipeline/build
scripts.
No mail will be sent out, as 'CXF-trunk-deploy » Java First demo service using the JAXWSFactoryBeans
#4223' does not have a result yet. Please make sure you set a proper result in case of pipeline/build
scripts.
No mail will be sent out, as 'CXF-trunk-deploy » Hello world javascript demo #4223' does
not have a result yet. Please make sure you set a proper result in case of pipeline/build
scripts.
No mail will be sent out, as 'CXF-trunk-deploy » Apache CXF JAX-WS Failover Blueprint Demo
#4223' does not have a result yet. Please make sure you set a proper result in case of pipeline/build
scripts.
No mail will be sent out, as 'CXF-trunk-deploy » Apache CXF JAX-RS Service Description
Swagger #4223' does not have a result yet. Please make sure you set a proper result in case
of pipeline/build scripts.
No mail will be sent out, as 'CXF-trunk-deploy » Apache CXF Runtime JAX-RS Frontend #4223'
does not have a result yet. Please make sure you set a proper result in case of pipeline/build
scripts.
No mail will be sent out, as 'CXF-trunk-deploy » Apache CXF JAX-RS Extensions: Project
Reactor #4223' does not have a result yet. Please make sure you set a proper result in case
of pipeline/build scripts.
No mail will be sent out, as 'CXF-trunk-deploy » Apache CXF JAX-RS Service Description
OpenAPI v3 #4223' does not have a result yet. Please make sure you set a proper result in
case of pipeline/build scripts.
No mail will be sent out, as 'CXF-trunk-deploy » WS-Eventing Demo #4223' does not have
a result yet. Please make sure you set a proper result in case of pipeline/build scripts.
No mail will be sent out, as 'CXF-trunk-deploy » Apache CXF JAX-RS Extensions: Search #4223'
does not have a result yet. Please make sure you set a proper result in case of pipeline/build
scripts.
No mail will be sent out, as 'CXF-trunk-deploy » Apache CXF JAX-RS Service Description
#4223' does not have a result yet. Please make sure you set a proper result in case of pipeline/build
scripts.
No mail will be sent out, as 'CXF-trunk-deploy » Apache CXF Runtime Bindings #4223' does
not have a result yet. Please make sure you set a proper result in case of pipeline/build
scripts.
No mail will be sent out, as 'CXF-trunk-deploy » Apache CXF MicroProfile JAX-RS integration
Sys Tests #4223' does not have a result yet. Please make sure you set a proper result in case
of pipeline/build scripts.
No mail will be sent out, as 'CXF-trunk-deploy » JMS Transport Publish/Subscribe Demo using
Document-Literal Style #4223' does not have a result yet. Please make sure you set a proper
result in case of pipeline/build scripts.
No mail will be sent out, as 'CXF-trunk-deploy » Apache CXF XKMS OSGi deployment #4223'
does not have a result yet. Please make sure you set a proper result in case of pipeline/build
scripts.
No mail will be sent out, as 'CXF-trunk-deploy » Bank sample using JAX-WS API's to talk
via CORBA/IIOP #4223' does not have a result yet. Please make sure you set a proper result
in case of pipeline/build scripts.
No mail will be sent out, as 'CXF-trunk-deploy » JAX-RS Open API 3.0 Demo #4223' does not
have a result yet. Please make sure you set a proper result in case of pipeline/build scripts.
No mail will be sent out, as 'CXF-trunk-deploy » Apache CXF Spring Boot Starter JAX-RS
#4223' does not have a result yet. Please make sure you set a proper result in case of pipeline/build
scripts.
No mail will be sent out, as 'CXF-trunk-deploy » Apache CXF Java2WADL Maven2 Plugin #4223'
does not have a result yet. Please make sure you set a proper result in case of pipeline/build
scripts.
No mail will be sent out, as 'CXF-trunk-deploy » Apache CXF Container Integration Test
Grizzly #4223' does not have a result yet. Please make sure you set a proper result in case
of pipeline/build scripts.
No mail will be sent out, as 'CXF-trunk-deploy » Apache CXF Runtime CORBA Binding #4223'
does not have a result yet. Please make sure you set a proper result in case of pipeline/build
scripts.
No mail will be sent out, as 'CXF-trunk-deploy » Apache CXF Runtime Http-Signature #4223'
does not have a result yet. Please make sure you set a proper result in case of pipeline/build
scripts.
No mail will be sent out, as 'CXF-trunk-deploy » Generated JavaScript Sample using JAX-WS
and JSR-181 #4223' does not have a result yet. Please make sure you set a proper result in
case of pipeline/build scripts.
No mail will be sent out, as 'CXF-trunk-deploy » Apache CXF Maven Archetypes #4223' does
not have a result yet. Please make sure you set a proper result in case of pipeline/build
scripts.
No mail will be sent out, as 'CXF-trunk-deploy » Apache CXF MicroProfile Async Sys Tests
#4223' does not have a result yet. Please make sure you set a proper result in case of pipeline/build
scripts.
No mail will be sent out, as 'CXF-trunk-deploy » Apache CXF Runtime SOAP Binding #4223'
does not have a result yet. Please make sure you set a proper result in case of pipeline/build
scripts.
No mail will be sent out, as 'CXF-trunk-deploy » Apache CXF WSN service #4223' does not
have a result yet. Please make sure you set a proper result in case of pipeline/build scripts.
No mail will be sent out, as 'CXF-trunk-deploy » Apache CXF JAX-RS Service Description
Microprofile OpenAPI #4223' does not have a result yet. Please make sure you set a proper
result in case of pipeline/build scripts.
No mail will be sent out, as 'CXF-trunk-deploy » Apache CXF STS service #4223' does not
have a result yet. Please make sure you set a proper result in case of pipeline/build scripts.
No mail will be sent out, as 'CXF-trunk-deploy » Apache CXF Runtime OpenId Connect #4223'
does not have a result yet. Please make sure you set a proper result in case of pipeline/build
scripts.
No mail will be sent out, as 'CXF-trunk-deploy » Apache CXF MicroProfile TCKs #4223' does
not have a result yet. Please make sure you set a proper result in case of pipeline/build
scripts.
No mail will be sent out, as 'CXF-trunk-deploy » Apache CXF Runtime WS Transfer #4223'
does not have a result yet. Please make sure you set a proper result in case of pipeline/build
scripts.
No mail will be sent out, as 'CXF-trunk-deploy » Apache CXF JAX-RS Extensions: Reactive
Streams #4223' does not have a result yet. Please make sure you set a proper result in case
of pipeline/build scripts.
No mail will be sent out, as 'CXF-trunk-deploy » Apache CXF Uncategorized System Tests
#4223' does not have a result yet. Please make sure you set a proper result in case of pipeline/build
scripts.
No mail will be sent out, as 'CXF-trunk-deploy » Apache CXF Runtime Core for WSDL #4223'
does not have a result yet. Please make sure you set a proper result in case of pipeline/build
scripts.
No mail will be sent out, as 'CXF-trunk-deploy » Apache CXF XKMS Service #4223' does not
have a result yet. Please make sure you set a proper result in case of pipeline/build scripts.
No mail will be sent out, as 'CXF-trunk-deploy » Apache CXF Command Line Tools Common #4223'
does not have a result yet. Please make sure you set a proper result in case of pipeline/build
scripts.
No mail will be sent out, as 'CXF-trunk-deploy » Apache CXF Command Line Tools WSDLTo Core
#4223' does not have a result yet. Please make sure you set a proper result in case of pipeline/build
scripts.
No mail will be sent out, as 'CXF-trunk-deploy » Apache CXF Services #4223' does not have
a result yet. Please make sure you set a proper result in case of pipeline/build scripts.
No mail will be sent out, as 'CXF-trunk-deploy » Apache CXF JAX-WS System Tests #4223'
does not have a result yet. Please make sure you set a proper result in case of pipeline/build
scripts.
No mail will be sent out, as 'CXF-trunk-deploy » Apache CXF Command Line Tools WSDLTo JAXWS
Frontend #4223' does not have a result yet. Please make sure you set a proper result in case
of pipeline/build scripts.
No mail will be sent out, as 'CXF-trunk-deploy » Apache CXF Samples #4223' does not have
a result yet. Please make sure you set a proper result in case of pipeline/build scripts.
No mail will be sent out, as 'CXF-trunk-deploy » Spring HTTP Servlet demo with ruby support
#4223' does not have a result yet. Please make sure you set a proper result in case of pipeline/build
scripts.
No mail will be sent out, as 'CXF-trunk-deploy » Apache CXF JAX-RS Service Description
Swagger UI integration #4223' does not have a result yet. Please make sure you set a proper
result in case of pipeline/build scripts.
No mail will be sent out, as 'CXF-trunk-deploy » Apache CXF Runtime Clustering #4223' does
not have a result yet. Please make sure you set a proper result in case of pipeline/build
scripts.
No mail will be sent out, as 'CXF-trunk-deploy » Apache CXF CDI Integration System Tests
- OWB with producers #4223' does not have a result yet. Please make sure you set a proper
result in case of pipeline/build scripts.
No mail will be sent out, as 'CXF-trunk-deploy » Apache CXF Archetype - Simple JAX-RS webapp
#4223' does not have a result yet. Please make sure you set a proper result in case of pipeline/build
scripts.
No mail will be sent out, as 'CXF-trunk-deploy » Apache CXF Databinding System Tests #4223'
does not have a result yet. Please make sure you set a proper result in case of pipeline/build
scripts.
No mail will be sent out, as 'CXF-trunk-deploy » CXF sample using the Aegis Binding without
any webservice #4223' does not have a result yet. Please make sure you set a proper result
in case of pipeline/build scripts.
No mail will be sent out, as 'CXF-trunk-deploy » Apache CXF Runtime OAuth 1.0a #4223' does
not have a result yet. Please make sure you set a proper result in case of pipeline/build
scripts.
No mail will be sent out, as 'CXF-trunk-deploy » Apache CXF Advanced Logging Feature #4223'
does not have a result yet. Please make sure you set a proper result in case of pipeline/build
scripts.
No mail will be sent out, as 'CXF-trunk-deploy » Apache CXF CDI Integration System Tests
- Weld with no apps #4223' does not have a result yet. Please make sure you set a proper result
in case of pipeline/build scripts.
No mail will be sent out, as 'CXF-trunk-deploy » JAX-RS Big Query Demo #4223' does not
have a result yet. Please make sure you set a proper result in case of pipeline/build scripts.
No mail will be sent out, as 'CXF-trunk-deploy » Apache CXF Runtime WS Policy #4223' does
not have a result yet. Please make sure you set a proper result in case of pipeline/build
scripts.
No mail will be sent out, as 'CXF-trunk-deploy » JAX-RS Open API 3.0 Demo #4223' does not
have a result yet. Please make sure you set a proper result in case of pipeline/build scripts.
No mail will be sent out, as 'CXF-trunk-deploy » Apache CXF Kerberos Integration System
Tests #4223' does not have a result yet. Please make sure you set a proper result in case
of pipeline/build scripts.
No mail will be sent out, as 'CXF-trunk-deploy » Apache CXF STS advanced systests #4223'
does not have a result yet. Please make sure you set a proper result in case of pipeline/build
scripts.
No mail will be sent out, as 'CXF-trunk-deploy » JAX-RS Demo Using Distributed Tracing
with OpenZipkin Brave and OSGi #4223' does not have a result yet. Please make sure you set
a proper result in case of pipeline/build scripts.
No mail will be sent out, as 'CXF-trunk-deploy » JAX-RS SSE Blueprint Demo #4223' does
not have a result yet. Please make sure you set a proper result in case of pipeline/build
scripts.
No mail will be sent out, as 'CXF-trunk-deploy » Apache CXF Servlet Container Initializer
Integration System Tests #4223' does not have a result yet. Please make sure you set a proper
result in case of pipeline/build scripts.
No mail will be sent out, as 'CXF-trunk-deploy » Apache CXF WS-Discovery API #4223' does
not have a result yet. Please make sure you set a proper result in case of pipeline/build
scripts.
No mail will be sent out, as 'CXF-trunk-deploy » Apache CXF JAX-RS System Advanced Security
Tests #4223' does not have a result yet. Please make sure you set a proper result in case
of pipeline/build scripts.
No mail will be sent out, as 'CXF-trunk-deploy » JAX-RS Swagger2 Spring Demo #4223' does
not have a result yet. Please make sure you set a proper result in case of pipeline/build
scripts.
No mail will be sent out, as 'CXF-trunk-deploy » Spring HTTP Sample #4223' does not have
a result yet. Please make sure you set a proper result in case of pipeline/build scripts.
No mail will be sent out, as 'CXF-trunk-deploy » Apache CXF Throttling Feature #4223' does
not have a result yet. Please make sure you set a proper result in case of pipeline/build
scripts.
No mail will be sent out, as 'CXF-trunk-deploy » Apache CXF Karaf Commands #4223' does
not have a result yet. Please make sure you set a proper result in case of pipeline/build
scripts.
No mail will be sent out, as 'CXF-trunk-deploy » WS-Policy Demo #4223' does not have a
result yet. Please make sure you set a proper result in case of pipeline/build scripts.
No mail will be sent out, as 'CXF-trunk-deploy » Apache CXF Features Runtime #4223' does
not have a result yet. Please make sure you set a proper result in case of pipeline/build
scripts.
No mail will be sent out, as 'CXF-trunk-deploy » Spring Boot CXF Second Web Services #4223'
does not have a result yet. Please make sure you set a proper result in case of pipeline/build
scripts.
No mail will be sent out, as 'CXF-trunk-deploy » Apache CXF System Tests #4223' does not
have a result yet. Please make sure you set a proper result in case of pipeline/build scripts.
No mail will be sent out, as 'CXF-trunk-deploy » Apache CXF Rest Security Runtime #4223'
does not have a result yet. Please make sure you set a proper result in case of pipeline/build
scripts.
No mail will be sent out, as 'CXF-trunk-deploy » CXF sample using a callback object #4223'
does not have a result yet. Please make sure you set a proper result in case of pipeline/build
scripts.
No mail will be sent out, as 'CXF-trunk-deploy » Apache CXF Runtime HTTP Undertow Transport
#4223' does not have a result yet. Please make sure you set a proper result in case of pipeline/build
scripts.
No mail will be sent out, as 'CXF-trunk-deploy » Apache CXF Runtime JOSE JAX-RS #4223'
does not have a result yet. Please make sure you set a proper result in case of pipeline/build
scripts.
No mail will be sent out, as 'CXF-trunk-deploy » JAX-RS WebSocket WebApp Demo #4223' does
not have a result yet. Please make sure you set a proper result in case of pipeline/build
scripts.
No mail will be sent out, as 'CXF-trunk-deploy » Apache CXF STS Integration Tests #4223'
does not have a result yet. Please make sure you set a proper result in case of pipeline/build
scripts.
No mail will be sent out, as 'CXF-trunk-deploy » WSDL first demo using Document/Literal
Style #4223' does not have a result yet. Please make sure you set a proper result in case
of pipeline/build scripts.
No mail will be sent out, as 'CXF-trunk-deploy » Apache CXF CDI Integration System Tests
- Weld #4223' does not have a result yet. Please make sure you set a proper result in case
of pipeline/build scripts.
No mail will be sent out, as 'CXF-trunk-deploy » JMS Transport Queue Demo using Document-Literal
Style #4223' does not have a result yet. Please make sure you set a proper result in case
of pipeline/build scripts.
No mail will be sent out, as 'CXF-trunk-deploy » Apache CXF Java2WS Maven2 Plugin #4223'
does not have a result yet. Please make sure you set a proper result in case of pipeline/build
scripts.
No mail will be sent out, as 'CXF-trunk-deploy » WSDL first demo using the jms transport
and jmsConfigFeature #4223' does not have a result yet. Please make sure you set a proper
result in case of pipeline/build scripts.
No mail will be sent out, as 'CXF-trunk-deploy » Apache CXF XKMS #4223' does not have a
result yet. Please make sure you set a proper result in case of pipeline/build scripts.
No mail will be sent out, as 'CXF-trunk-deploy » Apache CXF STS basic systests #4223' does
not have a result yet. Please make sure you set a proper result in case of pipeline/build
scripts.
No mail will be sent out, as 'CXF-trunk-deploy » Apache CXF WS-Security System Tests #4223'
does not have a result yet. Please make sure you set a proper result in case of pipeline/build
scripts.
No mail will be sent out, as 'CXF-trunk-deploy » Apache CXF WADL2Java Code Generation Maven2
Plugin #4223' does not have a result yet. Please make sure you set a proper result in case
of pipeline/build scripts.
No mail will be sent out, as 'CXF-trunk-deploy » Apache CXF Runtime HTTP Netty Client Transport
#4223' does not have a result yet. Please make sure you set a proper result in case of pipeline/build
scripts.
No mail will be sent out, as 'CXF-trunk-deploy » Apache CXF Runtime JavaScript Client Generator
Tests #4223' does not have a result yet. Please make sure you set a proper result in case
of pipeline/build scripts.
No mail will be sent out, as 'CXF-trunk-deploy » JAX-WS Asynchronous Demo using Document/Literal
Style #4223' does not have a result yet. Please make sure you set a proper result in case
of pipeline/build scripts.
No mail will be sent out, as 'CXF-trunk-deploy » Apache CXF WS-* Specifications System
Tests #4223' does not have a result yet. Please make sure you set a proper result in case
of pipeline/build scripts.
No mail will be sent out, as 'CXF-trunk-deploy » Apache CXF Runtime Simple Frontend #4223'
does not have a result yet. Please make sure you set a proper result in case of pipeline/build
scripts.
No mail will be sent out, as 'CXF-trunk-deploy » Apache CXF XKMS Karaf Features #4223'
does not have a result yet. Please make sure you set a proper result in case of pipeline/build
scripts.
No mail will be sent out, as 'CXF-trunk-deploy » Apache CXF Spring Boot Integration #4223'
does not have a result yet. Please make sure you set a proper result in case of pipeline/build
scripts.
No mail will be sent out, as 'CXF-trunk-deploy » Apache CXF Runtime JavaScript Client Generator
#4223' does not have a result yet. Please make sure you set a proper result in case of pipeline/build
scripts.
No mail will be sent out, as 'CXF-trunk-deploy » JAX-RS Swagger2 WebApp Demo #4223' does
not have a result yet. Please make sure you set a proper result in case of pipeline/build
scripts.
No mail will be sent out, as 'CXF-trunk-deploy » JAX-RS SSE/CDI Demo (Jetty 9) #4223' does
not have a result yet. Please make sure you set a proper result in case of pipeline/build
scripts.
No mail will be sent out, as 'CXF-trunk-deploy » Java First demo using JMS #4223' does
not have a result yet. Please make sure you set a proper result in case of pipeline/build
scripts.
No mail will be sent out, as 'CXF-trunk-deploy » Apache CXF Runtime JAXB DataBinding #4223'
does not have a result yet. Please make sure you set a proper result in case of pipeline/build
scripts.
No mail will be sent out, as 'CXF-trunk-deploy » Apache CXF WS-Security Interop System
Tests #4223' does not have a result yet. Please make sure you set a proper result in case
of pipeline/build scripts.
No mail will be sent out, as 'CXF-trunk-deploy » Apache CXF Compatibility Bundle Jar #4223'
does not have a result yet. Please make sure you set a proper result in case of pipeline/build
scripts.
No mail will be sent out, as 'CXF-trunk-deploy » Apache CXF XKMS Common #4223' does not
have a result yet. Please make sure you set a proper result in case of pipeline/build scripts.
No mail will be sent out, as 'CXF-trunk-deploy » Apache CXF Runtime JAX-WS Frontend #4223'
does not have a result yet. Please make sure you set a proper result in case of pipeline/build
scripts.
No mail will be sent out, as 'CXF-trunk-deploy » Apache CXF Runtime JOSE Core #4223' does
not have a result yet. Please make sure you set a proper result in case of pipeline/build
scripts.
No mail will be sent out, as 'CXF-trunk-deploy » Apache CXF SSE Integration System Tests
#4223' does not have a result yet. Please make sure you set a proper result in case of pipeline/build
scripts.
No mail will be sent out, as 'CXF-trunk-deploy » Apache CXF JAX-RS System Tests #4223'
does not have a result yet. Please make sure you set a proper result in case of pipeline/build
scripts.
No mail will be sent out, as 'CXF-trunk-deploy » Apache CXF System Tests for Maven Plugins
#4223' does not have a result yet. Please make sure you set a proper result in case of pipeline/build
scripts.
No mail will be sent out, as 'CXF-trunk-deploy » OAuth 1.0a server #4223' does not have
a result yet. Please make sure you set a proper result in case of pipeline/build scripts.
No mail will be sent out, as 'CXF-trunk-deploy » Apache CXF Runtime #4223' does not have
a result yet. Please make sure you set a proper result in case of pipeline/build scripts.
No mail will be sent out, as 'CXF-trunk-deploy » Apache CXF Runtime WebSocket Transport
#4223' does not have a result yet. Please make sure you set a proper result in case of pipeline/build
scripts.
No mail will be sent out, as 'CXF-trunk-deploy » Apache CXF CDI Integration System Tests
- OWB with multiple apps #4223' does not have a result yet. Please make sure you set a proper
result in case of pipeline/build scripts.
No mail will be sent out, as 'CXF-trunk-deploy » Apache CXF WSN Core #4223' does not have
a result yet. Please make sure you set a proper result in case of pipeline/build scripts.
No mail will be sent out, as 'CXF-trunk-deploy » Apache CXF CDI Integration System Tests
- OWB with no apps #4223' does not have a result yet. Please make sure you set a proper result
in case of pipeline/build scripts.
No mail will be sent out, as 'CXF-trunk-deploy » Apache CXF XKMS Client #4223' does not
have a result yet. Please make sure you set a proper result in case of pipeline/build scripts.
No mail will be sent out, as 'CXF-trunk-deploy » Apache CXF XKMS Integration Tests #4223'
does not have a result yet. Please make sure you set a proper result in case of pipeline/build
scripts.
No mail will be sent out, as 'CXF-trunk-deploy » Apache CXF Transport System Tests JMS
#4223' does not have a result yet. Please make sure you set a proper result in case of pipeline/build
scripts.
No mail will be sent out, as 'CXF-trunk-deploy » Apache CXF Command Line Tools CORBA #4223'
does not have a result yet. Please make sure you set a proper result in case of pipeline/build
scripts.
No mail will be sent out, as 'CXF-trunk-deploy » Apache CXF WS-RM Specifications System
Tests #4223' does not have a result yet. Please make sure you set a proper result in case
of pipeline/build scripts.
No mail will be sent out, as 'CXF-trunk-deploy » Apache CXF Runtime HTTP Async Transport
#4223' does not have a result yet. Please make sure you set a proper result in case of pipeline/build
scripts.
No mail will be sent out, as 'CXF-trunk-deploy » CXF WS-SecurityPolicy Signature Encryption
Demo #4223' does not have a result yet. Please make sure you set a proper result in case of
pipeline/build scripts.
No mail will be sent out, as 'CXF-trunk-deploy » Apache CXF System Tests - MicroProfile
Rest Client TCK on Weld #4223' does not have a result yet. Please make sure you set a proper
result in case of pipeline/build scripts.
No mail will be sent out, as 'CXF-trunk-deploy » Apache CXF WSN OSGi #4223' does not have
a result yet. Please make sure you set a proper result in case of pipeline/build scripts.
No mail will be sent out, as 'CXF-trunk-deploy » WS-Addressing Demo #4223' does not have
a result yet. Please make sure you set a proper result in case of pipeline/build scripts.
No mail will be sent out, as 'CXF-trunk-deploy » Apache CXF SSE Integration System Tests
base classes #4223' does not have a result yet. Please make sure you set a proper result in
case of pipeline/build scripts.
No mail will be sent out, as 'CXF-trunk-deploy » Apache CXF Runtime JavaScript Client Generator
Projects #4223' does not have a result yet. Please make sure you set a proper result in case
of pipeline/build scripts.
No mail will be sent out, as 'CXF-trunk-deploy » JAX-RS SSE Demo (Jetty 9) #4223' does
not have a result yet. Please make sure you set a proper result in case of pipeline/build
scripts.
No mail will be sent out, as 'CXF-trunk-deploy » Apache CXF Transports Runtime #4223' does
not have a result yet. Please make sure you set a proper result in case of pipeline/build
scripts.
No mail will be sent out, as 'CXF-trunk-deploy » Apache CXF Bundle Parent #4223' does not
have a result yet. Please make sure you set a proper result in case of pipeline/build scripts.
No mail will be sent out, as 'CXF-trunk-deploy » Apache CXF Runtime Security functionality
#4223' does not have a result yet. Please make sure you set a proper result in case of pipeline/build
scripts.
No mail will be sent out, as 'CXF-trunk-deploy » Apache CXF STS test OSGi deployment #4223'
does not have a result yet. Please make sure you set a proper result in case of pipeline/build
scripts.
No mail will be sent out, as 'CXF-trunk-deploy » JAX-RS Content Negotiation Demo #4223'
does not have a result yet. Please make sure you set a proper result in case of pipeline/build
scripts.
No mail will be sent out, as 'CXF-trunk-deploy » Apache CXF WS-Discovery #4223' does not
have a result yet. Please make sure you set a proper result in case of pipeline/build scripts.
No mail will be sent out, as 'CXF-trunk-deploy » Apache CXF Distributed Tracing using OpenZipkin
Brave #4223' does not have a result yet. Please make sure you set a proper result in case
of pipeline/build scripts.
No mail will be sent out, as 'CXF-trunk-deploy » Apache CXF Manifest Jar #4223' does not
have a result yet. Please make sure you set a proper result in case of pipeline/build scripts.
No mail will be sent out, as 'CXF-trunk-deploy » JAX-RS OData #4223' does not have a result
yet. Please make sure you set a proper result in case of pipeline/build scripts.
No mail will be sent out, as 'CXF-trunk-deploy » JAX-RS Demo Using Distributed Tracing
with OpenTracing API, Apache Camel and Jaeger #4223' does not have a result yet. Please make
sure you set a proper result in case of pipeline/build scripts.
No mail will be sent out, as 'CXF-trunk-deploy » Apache CXF Runtime OAuth 2.0 #4223' does
not have a result yet. Please make sure you set a proper result in case of pipeline/build
scripts.
No mail will be sent out, as 'CXF-trunk-deploy » Test for generating code from wsdl in
repo #4223' does not have a result yet. Please make sure you set a proper result in case of
pipeline/build scripts.
No mail will be sent out, as 'CXF-trunk-deploy » Apache CXF Web Services Runtime #4223'
does not have a result yet. Please make sure you set a proper result in case of pipeline/build
scripts.
No mail will be sent out, as 'CXF-trunk-deploy » Apache CXF Runtime OAuth 2.0 SAML #4223'
does not have a result yet. Please make sure you set a proper result in case of pipeline/build
scripts.
No mail will be sent out, as 'CXF-trunk-deploy » Apache CXF Runtime HTTP Jetty Transport
#4223' does not have a result yet. Please make sure you set a proper result in case of pipeline/build
scripts.
No mail will be sent out, as 'CXF-trunk-deploy » Test for writing wsdl to repo #4223' does
not have a result yet. Please make sure you set a proper result in case of pipeline/build
scripts.
No mail will be sent out, as 'CXF-trunk-deploy » Apache CXF Command Line Tools #4223' does
not have a result yet. Please make sure you set a proper result in case of pipeline/build
scripts.
No mail will be sent out, as 'CXF-trunk-deploy » Bank sample using JAX-WS API's to talk
via CORBA/IIOP #4223' does not have a result yet. Please make sure you set a proper result
in case of pipeline/build scripts.
No mail will be sent out, as 'CXF-trunk-deploy » Sample using SOAP Headers #4223' does
not have a result yet. Please make sure you set a proper result in case of pipeline/build
scripts.
No mail will be sent out, as 'CXF-trunk-deploy » Apache CXF Parent #4223' does not have
a result yet. Please make sure you set a proper result in case of pipeline/build scripts.
No mail will be sent out, as 'CXF-trunk-deploy » Apache CXF Maven Plugins #4223' does not
have a result yet. Please make sure you set a proper result in case of pipeline/build scripts.
No mail will be sent out, as 'CXF-trunk-deploy » Apache CXF Archetype - Simple JAX-WS Java
First #4223' does not have a result yet. Please make sure you set a proper result in case
of pipeline/build scripts.
No mail will be sent out, as 'CXF-trunk-deploy » Apache CXF :: OSGi :: Integration Tests
pure felix #4223' does not have a result yet. Please make sure you set a proper result in
case of pipeline/build scripts.
No mail will be sent out, as 'CXF-trunk-deploy » JAX-WS Demo Using Distributed Tracing
with OpenZipkin Brave and OSGi #4223' does not have a result yet. Please make sure you set
a proper result in case of pipeline/build scripts.
No mail will be sent out, as 'CXF-trunk-deploy » JAX-RS WebSocket Demo #4223' does not
have a result yet. Please make sure you set a proper result in case of pipeline/build scripts.
No mail will be sent out, as 'CXF-trunk-deploy » Java First demo using JAX-WS APIs #4223'
does not have a result yet. Please make sure you set a proper result in case of pipeline/build
scripts.
No mail will be sent out, as 'CXF-trunk-deploy » JAX-RS SSE Client Demo (Tomcat 8) #4223'
does not have a result yet. Please make sure you set a proper result in case of pipeline/build
scripts.
No mail will be sent out, as 'CXF-trunk-deploy » JAX-WS Handler Demo #4223' does not have
a result yet. Please make sure you set a proper result in case of pipeline/build scripts.
No mail will be sent out, as 'CXF-trunk-deploy » Spring Boot CXF Web Services Transaction
Sample #4223' does not have a result yet. Please make sure you set a proper result in case
of pipeline/build scripts.
No mail will be sent out, as 'CXF-trunk-deploy » Apache CXF Command Line Tools JavaTo WS
#4223' does not have a result yet. Please make sure you set a proper result in case of pipeline/build
scripts.
No mail will be sent out, as 'CXF-trunk-deploy » Apache CXF Karaf Parent #4223' does not
have a result yet. Please make sure you set a proper result in case of pipeline/build scripts.
No mail will be sent out, as 'CXF-trunk-deploy » Apache CXF Runtime HTTP Netty Server Transport
#4223' does not have a result yet. Please make sure you set a proper result in case of pipeline/build
scripts.
No mail will be sent out, as 'CXF-trunk-deploy » Apache CXF LDAP Integration System Tests
#4223' does not have a result yet. Please make sure you set a proper result in case of pipeline/build
scripts.
No mail will be sent out, as 'CXF-trunk-deploy » SOAP/JMS Transport Specification Demo
using Document-Literal Style #4223' does not have a result yet. Please make sure you set a
proper result in case of pipeline/build scripts.
No mail will be sent out, as 'CXF-trunk-deploy » Apache CXF Distributed Tracing using OpenTracing
#4223' does not have a result yet. Please make sure you set a proper result in case of pipeline/build
scripts.
No mail will be sent out, as 'CXF-trunk-deploy » Colocated Demo using Document/Literal
Style #4223' does not have a result yet. Please make sure you set a proper result in case
of pipeline/build scripts.
No mail will be sent out, as 'CXF-trunk-deploy » Apache CXF Runtime HTTP Transport #4223'
does not have a result yet. Please make sure you set a proper result in case of pipeline/build
scripts.
No mail will be sent out, as 'CXF-trunk-deploy » Apache CXF JAX-RS Service Description
OpenAPI/Swagger Common #4223' does not have a result yet. Please make sure you set a proper
result in case of pipeline/build scripts.
No mail will be sent out, as 'CXF-trunk-deploy » Apache CXF SSE Integration System Tests
for Undertow #4223' does not have a result yet. Please make sure you set a proper result in
case of pipeline/build scripts.
channel stopped
Maven RedeployPublisher use remote H40 maven settings from : /home/jenkins/.m2/settings.xml
[INFO] Deployment in https://repository.apache.org/content/repositories/snapshots (id=apache.snapshots.https,uniqueVersion=true)
Deploying the main artifact apache-cxf-3.4.1-SNAPSHOT.pom
Downloading from apache.snapshots.https: https://repository.apache.org/content/repositories/snapshots/org/apache/cxf/apache-cxf/3.4.1-SNAPSHOT/maven-metadata.xml
ERROR: Failed to retrieve remote metadata org.apache.cxf:apache-cxf:3.4.1-SNAPSHOT/maven-metadata.xml:
Could not transfer metadata org.apache.cxf:apache-cxf:3.4.1-SNAPSHOT/maven-metadata.xml from/to
apache.snapshots.https (https://repository.apache.org/content/repositories/snapshots): Connect
to repository.apache.org:443 [repository.apache.org/136.243.146.148, repository.apache.org/2a01:4f8:171:1513:0:0:0:2]
failed: Connection refused (Connection refused)
org.apache.maven.artifact.deployer.ArtifactDeploymentException: Failed to retrieve remote
metadata org.apache.cxf:apache-cxf:3.4.1-SNAPSHOT/maven-metadata.xml: Could not transfer metadata
org.apache.cxf:apache-cxf:3.4.1-SNAPSHOT/maven-metadata.xml from/to apache.snapshots.https
(https://repository.apache.org/content/repositories/snapshots): Connect to repository.apache.org:443
[repository.apache.org/136.243.146.148, repository.apache.org/2a01:4f8:171:1513:0:0:0:2] failed:
Connection refused (Connection refused)
	at org.apache.maven.artifact.deployer.DefaultArtifactDeployer.deploy(DefaultArtifactDeployer.java:146)
	at hudson.maven.reporters.MavenArtifactRecord.deploy(MavenArtifactRecord.java:198)
	at hudson.maven.RedeployPublisher.perform(RedeployPublisher.java:176)
	at hudson.tasks.BuildStepMonitor$1.perform(BuildStepMonitor.java:20)
	at hudson.model.AbstractBuild$AbstractBuildExecution.perform(AbstractBuild.java:741)
	at hudson.model.AbstractBuild$AbstractBuildExecution.performAllBuildSteps(AbstractBuild.java:690)
	at hudson.maven.MavenModuleSetBuild$MavenModuleSetBuildExecution.post2(MavenModuleSetBuild.java:1074)
	at hudson.model.AbstractBuild$AbstractBuildExecution.post(AbstractBuild.java:635)
	at hudson.model.Run.execute(Run.java:1840)
	at hudson.maven.MavenModuleSetBuild.run(MavenModuleSetBuild.java:543)
	at hudson.model.ResourceController.execute(ResourceController.java:97)
	at hudson.model.Executor.run(Executor.java:429)
Caused by: org.eclipse.aether.deployment.DeploymentException: Failed to retrieve remote metadata
org.apache.cxf:apache-cxf:3.4.1-SNAPSHOT/maven-metadata.xml: Could not transfer metadata org.apache.cxf:apache-cxf:3.4.1-SNAPSHOT/maven-metadata.xml
from/to apache.snapshots.https (https://repository.apache.org/content/repositories/snapshots):
Connect to repository.apache.org:443 [repository.apache.org/136.243.146.148, repository.apache.org/2a01:4f8:171:1513:0:0:0:2]
failed: Connection refused (Connection refused)
	at org.eclipse.aether.internal.impl.DefaultDeployer.upload(DefaultDeployer.java:425)
	at org.eclipse.aether.internal.impl.DefaultDeployer.deploy(DefaultDeployer.java:268)
	at org.eclipse.aether.internal.impl.DefaultDeployer.deploy(DefaultDeployer.java:223)
	at org.eclipse.aether.internal.impl.DefaultRepositorySystem.deploy(DefaultRepositorySystem.java:384)
	at org.apache.maven.artifact.deployer.DefaultArtifactDeployer.deploy(DefaultArtifactDeployer.java:142)
	... 11 more
Caused by: org.eclipse.aether.transfer.MetadataTransferException: Could not transfer metadata
org.apache.cxf:apache-cxf:3.4.1-SNAPSHOT/maven-metadata.xml from/to apache.snapshots.https
(https://repository.apache.org/content/repositories/snapshots): Connect to repository.apache.org:443
[repository.apache.org/136.243.146.148, repository.apache.org/2a01:4f8:171:1513:0:0:0:2] failed:
Connection refused (Connection refused)
	at org.eclipse.aether.connector.basic.MetadataTransportListener.transferFailed(MetadataTransportListener.java:52)
	at org.eclipse.aether.connector.basic.BasicRepositoryConnector$TaskRunner.run(BasicRepositoryConnector.java:365)
	at org.eclipse.aether.util.concurrency.RunnableErrorForwarder$1.run(RunnableErrorForwarder.java:75)
	at org.eclipse.aether.connector.basic.BasicRepositoryConnector$DirectExecutor.execute(BasicRepositoryConnector.java:583)
	at org.eclipse.aether.connector.basic.BasicRepositoryConnector.get(BasicRepositoryConnector.java:232)
	at org.eclipse.aether.internal.impl.DefaultDeployer.upload(DefaultDeployer.java:395)
	... 15 more
Caused by: org.apache.maven.wagon.TransferFailedException: Connect to repository.apache.org:443
[repository.apache.org/136.243.146.148, repository.apache.org/2a01:4f8:171:1513:0:0:0:2] failed:
Connection refused (Connection refused)
	at org.apache.maven.wagon.shared.http.AbstractHttpClientWagon.fillInputData(AbstractHttpClientWagon.java:1206)
	at org.apache.maven.wagon.shared.http.AbstractHttpClientWagon.fillInputData(AbstractHttpClientWagon.java:1094)
	at org.apache.maven.wagon.StreamWagon.getInputStream(StreamWagon.java:126)
	at org.apache.maven.wagon.StreamWagon.getIfNewer(StreamWagon.java:88)
	at org.apache.maven.wagon.StreamWagon.get(StreamWagon.java:61)
	at org.eclipse.aether.transport.wagon.WagonTransporter$GetTaskRunner.run(WagonTransporter.java:567)
	at org.eclipse.aether.transport.wagon.WagonTransporter.execute(WagonTransporter.java:435)
	at org.eclipse.aether.transport.wagon.WagonTransporter.get(WagonTransporter.java:412)
	at org.eclipse.aether.connector.basic.BasicRepositoryConnector$GetTaskRunner.runTask(BasicRepositoryConnector.java:453)
	at org.eclipse.aether.connector.basic.BasicRepositoryConnector$TaskRunner.run(BasicRepositoryConnector.java:360)
	... 19 more
Caused by: org.apache.http.conn.HttpHostConnectException: Connect to repository.apache.org:443
[repository.apache.org/136.243.146.148, repository.apache.org/2a01:4f8:171:1513:0:0:0:2] failed:
Connection refused (Connection refused)
	at org.apache.http.impl.conn.DefaultHttpClientConnectionOperator.connect(DefaultHttpClientConnectionOperator.java:156)
	at org.apache.http.impl.conn.PoolingHttpClientConnectionManager.connect(PoolingHttpClientConnectionManager.java:374)
	at org.apache.http.impl.execchain.MainClientExec.establishRoute(MainClientExec.java:393)
	at org.apache.http.impl.execchain.MainClientExec.execute(MainClientExec.java:236)
	at org.apache.http.impl.execchain.ProtocolExec.execute(ProtocolExec.java:186)
	at org.apache.http.impl.execchain.RetryExec.execute(RetryExec.java:89)
	at org.apache.http.impl.execchain.RedirectExec.execute(RedirectExec.java:110)
	at org.apache.http.impl.client.InternalHttpClient.doExecute(InternalHttpClient.java:185)
	at org.apache.http.impl.client.CloseableHttpClient.execute(CloseableHttpClient.java:83)
	at org.apache.maven.wagon.shared.http.AbstractHttpClientWagon.execute(AbstractHttpClientWagon.java:958)
	at org.apache.maven.wagon.shared.http.AbstractHttpClientWagon.fillInputData(AbstractHttpClientWagon.java:1117)
	... 28 more
Caused by: java.net.ConnectException: Connection refused (Connection refused)
	at java.net.PlainSocketImpl.socketConnect(Native Method)
	at java.net.AbstractPlainSocketImpl.doConnect(AbstractPlainSocketImpl.java:350)
	at java.net.AbstractPlainSocketImpl.connectToAddress(AbstractPlainSocketImpl.java:206)
	at java.net.AbstractPlainSocketImpl.connect(AbstractPlainSocketImpl.java:188)
	at java.net.SocksSocketImpl.connect(SocksSocketImpl.java:392)
	at java.net.Socket.connect(Socket.java:589)
	at org.apache.http.conn.ssl.SSLConnectionSocketFactory.connectSocket(SSLConnectionSocketFactory.java:368)
	at org.apache.http.impl.conn.DefaultHttpClientConnectionOperator.connect(DefaultHttpClientConnectionOperator.java:142)
	... 38 more
[INFO] Deployment failed after 13 sec
Build step 'Deploy artifacts to Maven repository' changed build result to FAILURE

Mime
View raw message