cxf-notifications mailing list archives

Site index · List index
Message view « Date » · « Thread »
Top « Date » · « Thread »
From Apache Jenkins Server <jenk...@builds.apache.org>
Subject Build failed in Jenkins: CXF-3.2-deploy #69
Date Tue, 02 Oct 2018 11:16:15 GMT
See <https://builds.apache.org/job/CXF-3.2-deploy/69/display/redirect?page=changes>

Changes:

[coheigea] CXF-7858 - Base64 empty string encoding issue

------------------------------------------
[...truncated 4.16 MB...]
[INFO] --- maven-compiler-plugin:3.7.0:compile (default-compile) @ cxf-systests-rs-sse-undertow
---
[INFO] No sources to compile
[INFO] 
[INFO] --- maven-resources-plugin:3.0.2:testResources (default-testResources) @ cxf-systests-rs-sse-undertow
---
[INFO] Using 'UTF-8' encoding to copy filtered resources.
[INFO] Copying 0 resource
[INFO] skip non existing resourceDirectory <https://builds.apache.org/job/CXF-3.2-deploy/ws/systests/rs-sse/rs-sse-undertow/src/test/resources>
[INFO] skip non existing resourceDirectory <https://builds.apache.org/job/CXF-3.2-deploy/ws/systests/rs-sse/rs-sse-undertow/target/generated/src/test/resources>
[INFO] Copying 3 resources
[INFO] 
[INFO] --- maven-compiler-plugin:3.7.0:testCompile (default-testCompile) @ cxf-systests-rs-sse-undertow
---
[INFO] Changes detected - recompiling the module!
[INFO] Compiling 2 source files to <https://builds.apache.org/job/CXF-3.2-deploy/ws/systests/rs-sse/rs-sse-undertow/target/test-classes>
[INFO] 
[INFO] --- maven-surefire-plugin:2.21.0:test (default-test) @ cxf-systests-rs-sse-undertow
---
[INFO] Tests are skipped.
[INFO] 
[INFO] --- maven-jar-plugin:3.1.0:jar (default-jar) @ cxf-systests-rs-sse-undertow ---
[INFO] Building jar: <https://builds.apache.org/job/CXF-3.2-deploy/ws/systests/rs-sse/rs-sse-undertow/target/cxf-systests-rs-sse-undertow-3.2.7-SNAPSHOT.jar>
[INFO] 
[INFO] --- maven-source-plugin:3.0.1:jar-no-fork (attach-sources) @ cxf-systests-rs-sse-undertow
---
[INFO] Building jar: <https://builds.apache.org/job/CXF-3.2-deploy/ws/systests/rs-sse/rs-sse-undertow/target/cxf-systests-rs-sse-undertow-3.2.7-SNAPSHOT-sources.jar>
[INFO] 
[INFO] --- maven-javadoc-plugin:3.0.1:jar (attach-javadocs) @ cxf-systests-rs-sse-undertow
---
[INFO] 
[INFO] --- maven-jar-plugin:3.1.0:test-jar (attach-sources) @ cxf-systests-rs-sse-undertow
---
[INFO] Building jar: <https://builds.apache.org/job/CXF-3.2-deploy/ws/systests/rs-sse/rs-sse-undertow/target/cxf-systests-rs-sse-undertow-3.2.7-SNAPSHOT-tests.jar>
[INFO] 
[INFO] --- maven-install-plugin:2.5.2:install (default-install) @ cxf-systests-rs-sse-undertow
---
[INFO] Installing <https://builds.apache.org/job/CXF-3.2-deploy/ws/systests/rs-sse/rs-sse-undertow/target/cxf-systests-rs-sse-undertow-3.2.7-SNAPSHOT.jar>
to /home/jenkins/jenkins-slave/maven-repositories/0/org/apache/cxf/systests/cxf-systests-rs-sse-undertow/3.2.7-SNAPSHOT/cxf-systests-rs-sse-undertow-3.2.7-SNAPSHOT.jar
[INFO] Installing <https://builds.apache.org/job/CXF-3.2-deploy/ws/systests/rs-sse/rs-sse-undertow/pom.xml>
to /home/jenkins/jenkins-slave/maven-repositories/0/org/apache/cxf/systests/cxf-systests-rs-sse-undertow/3.2.7-SNAPSHOT/cxf-systests-rs-sse-undertow-3.2.7-SNAPSHOT.pom
[INFO] Installing <https://builds.apache.org/job/CXF-3.2-deploy/ws/systests/rs-sse/rs-sse-undertow/target/cxf-systests-rs-sse-undertow-3.2.7-SNAPSHOT-sources.jar>
to /home/jenkins/jenkins-slave/maven-repositories/0/org/apache/cxf/systests/cxf-systests-rs-sse-undertow/3.2.7-SNAPSHOT/cxf-systests-rs-sse-undertow-3.2.7-SNAPSHOT-sources.jar
[INFO] Installing <https://builds.apache.org/job/CXF-3.2-deploy/ws/systests/rs-sse/rs-sse-undertow/target/cxf-systests-rs-sse-undertow-3.2.7-SNAPSHOT-tests.jar>
to /home/jenkins/jenkins-slave/maven-repositories/0/org/apache/cxf/systests/cxf-systests-rs-sse-undertow/3.2.7-SNAPSHOT/cxf-systests-rs-sse-undertow-3.2.7-SNAPSHOT-tests.jar
[INFO] 
[INFO] ------------------------------------------------------------------------
[INFO] Building Apache CXF MicroProfile TCKs 3.2.7-SNAPSHOT
[INFO] ------------------------------------------------------------------------
[INFO] 
[INFO] --- maven-clean-plugin:3.1.0:clean (default-clean) @ cxf-microprofile-tck ---
[INFO] Deleting <https://builds.apache.org/job/CXF-3.2-deploy/ws/systests/microprofile/target>
[INFO] 
[INFO] --- maven-enforcer-plugin:3.0.0-M1:enforce (enforce-maven) @ cxf-microprofile-tck ---
[INFO] 
[INFO] --- maven-bundle-plugin:2.5.4:cleanVersions (versions) @ cxf-microprofile-tck ---
[INFO] 
[INFO] --- cxf-xml2fastinfoset-plugin:3.4.1:xml2fastinfoset (xml2fastinfoset) @ cxf-microprofile-tck
---
[INFO] 
[INFO] --- maven-remote-resources-plugin:1.5:process (default) @ cxf-microprofile-tck ---
[INFO] 
[INFO] --- maven-source-plugin:3.0.1:jar-no-fork (attach-sources) @ cxf-microprofile-tck ---
[INFO] 
[INFO] --- maven-javadoc-plugin:3.0.1:jar (attach-javadocs) @ cxf-microprofile-tck ---
[INFO] Not executing Javadoc as the project is not a Java classpath-capable package
[INFO] 
[INFO] --- maven-install-plugin:2.5.2:install (default-install) @ cxf-microprofile-tck ---
[INFO] Installing <https://builds.apache.org/job/CXF-3.2-deploy/ws/systests/microprofile/pom.xml>
to /home/jenkins/jenkins-slave/maven-repositories/0/org/apache/cxf/systests/cxf-microprofile-tck/3.2.7-SNAPSHOT/cxf-microprofile-tck-3.2.7-SNAPSHOT.pom
[INFO] 
[INFO] ------------------------------------------------------------------------
[INFO] Building Apache CXF MicroProfile Async Sys Tests 3.2.7-SNAPSHOT
[INFO] ------------------------------------------------------------------------
[INFO] 
[INFO] --- maven-clean-plugin:3.1.0:clean (default-clean) @ cxf-microprofile-async ---
[INFO] Deleting <https://builds.apache.org/job/CXF-3.2-deploy/ws/systests/microprofile/client/async/target>
[INFO] 
[INFO] --- maven-enforcer-plugin:3.0.0-M1:enforce (enforce-maven) @ cxf-microprofile-async
---
[INFO] 
[INFO] --- maven-bundle-plugin:2.5.4:cleanVersions (versions) @ cxf-microprofile-async ---
[INFO] 
[INFO] --- cxf-xml2fastinfoset-plugin:3.4.1:xml2fastinfoset (xml2fastinfoset) @ cxf-microprofile-async
---
[INFO] 
[INFO] --- maven-remote-resources-plugin:1.5:process (default) @ cxf-microprofile-async ---
[INFO] 
[INFO] --- maven-resources-plugin:3.0.2:resources (default-resources) @ cxf-microprofile-async
---
[INFO] Using 'UTF-8' encoding to copy filtered resources.
[INFO] skip non existing resourceDirectory <https://builds.apache.org/job/CXF-3.2-deploy/ws/systests/microprofile/client/async/src/main/java>
[INFO] skip non existing resourceDirectory <https://builds.apache.org/job/CXF-3.2-deploy/ws/systests/microprofile/client/async/src/main/resources>
[INFO] skip non existing resourceDirectory <https://builds.apache.org/job/CXF-3.2-deploy/ws/systests/microprofile/client/async/src/main/resources-filtered>
[INFO] skip non existing resourceDirectory <https://builds.apache.org/job/CXF-3.2-deploy/ws/systests/microprofile/client/async/target/generated/src/main/resources>
[INFO] Copying 3 resources
[INFO] 
[INFO] --- maven-compiler-plugin:3.7.0:compile (default-compile) @ cxf-microprofile-async
---
[INFO] No sources to compile
[INFO] 
[INFO] --- maven-resources-plugin:3.0.2:testResources (default-testResources) @ cxf-microprofile-async
---
[INFO] Using 'UTF-8' encoding to copy filtered resources.
[INFO] Copying 0 resource
[INFO] skip non existing resourceDirectory <https://builds.apache.org/job/CXF-3.2-deploy/ws/systests/microprofile/client/async/src/test/resources>
[INFO] skip non existing resourceDirectory <https://builds.apache.org/job/CXF-3.2-deploy/ws/systests/microprofile/client/async/target/generated/src/test/resources>
[INFO] Copying 3 resources
[INFO] 
[INFO] --- maven-compiler-plugin:3.7.0:testCompile (default-testCompile) @ cxf-microprofile-async
---
[INFO] Changes detected - recompiling the module!
[INFO] Compiling 5 source files to <https://builds.apache.org/job/CXF-3.2-deploy/ws/systests/microprofile/client/async/target/test-classes>
[INFO] 
[INFO] --- maven-surefire-plugin:2.21.0:test (default-test) @ cxf-microprofile-async ---
[INFO] Tests are skipped.
[INFO] 
[INFO] --- maven-jar-plugin:3.1.0:jar (default-jar) @ cxf-microprofile-async ---
[INFO] Building jar: <https://builds.apache.org/job/CXF-3.2-deploy/ws/systests/microprofile/client/async/target/cxf-microprofile-async-3.2.7-SNAPSHOT.jar>
[INFO] 
[INFO] --- maven-source-plugin:3.0.1:jar-no-fork (attach-sources) @ cxf-microprofile-async
---
[INFO] Building jar: <https://builds.apache.org/job/CXF-3.2-deploy/ws/systests/microprofile/client/async/target/cxf-microprofile-async-3.2.7-SNAPSHOT-sources.jar>
[INFO] 
[INFO] --- maven-javadoc-plugin:3.0.1:jar (attach-javadocs) @ cxf-microprofile-async ---
[INFO] 
[INFO] --- maven-install-plugin:2.5.2:install (default-install) @ cxf-microprofile-async ---
[INFO] Installing <https://builds.apache.org/job/CXF-3.2-deploy/ws/systests/microprofile/client/async/target/cxf-microprofile-async-3.2.7-SNAPSHOT.jar>
to /home/jenkins/jenkins-slave/maven-repositories/0/org/apache/cxf/systests/cxf-microprofile-async/3.2.7-SNAPSHOT/cxf-microprofile-async-3.2.7-SNAPSHOT.jar
[INFO] Installing <https://builds.apache.org/job/CXF-3.2-deploy/ws/systests/microprofile/client/async/pom.xml>
to /home/jenkins/jenkins-slave/maven-repositories/0/org/apache/cxf/systests/cxf-microprofile-async/3.2.7-SNAPSHOT/cxf-microprofile-async-3.2.7-SNAPSHOT.pom
[INFO] Installing <https://builds.apache.org/job/CXF-3.2-deploy/ws/systests/microprofile/client/async/target/cxf-microprofile-async-3.2.7-SNAPSHOT-sources.jar>
to /home/jenkins/jenkins-slave/maven-repositories/0/org/apache/cxf/systests/cxf-microprofile-async/3.2.7-SNAPSHOT/cxf-microprofile-async-3.2.7-SNAPSHOT-sources.jar
[INFO] 
[INFO] ------------------------------------------------------------------------
[INFO] Building Apache CXF System Tests - MicroProfile Rest Client TCK on Weld 3.2.7-SNAPSHOT
[INFO] ------------------------------------------------------------------------
[INFO] 
[INFO] --- maven-clean-plugin:3.1.0:clean (default-clean) @ cxf-systests-microprofile-weld
---
[INFO] Deleting <https://builds.apache.org/job/CXF-3.2-deploy/ws/systests/microprofile/client/weld/target>
[INFO] 
[INFO] --- maven-enforcer-plugin:3.0.0-M1:enforce (enforce-maven) @ cxf-systests-microprofile-weld
---
[INFO] 
[INFO] --- maven-bundle-plugin:2.5.4:cleanVersions (versions) @ cxf-systests-microprofile-weld
---
[INFO] 
[INFO] --- cxf-xml2fastinfoset-plugin:3.4.1:xml2fastinfoset (xml2fastinfoset) @ cxf-systests-microprofile-weld
---
[INFO] 
[INFO] --- maven-remote-resources-plugin:1.5:process (default) @ cxf-systests-microprofile-weld
---
[INFO] 
[INFO] --- maven-resources-plugin:3.0.2:resources (default-resources) @ cxf-systests-microprofile-weld
---
[INFO] Using 'UTF-8' encoding to copy filtered resources.
[INFO] skip non existing resourceDirectory <https://builds.apache.org/job/CXF-3.2-deploy/ws/systests/microprofile/client/weld/src/main/java>
[INFO] skip non existing resourceDirectory <https://builds.apache.org/job/CXF-3.2-deploy/ws/systests/microprofile/client/weld/src/main/resources>
[INFO] skip non existing resourceDirectory <https://builds.apache.org/job/CXF-3.2-deploy/ws/systests/microprofile/client/weld/src/main/resources-filtered>
[INFO] skip non existing resourceDirectory <https://builds.apache.org/job/CXF-3.2-deploy/ws/systests/microprofile/client/weld/target/generated/src/main/resources>
[INFO] Copying 3 resources
[INFO] 
[INFO] --- maven-compiler-plugin:3.7.0:compile (default-compile) @ cxf-systests-microprofile-weld
---
[INFO] No sources to compile
[INFO] 
[INFO] --- wiremock-maven-plugin:2.7.0:run (default) @ cxf-systests-microprofile-weld ---
[INFO] Adding <https://builds.apache.org/job/CXF-3.2-deploy/ws/systests/microprofile/client/weld/target/test-classes>
to wiremock-maven-plugin classpath
[INFO] Adding <https://builds.apache.org/job/CXF-3.2-deploy/ws/systests/microprofile/client/weld/target/classes>
to wiremock-maven-plugin classpath
[INFO] Adding /home/jenkins/jenkins-slave/maven-repositories/0/javax/ws/rs/javax.ws.rs-api/2.1/javax.ws.rs-api-2.1.jar
to wiremock-maven-plugin classpath
[INFO] Starting WireMock with following params: --root-dir=<https://builds.apache.org/job/CXF-3.2-deploy/ws/systests/microprofile/client/weld/target/classes>
--port=8765
[INFO] Logging initialized @5135883ms
[INFO] jetty-9.2.22.v20170606
[INFO] Started o.e.j.s.ServletContextHandler@8597aa0{/__admin,null,AVAILABLE}
[INFO] Started o.e.j.s.ServletContextHandler@31be2d4a{/,null,AVAILABLE}
[WARNING] FAILED NetworkTrafficServerConnector@77bd1147{HTTP/1.1}{0.0.0.0:8765}: java.net.BindException:
Address already in use
java.net.BindException: Address already in use
    at sun.nio.ch.Net.bind0 (Native Method)
    at sun.nio.ch.Net.bind (Net.java:433)
    at sun.nio.ch.Net.bind (Net.java:425)
    at sun.nio.ch.ServerSocketChannelImpl.bind (ServerSocketChannelImpl.java:223)
    at sun.nio.ch.ServerSocketAdaptor.bind (ServerSocketAdaptor.java:74)
    at org.eclipse.jetty.server.ServerConnector.open (ServerConnector.java:321)
    at org.eclipse.jetty.server.AbstractNetworkConnector.doStart (AbstractNetworkConnector.java:80)
    at org.eclipse.jetty.server.ServerConnector.doStart (ServerConnector.java:236)
    at org.eclipse.jetty.util.component.AbstractLifeCycle.start (AbstractLifeCycle.java:68)
    at org.eclipse.jetty.server.Server.doStart (Server.java:366)
    at org.eclipse.jetty.util.component.AbstractLifeCycle.start (AbstractLifeCycle.java:68)
    at com.github.tomakehurst.wiremock.jetty9.JettyHttpServer.start (JettyHttpServer.java:133)
    at com.github.tomakehurst.wiremock.WireMockServer.start (WireMockServer.java:144)
    at com.github.tomakehurst.wiremock.standalone.WireMockServerRunner.run (WireMockServerRunner.java:76)
    at com.github.tomakehurst.wiremock.standalone.WireMockServerRunner.main (WireMockServerRunner.java:113)
    at uk.co.deliverymind.wiremock.maven.plugin.WireMockMojo.execute (WireMockMojo.java:22)
    at org.apache.maven.plugin.DefaultBuildPluginManager.executeMojo (DefaultBuildPluginManager.java:134)
    at org.apache.maven.lifecycle.internal.MojoExecutor.execute (MojoExecutor.java:208)
    at org.apache.maven.lifecycle.internal.MojoExecutor.execute (MojoExecutor.java:154)
    at org.apache.maven.lifecycle.internal.MojoExecutor.execute (MojoExecutor.java:146)
    at org.apache.maven.lifecycle.internal.LifecycleModuleBuilder.buildProject (LifecycleModuleBuilder.java:117)
    at org.apache.maven.lifecycle.internal.LifecycleModuleBuilder.buildProject (LifecycleModuleBuilder.java:81)
    at org.apache.maven.lifecycle.internal.builder.singlethreaded.SingleThreadedBuilder.build
(SingleThreadedBuilder.java:51)
    at org.apache.maven.lifecycle.internal.LifecycleStarter.execute (LifecycleStarter.java:128)
    at org.apache.maven.DefaultMaven.doExecute (DefaultMaven.java:309)
    at org.apache.maven.DefaultMaven.doExecute (DefaultMaven.java:194)
    at org.apache.maven.DefaultMaven.execute (DefaultMaven.java:107)
    at org.jvnet.hudson.maven3.launcher.Maven35Launcher.main (Maven35Launcher.java:130)
    at sun.reflect.NativeMethodAccessorImpl.invoke0 (Native Method)
    at sun.reflect.NativeMethodAccessorImpl.invoke (NativeMethodAccessorImpl.java:62)
    at sun.reflect.DelegatingMethodAccessorImpl.invoke (DelegatingMethodAccessorImpl.java:43)
    at java.lang.reflect.Method.invoke (Method.java:498)
    at org.codehaus.plexus.classworlds.launcher.Launcher.launchEnhanced (Launcher.java:289)
    at org.codehaus.plexus.classworlds.launcher.Launcher.launch (Launcher.java:229)
    at jenkins.maven3.agent.Maven35Main.launch (Maven35Main.java:176)
    at sun.reflect.NativeMethodAccessorImpl.invoke0 (Native Method)
    at sun.reflect.NativeMethodAccessorImpl.invoke (NativeMethodAccessorImpl.java:62)
    at sun.reflect.DelegatingMethodAccessorImpl.invoke (DelegatingMethodAccessorImpl.java:43)
    at java.lang.reflect.Method.invoke (Method.java:498)
    at hudson.maven.Maven3Builder.call (Maven3Builder.java:139)
    at hudson.maven.Maven3Builder.call (Maven3Builder.java:70)
    at hudson.remoting.UserRequest.perform (UserRequest.java:212)
    at hudson.remoting.UserRequest.perform (UserRequest.java:54)
    at hudson.remoting.Request$2.run (Request.java:369)
    at hudson.remoting.InterceptingExecutorService$1.call (InterceptingExecutorService.java:72)
    at java.util.concurrent.FutureTask.run (FutureTask.java:266)
    at java.util.concurrent.ThreadPoolExecutor.runWorker (ThreadPoolExecutor.java:1149)
    at java.util.concurrent.ThreadPoolExecutor$Worker.run (ThreadPoolExecutor.java:624)
    at java.lang.Thread.run (Thread.java:748)
[WARNING] FAILED org.eclipse.jetty.server.Server@5c87f55d: java.net.BindException: Address
already in use
java.net.BindException: Address already in use
    at sun.nio.ch.Net.bind0 (Native Method)
    at sun.nio.ch.Net.bind (Net.java:433)
    at sun.nio.ch.Net.bind (Net.java:425)
    at sun.nio.ch.ServerSocketChannelImpl.bind (ServerSocketChannelImpl.java:223)
    at sun.nio.ch.ServerSocketAdaptor.bind (ServerSocketAdaptor.java:74)
    at org.eclipse.jetty.server.ServerConnector.open (ServerConnector.java:321)
    at org.eclipse.jetty.server.AbstractNetworkConnector.doStart (AbstractNetworkConnector.java:80)
    at org.eclipse.jetty.server.ServerConnector.doStart (ServerConnector.java:236)
    at org.eclipse.jetty.util.component.AbstractLifeCycle.start (AbstractLifeCycle.java:68)
    at org.eclipse.jetty.server.Server.doStart (Server.java:366)
    at org.eclipse.jetty.util.component.AbstractLifeCycle.start (AbstractLifeCycle.java:68)
    at com.github.tomakehurst.wiremock.jetty9.JettyHttpServer.start (JettyHttpServer.java:133)
    at com.github.tomakehurst.wiremock.WireMockServer.start (WireMockServer.java:144)
    at com.github.tomakehurst.wiremock.standalone.WireMockServerRunner.run (WireMockServerRunner.java:76)
    at com.github.tomakehurst.wiremock.standalone.WireMockServerRunner.main (WireMockServerRunner.java:113)
    at uk.co.deliverymind.wiremock.maven.plugin.WireMockMojo.execute (WireMockMojo.java:22)
    at org.apache.maven.plugin.DefaultBuildPluginManager.executeMojo (DefaultBuildPluginManager.java:134)
    at org.apache.maven.lifecycle.internal.MojoExecutor.execute (MojoExecutor.java:208)
    at org.apache.maven.lifecycle.internal.MojoExecutor.execute (MojoExecutor.java:154)
    at org.apache.maven.lifecycle.internal.MojoExecutor.execute (MojoExecutor.java:146)
    at org.apache.maven.lifecycle.internal.LifecycleModuleBuilder.buildProject (LifecycleModuleBuilder.java:117)
    at org.apache.maven.lifecycle.internal.LifecycleModuleBuilder.buildProject (LifecycleModuleBuilder.java:81)
    at org.apache.maven.lifecycle.internal.builder.singlethreaded.SingleThreadedBuilder.build
(SingleThreadedBuilder.java:51)
    at org.apache.maven.lifecycle.internal.LifecycleStarter.execute (LifecycleStarter.java:128)
    at org.apache.maven.DefaultMaven.doExecute (DefaultMaven.java:309)
    at org.apache.maven.DefaultMaven.doExecute (DefaultMaven.java:194)
    at org.apache.maven.DefaultMaven.execute (DefaultMaven.java:107)
    at org.jvnet.hudson.maven3.launcher.Maven35Launcher.main (Maven35Launcher.java:130)
    at sun.reflect.NativeMethodAccessorImpl.invoke0 (Native Method)
    at sun.reflect.NativeMethodAccessorImpl.invoke (NativeMethodAccessorImpl.java:62)
    at sun.reflect.DelegatingMethodAccessorImpl.invoke (DelegatingMethodAccessorImpl.java:43)
    at java.lang.reflect.Method.invoke (Method.java:498)
    at org.codehaus.plexus.classworlds.launcher.Launcher.launchEnhanced (Launcher.java:289)
    at org.codehaus.plexus.classworlds.launcher.Launcher.launch (Launcher.java:229)
    at jenkins.maven3.agent.Maven35Main.launch (Maven35Main.java:176)
    at sun.reflect.NativeMethodAccessorImpl.invoke0 (Native Method)
    at sun.reflect.NativeMethodAccessorImpl.invoke (NativeMethodAccessorImpl.java:62)
    at sun.reflect.DelegatingMethodAccessorImpl.invoke (DelegatingMethodAccessorImpl.java:43)
    at java.lang.reflect.Method.invoke (Method.java:498)
    at hudson.maven.Maven3Builder.call (Maven3Builder.java:139)
    at hudson.maven.Maven3Builder.call (Maven3Builder.java:70)
    at hudson.remoting.UserRequest.perform (UserRequest.java:212)
    at hudson.remoting.UserRequest.perform (UserRequest.java:54)
    at hudson.remoting.Request$2.run (Request.java:369)
    at hudson.remoting.InterceptingExecutorService$1.call (InterceptingExecutorService.java:72)
    at java.util.concurrent.FutureTask.run (FutureTask.java:266)
    at java.util.concurrent.ThreadPoolExecutor.runWorker (ThreadPoolExecutor.java:1149)
    at java.util.concurrent.ThreadPoolExecutor$Worker.run (ThreadPoolExecutor.java:624)
    at java.lang.Thread.run (Thread.java:748)
java.lang.RuntimeException: java.net.BindException: Address already in use
ERROR: Maven JVM terminated unexpectedly with exit code 1

Mime
View raw message