cxf-notifications mailing list archives

Site index · List index
Message view « Date » · « Thread »
Top « Date » · « Thread »
From Apache Jenkins Server <jenk...@builds.apache.org>
Subject Build failed in Jenkins: CXF-xjc-utils #68
Date Wed, 09 Aug 2017 18:52:57 GMT
See <https://builds.apache.org/job/CXF-xjc-utils/68/display/redirect?page=changes>

Changes:

[dkulp] Forgot to remove a println

------------------------------------------
[...truncated 28.46 KB...]
[INFO] Copying 3 resources
[INFO] 
[INFO] --- maven-compiler-plugin:3.1:testCompile (default-testCompile) @ cxf-xjc-dv-test ---
[INFO] Changes detected - recompiling the module!
[INFO] Compiling 9 source files to <https://builds.apache.org/job/CXF-xjc-utils/ws/dv-test/target/test-classes>
[INFO] 
[INFO] --- maven-surefire-plugin:2.17:test (default-test) @ cxf-xjc-dv-test ---
[INFO] Surefire report directory: <https://builds.apache.org/job/CXF-xjc-utils/ws/dv-test/target/surefire-reports>

-------------------------------------------------------
 T E S T S
-------------------------------------------------------
Running org.apache.cxf.xjc.dv.DefaultValueTest
Tests run: 1, Failures: 0, Errors: 1, Skipped: 0, Time elapsed: 0.074 sec <<< FAILURE!
- in org.apache.cxf.xjc.dv.DefaultValueTest
testFooDefaultValues(org.apache.cxf.xjc.dv.DefaultValueTest)  Time elapsed: 0.022 sec  <<<
ERROR!
java.lang.NullPointerException: null
	at org.apache.cxf.xjc.dv.DefaultValueTest.assertDefaultAttributeValues(DefaultValueTest.java:119)
	at org.apache.cxf.xjc.dv.DefaultValueTest.testFooDefaultValues(DefaultValueTest.java:58)


Results :

Tests in error: 
  DefaultValueTest.testFooDefaultValues:58->assertDefaultAttributeValues:119 NullPointer

Tests run: 1, Failures: 0, Errors: 1, Skipped: 0

[ERROR] There are test failures.

Please refer to <https://builds.apache.org/job/CXF-xjc-utils/ws/dv-test/target/surefire-reports>
for the individual test results.
[JENKINS] Recording test results
[INFO] 
[INFO] --- maven-jar-plugin:2.2:jar (default-jar) @ cxf-xjc-dv-test ---
[INFO] Building jar: <https://builds.apache.org/job/CXF-xjc-utils/ws/dv-test/target/cxf-xjc-dv-test-3.2.0-SNAPSHOT.jar>
[INFO] 
[INFO] --- maven-site-plugin:3.0-beta-3:attach-descriptor (attach-descriptor) @ cxf-xjc-dv-test
---
[INFO] 
[INFO] --- maven-install-plugin:2.3:install (default-install) @ cxf-xjc-dv-test ---
[INFO] Installing <https://builds.apache.org/job/CXF-xjc-utils/ws/dv-test/target/cxf-xjc-dv-test-3.2.0-SNAPSHOT.jar>
to <https://builds.apache.org/job/CXF-xjc-utils/ws/.repository/org/apache/cxf/xjcplugins/tests/cxf-xjc-dv-test/3.2.0-SNAPSHOT/cxf-xjc-dv-test-3.2.0-SNAPSHOT.jar>
[INFO] Installing <https://builds.apache.org/job/CXF-xjc-utils/ws/dv-test/pom.xml> to
<https://builds.apache.org/job/CXF-xjc-utils/ws/.repository/org/apache/cxf/xjcplugins/tests/cxf-xjc-dv-test/3.2.0-SNAPSHOT/cxf-xjc-dv-test-3.2.0-SNAPSHOT.pom>
[INFO] 
[INFO] --- maven-deploy-plugin:2.8.1:deploy (default-deploy) @ cxf-xjc-dv-test ---
Downloading: https://repository.apache.org/content/repositories/snapshots/org/apache/cxf/xjcplugins/tests/cxf-xjc-dv-test/3.2.0-SNAPSHOT/maven-metadata.xml
Downloaded: https://repository.apache.org/content/repositories/snapshots/org/apache/cxf/xjcplugins/tests/cxf-xjc-dv-test/3.2.0-SNAPSHOT/maven-metadata.xml
(1010 B at 1.7 KB/sec)
Uploading: https://repository.apache.org/content/repositories/snapshots/org/apache/cxf/xjcplugins/tests/cxf-xjc-dv-test/3.2.0-SNAPSHOT/cxf-xjc-dv-test-3.2.0-20170809.185210-8.jar
Uploaded: https://repository.apache.org/content/repositories/snapshots/org/apache/cxf/xjcplugins/tests/cxf-xjc-dv-test/3.2.0-SNAPSHOT/cxf-xjc-dv-test-3.2.0-20170809.185210-8.jar
(8 KB at 8.7 KB/sec)
Uploading: https://repository.apache.org/content/repositories/snapshots/org/apache/cxf/xjcplugins/tests/cxf-xjc-dv-test/3.2.0-SNAPSHOT/cxf-xjc-dv-test-3.2.0-20170809.185210-8.pom
Uploaded: https://repository.apache.org/content/repositories/snapshots/org/apache/cxf/xjcplugins/tests/cxf-xjc-dv-test/3.2.0-SNAPSHOT/cxf-xjc-dv-test-3.2.0-20170809.185210-8.pom
(4 KB at 3.8 KB/sec)
Downloading: https://repository.apache.org/content/repositories/snapshots/org/apache/cxf/xjcplugins/tests/cxf-xjc-dv-test/maven-metadata.xml
Downloaded: https://repository.apache.org/content/repositories/snapshots/org/apache/cxf/xjcplugins/tests/cxf-xjc-dv-test/maven-metadata.xml
(646 B at 1.2 KB/sec)
Uploading: https://repository.apache.org/content/repositories/snapshots/org/apache/cxf/xjcplugins/tests/cxf-xjc-dv-test/3.2.0-SNAPSHOT/maven-metadata.xml
Uploaded: https://repository.apache.org/content/repositories/snapshots/org/apache/cxf/xjcplugins/tests/cxf-xjc-dv-test/3.2.0-SNAPSHOT/maven-metadata.xml
(1010 B at 1.2 KB/sec)
Uploading: https://repository.apache.org/content/repositories/snapshots/org/apache/cxf/xjcplugins/tests/cxf-xjc-dv-test/maven-metadata.xml
Uploaded: https://repository.apache.org/content/repositories/snapshots/org/apache/cxf/xjcplugins/tests/cxf-xjc-dv-test/maven-metadata.xml
(646 B at 0.8 KB/sec)
[INFO]                                                                         
[INFO] ------------------------------------------------------------------------
[INFO] Building Apache CXF XJC toString Plugin 3.2.0-SNAPSHOT
[INFO] ------------------------------------------------------------------------
[INFO] 
[INFO] --- maven-clean-plugin:2.3:clean (default-clean) @ cxf-xjc-ts ---
[INFO] Deleting file set: <https://builds.apache.org/job/CXF-xjc-utils/ws/ts/target>
(included: [**], excluded: [])
[INFO] 
[INFO] --- maven-checkstyle-plugin:2.9.1:checkstyle (validate) @ cxf-xjc-ts ---
[INFO] Starting audit...
Audit done.

[INFO] 
[INFO] --- maven-pmd-plugin:3.0.1:pmd (pmd) @ cxf-xjc-ts ---
[INFO] 
[INFO] --- maven-pmd-plugin:3.0.1:check (validate) @ cxf-xjc-ts ---
[INFO] 
[INFO] 
[INFO] --- maven-remote-resources-plugin:1.5:process (process-resource-bundles) @ cxf-xjc-ts
---
[INFO] 
[INFO] --- maven-resources-plugin:2.6:resources (default-resources) @ cxf-xjc-ts ---
[INFO] Using 'UTF-8' encoding to copy filtered resources.
[INFO] Copying 1 resource
[INFO] Copying 3 resources
[INFO] 
[INFO] --- maven-compiler-plugin:3.1:compile (default-compile) @ cxf-xjc-ts ---
[INFO] Changes detected - recompiling the module!
[INFO] Compiling 2 source files to <https://builds.apache.org/job/CXF-xjc-utils/ws/ts/target/classes>
[INFO] 
[INFO] --- maven-resources-plugin:2.6:testResources (default-testResources) @ cxf-xjc-ts ---
[INFO] Not copying test resources
[INFO] 
[INFO] --- maven-compiler-plugin:3.1:testCompile (default-testCompile) @ cxf-xjc-ts ---
[INFO] Not compiling test sources
[INFO] 
[INFO] --- maven-surefire-plugin:2.17:test (default-test) @ cxf-xjc-ts ---
[INFO] Tests are skipped.
[INFO] 
[INFO] --- maven-jar-plugin:2.2:jar (default-jar) @ cxf-xjc-ts ---
[INFO] Building jar: <https://builds.apache.org/job/CXF-xjc-utils/ws/ts/target/cxf-xjc-ts-3.2.0-SNAPSHOT.jar>
[INFO] 
[INFO] --- maven-site-plugin:3.0-beta-3:attach-descriptor (attach-descriptor) @ cxf-xjc-ts
---
[INFO] 
[INFO] --- maven-install-plugin:2.3:install (default-install) @ cxf-xjc-ts ---
[INFO] Installing <https://builds.apache.org/job/CXF-xjc-utils/ws/ts/target/cxf-xjc-ts-3.2.0-SNAPSHOT.jar>
to <https://builds.apache.org/job/CXF-xjc-utils/ws/.repository/org/apache/cxf/xjcplugins/cxf-xjc-ts/3.2.0-SNAPSHOT/cxf-xjc-ts-3.2.0-SNAPSHOT.jar>
[INFO] Installing <https://builds.apache.org/job/CXF-xjc-utils/ws/ts/pom.xml> to <https://builds.apache.org/job/CXF-xjc-utils/ws/.repository/org/apache/cxf/xjcplugins/cxf-xjc-ts/3.2.0-SNAPSHOT/cxf-xjc-ts-3.2.0-SNAPSHOT.pom>
[INFO] 
[INFO] --- maven-deploy-plugin:2.8.1:deploy (default-deploy) @ cxf-xjc-ts ---
Downloading: https://repository.apache.org/content/repositories/snapshots/org/apache/cxf/xjcplugins/cxf-xjc-ts/3.2.0-SNAPSHOT/maven-metadata.xml
Downloaded: https://repository.apache.org/content/repositories/snapshots/org/apache/cxf/xjcplugins/cxf-xjc-ts/3.2.0-SNAPSHOT/maven-metadata.xml
(999 B at 1.8 KB/sec)
Uploading: https://repository.apache.org/content/repositories/snapshots/org/apache/cxf/xjcplugins/cxf-xjc-ts/3.2.0-SNAPSHOT/cxf-xjc-ts-3.2.0-20170809.185220-8.jar
Uploaded: https://repository.apache.org/content/repositories/snapshots/org/apache/cxf/xjcplugins/cxf-xjc-ts/3.2.0-SNAPSHOT/cxf-xjc-ts-3.2.0-20170809.185220-8.jar
(13 KB at 13.3 KB/sec)
Uploading: https://repository.apache.org/content/repositories/snapshots/org/apache/cxf/xjcplugins/cxf-xjc-ts/3.2.0-SNAPSHOT/cxf-xjc-ts-3.2.0-20170809.185220-8.pom
Uploaded: https://repository.apache.org/content/repositories/snapshots/org/apache/cxf/xjcplugins/cxf-xjc-ts/3.2.0-SNAPSHOT/cxf-xjc-ts-3.2.0-20170809.185220-8.pom
(2 KB at 2.4 KB/sec)
Downloading: https://repository.apache.org/content/repositories/snapshots/org/apache/cxf/xjcplugins/cxf-xjc-ts/maven-metadata.xml
Downloaded: https://repository.apache.org/content/repositories/snapshots/org/apache/cxf/xjcplugins/cxf-xjc-ts/maven-metadata.xml
(635 B at 1.2 KB/sec)
Uploading: https://repository.apache.org/content/repositories/snapshots/org/apache/cxf/xjcplugins/cxf-xjc-ts/3.2.0-SNAPSHOT/maven-metadata.xml
Uploaded: https://repository.apache.org/content/repositories/snapshots/org/apache/cxf/xjcplugins/cxf-xjc-ts/3.2.0-SNAPSHOT/maven-metadata.xml
(999 B at 0.8 KB/sec)
Uploading: https://repository.apache.org/content/repositories/snapshots/org/apache/cxf/xjcplugins/cxf-xjc-ts/maven-metadata.xml
Uploaded: https://repository.apache.org/content/repositories/snapshots/org/apache/cxf/xjcplugins/cxf-xjc-ts/maven-metadata.xml
(635 B at 0.7 KB/sec)
[INFO]                                                                         
[INFO] ------------------------------------------------------------------------
[INFO] Building Apache CXF XJC toString Plugin Tests 3.2.0-SNAPSHOT
[INFO] ------------------------------------------------------------------------
[INFO] 
[INFO] --- maven-clean-plugin:2.3:clean (default-clean) @ cxf-xjc-ts-test ---
[INFO] Deleting file set: <https://builds.apache.org/job/CXF-xjc-utils/ws/ts-test/target>
(included: [**], excluded: [])
[INFO] 
[INFO] --- maven-checkstyle-plugin:2.9.1:checkstyle (validate) @ cxf-xjc-ts-test ---
[INFO] Starting audit...
Audit done.

[INFO] 
[INFO] --- maven-pmd-plugin:3.0.1:pmd (pmd) @ cxf-xjc-ts-test ---
[INFO] 
[INFO] --- maven-pmd-plugin:3.0.1:check (validate) @ cxf-xjc-ts-test ---
[INFO] 
[INFO] 
[INFO] --- maven-remote-resources-plugin:1.5:process (process-resource-bundles) @ cxf-xjc-ts-test
---
[INFO] 
[INFO] --- maven-resources-plugin:2.6:resources (default-resources) @ cxf-xjc-ts-test ---
[INFO] Using 'UTF-8' encoding to copy filtered resources.
[INFO] skip non existing resourceDirectory <https://builds.apache.org/job/CXF-xjc-utils/ws/ts-test/src/main/resources>
[INFO] Copying 3 resources
[INFO] 
[INFO] --- maven-compiler-plugin:3.1:compile (default-compile) @ cxf-xjc-ts-test ---
[INFO] No sources to compile
[INFO] 
[INFO] --- cxf-xjc-plugin:3.2.0-SNAPSHOT:xsdtojava-tests (default) @ cxf-xjc-ts-test ---
[INFO] ------------------------------------------------------------------------
[INFO] Reactor Summary:
[INFO] 
[INFO] Apache CXF XJC Utils .............................. SUCCESS [11.033s]
[INFO] Apache CXF XSD2Java Plugin ........................ SUCCESS [16.798s]
[INFO] Apache CXF XJC Default Value Plugin ............... SUCCESS [8.765s]
[INFO] Apache CXF XJC Default Value Plugin Tests ......... SUCCESS [21.756s]
[INFO] Apache CXF XJC toString Plugin .................... SUCCESS [9.461s]
[INFO] Apache CXF XJC toString Plugin Tests .............. FAILURE [2.585s]
[INFO] Apache CXF XJC Boolean Getter Plugin .............. SKIPPED
[INFO] Apache CXF XJC Boolean Getter Plugin Tests ........ SKIPPED
[INFO] Apache CXF XJC WSDL Extension Plugin .............. SKIPPED
[INFO] Apache CXF XJC WSDL Extension Plugin Tests ........ SKIPPED
[INFO] Apache CXF XJC Plugin To Workaround JAXB Bug 671 .. SKIPPED
[INFO] Apache CXF XJC Plugin To Workaround JAXB Bug 986 .. SKIPPED
[INFO] Apache CXF XJC Property Listener Plugin ........... SKIPPED
[INFO] Apache CXF XJC JavaDoc Plugin ..................... SKIPPED
[INFO] Apache CXF XJC Runtime ............................ SKIPPED
[INFO] ------------------------------------------------------------------------
[INFO] BUILD FAILURE
[INFO] ------------------------------------------------------------------------
[INFO] Total time: 1:24.822s
[INFO] Finished at: Wed Aug 09 18:52:30 UTC 2017
[INFO] Final Memory: 47M/696M
[INFO] ------------------------------------------------------------------------
Waiting for Jenkins to finish collecting data
[ERROR] Failed to execute goal org.apache.cxf:cxf-xjc-plugin:3.2.0-SNAPSHOT:xsdtojava-tests
(default) on project cxf-xjc-ts-test: Could not create runtime jar: Permission denied ->
[Help 1]
org.apache.maven.lifecycle.LifecycleExecutionException: Failed to execute goal org.apache.cxf:cxf-xjc-plugin:3.2.0-SNAPSHOT:xsdtojava-tests
(default) on project cxf-xjc-ts-test: Could not create runtime jar
	at org.apache.maven.lifecycle.internal.MojoExecutor.execute(MojoExecutor.java:217)
	at org.apache.maven.lifecycle.internal.MojoExecutor.execute(MojoExecutor.java:153)
	at org.apache.maven.lifecycle.internal.MojoExecutor.execute(MojoExecutor.java:145)
	at org.apache.maven.lifecycle.internal.LifecycleModuleBuilder.buildProject(LifecycleModuleBuilder.java:84)
	at org.apache.maven.lifecycle.internal.LifecycleModuleBuilder.buildProject(LifecycleModuleBuilder.java:59)
	at org.apache.maven.lifecycle.internal.LifecycleStarter.singleThreadedBuild(LifecycleStarter.java:183)
	at org.apache.maven.lifecycle.internal.LifecycleStarter.execute(LifecycleStarter.java:161)
	at org.apache.maven.DefaultMaven.doExecute(DefaultMaven.java:320)
	at org.apache.maven.DefaultMaven.execute(DefaultMaven.java:156)
	at org.jvnet.hudson.maven3.launcher.Maven3Launcher.main(Maven3Launcher.java:117)
	at sun.reflect.NativeMethodAccessorImpl.invoke0(Native Method)
	at sun.reflect.NativeMethodAccessorImpl.invoke(NativeMethodAccessorImpl.java:62)
	at sun.reflect.DelegatingMethodAccessorImpl.invoke(DelegatingMethodAccessorImpl.java:43)
	at java.lang.reflect.Method.invoke(Method.java:498)
	at org.codehaus.plexus.classworlds.launcher.Launcher.launchStandard(Launcher.java:329)
	at org.codehaus.plexus.classworlds.launcher.Launcher.launch(Launcher.java:239)
	at org.jvnet.hudson.maven3.agent.Maven3Main.launch(Maven3Main.java:181)
	at sun.reflect.NativeMethodAccessorImpl.invoke0(Native Method)
	at sun.reflect.NativeMethodAccessorImpl.invoke(NativeMethodAccessorImpl.java:62)
	at sun.reflect.DelegatingMethodAccessorImpl.invoke(DelegatingMethodAccessorImpl.java:43)
	at java.lang.reflect.Method.invoke(Method.java:498)
	at hudson.maven.Maven3Builder.call(Maven3Builder.java:139)
	at hudson.maven.Maven3Builder.call(Maven3Builder.java:70)
	at hudson.remoting.UserRequest.perform(UserRequest.java:153)
	at hudson.remoting.UserRequest.perform(UserRequest.java:50)
	at hudson.remoting.Request$2.run(Request.java:336)
	at hudson.remoting.InterceptingExecutorService$1.call(InterceptingExecutorService.java:68)
	at java.util.concurrent.FutureTask.run(FutureTask.java:266)
	at java.util.concurrent.ThreadPoolExecutor.runWorker(ThreadPoolExecutor.java:1149)
	at java.util.concurrent.ThreadPoolExecutor$Worker.run(ThreadPoolExecutor.java:624)
	at java.lang.Thread.run(Thread.java:748)
Caused by: org.apache.maven.plugin.MojoExecutionException: Could not create runtime jar
	at org.apache.cxf.maven_plugin.AbstractXSDToJavaMojo.execute(AbstractXSDToJavaMojo.java:250)
	at org.apache.cxf.maven_plugin.TestXSDToJavaMojo.execute(TestXSDToJavaMojo.java:46)
	at org.apache.maven.plugin.DefaultBuildPluginManager.executeMojo(DefaultBuildPluginManager.java:101)
	at org.apache.maven.lifecycle.internal.MojoExecutor.execute(MojoExecutor.java:209)
	... 30 more
Caused by: org.apache.maven.plugin.MojoExecutionException: Could not create runtime jar
	at org.apache.cxf.maven_plugin.AbstractXSDToJavaMojo.runForked(AbstractXSDToJavaMojo.java:508)
	at org.apache.cxf.maven_plugin.AbstractXSDToJavaMojo.run(AbstractXSDToJavaMojo.java:341)
	at org.apache.cxf.maven_plugin.AbstractXSDToJavaMojo.execute(AbstractXSDToJavaMojo.java:237)
	... 33 more
Caused by: java.io.IOException: Permission denied
	at java.io.UnixFileSystem.createFileExclusively(Native Method)
	at java.io.File.createTempFile(File.java:2024)
	at java.io.File.createTempFile(File.java:2070)
	at org.apache.cxf.maven_plugin.AbstractXSDToJavaMojo.runForked(AbstractXSDToJavaMojo.java:464)
	... 35 more
[ERROR] 
[ERROR] Re-run Maven using the -X switch to enable full debug logging.
[ERROR] 
[ERROR] For more information about the errors and possible solutions, please read the following
articles:
[ERROR] [Help 1] http://cwiki.apache.org/confluence/display/MAVEN/MojoExecutionException
[ERROR] 
[ERROR] After correcting the problems, you can resume the build with the command
[ERROR]   mvn <goals> -rf :cxf-xjc-ts-test
[JENKINS] Archiving <https://builds.apache.org/job/CXF-xjc-utils/ws/cxf-xjc-plugin/pom.xml>
to org.apache.cxf/cxf-xjc-plugin/3.2.0-SNAPSHOT/cxf-xjc-plugin-3.2.0-SNAPSHOT.pom
[JENKINS] Archiving <https://builds.apache.org/job/CXF-xjc-utils/ws/cxf-xjc-plugin/target/cxf-xjc-plugin-3.2.0-SNAPSHOT.jar>
to org.apache.cxf/cxf-xjc-plugin/3.2.0-20170809.185134-8/cxf-xjc-plugin-3.2.0-20170809.185134-8.jar
[JENKINS] Archiving <https://builds.apache.org/job/CXF-xjc-utils/ws/property-listener/pom.xml>
to org.apache.cxf.xjcplugins/cxf-xjc-pl/3.2.0-SNAPSHOT/cxf-xjc-pl-3.2.0-SNAPSHOT.pom
[JENKINS] Archiving <https://builds.apache.org/job/CXF-xjc-utils/ws/bug671/pom.xml>
to org.apache.cxf.xjcplugins/cxf-xjc-bug671/3.2.0-SNAPSHOT/cxf-xjc-bug671-3.2.0-SNAPSHOT.pom
[JENKINS] Archiving <https://builds.apache.org/job/CXF-xjc-utils/ws/ts/pom.xml> to org.apache.cxf.xjcplugins/cxf-xjc-ts/3.2.0-SNAPSHOT/cxf-xjc-ts-3.2.0-SNAPSHOT.pom
[JENKINS] Archiving <https://builds.apache.org/job/CXF-xjc-utils/ws/ts/target/cxf-xjc-ts-3.2.0-SNAPSHOT.jar>
to org.apache.cxf.xjcplugins/cxf-xjc-ts/3.2.0-20170809.185220-8/cxf-xjc-ts-3.2.0-20170809.185220-8.jar
[JENKINS] Archiving <https://builds.apache.org/job/CXF-xjc-utils/ws/wsdlextension/pom.xml>
to org.apache.cxf.xjcplugins/cxf-xjc-wsdlextension/3.2.0-SNAPSHOT/cxf-xjc-wsdlextension-3.2.0-SNAPSHOT.pom
[JENKINS] Archiving <https://builds.apache.org/job/CXF-xjc-utils/ws/boolean/pom.xml>
to org.apache.cxf.xjcplugins/cxf-xjc-boolean/3.2.0-SNAPSHOT/cxf-xjc-boolean-3.2.0-SNAPSHOT.pom
[JENKINS] Archiving <https://builds.apache.org/job/CXF-xjc-utils/ws/pom.xml> to org.apache.cxf.xjc-utils/xjc-utils/3.2.0-SNAPSHOT/xjc-utils-3.2.0-SNAPSHOT.pom
[JENKINS] Archiving <https://builds.apache.org/job/CXF-xjc-utils/ws/bug986/pom.xml>
to org.apache.cxf.xjcplugins/cxf-xjc-bug986/3.2.0-SNAPSHOT/cxf-xjc-bug986-3.2.0-SNAPSHOT.pom
[JENKINS] Archiving <https://builds.apache.org/job/CXF-xjc-utils/ws/ts-test/pom.xml>
to org.apache.cxf.xjcplugins.tests/cxf-xjc-ts-test/3.2.0-SNAPSHOT/cxf-xjc-ts-test-3.2.0-SNAPSHOT.pom
[JENKINS] Archiving <https://builds.apache.org/job/CXF-xjc-utils/ws/boolean-test/pom.xml>
to org.apache.cxf.xjcplugins.tests/cxf-xjc-boolean-test/3.2.0-SNAPSHOT/cxf-xjc-boolean-test-3.2.0-SNAPSHOT.pom
[JENKINS] Archiving <https://builds.apache.org/job/CXF-xjc-utils/ws/javadoc/pom.xml>
to org.apache.cxf.xjcplugins/cxf-xjc-javadoc/3.2.0-SNAPSHOT/cxf-xjc-javadoc-3.2.0-SNAPSHOT.pom
[JENKINS] Archiving <https://builds.apache.org/job/CXF-xjc-utils/ws/runtime/pom.xml>
to org.apache.cxf.xjc-utils/cxf-xjc-runtime/3.2.0-SNAPSHOT/cxf-xjc-runtime-3.2.0-SNAPSHOT.pom
[JENKINS] Archiving <https://builds.apache.org/job/CXF-xjc-utils/ws/wsdlextension-test/pom.xml>
to org.apache.cxf.xjcplugins.tests/cxf-xjc-wsdlextension-test/3.2.0-SNAPSHOT/cxf-xjc-wsdlextension-test-3.2.0-SNAPSHOT.pom
[JENKINS] Archiving <https://builds.apache.org/job/CXF-xjc-utils/ws/dv/pom.xml> to org.apache.cxf.xjcplugins/cxf-xjc-dv/3.2.0-SNAPSHOT/cxf-xjc-dv-3.2.0-SNAPSHOT.pom
[JENKINS] Archiving <https://builds.apache.org/job/CXF-xjc-utils/ws/dv/target/cxf-xjc-dv-3.2.0-SNAPSHOT.jar>
to org.apache.cxf.xjcplugins/cxf-xjc-dv/3.2.0-20170809.185146-10/cxf-xjc-dv-3.2.0-20170809.185146-10.jar
[JENKINS] Archiving <https://builds.apache.org/job/CXF-xjc-utils/ws/dv-test/pom.xml>
to org.apache.cxf.xjcplugins.tests/cxf-xjc-dv-test/3.2.0-SNAPSHOT/cxf-xjc-dv-test-3.2.0-SNAPSHOT.pom
[JENKINS] Archiving <https://builds.apache.org/job/CXF-xjc-utils/ws/dv-test/target/cxf-xjc-dv-test-3.2.0-SNAPSHOT.jar>
to org.apache.cxf.xjcplugins.tests/cxf-xjc-dv-test/3.2.0-20170809.185210-8/cxf-xjc-dv-test-3.2.0-20170809.185210-8.jar
Sending e-mails to: notifications@cxf.apache.org
Sending e-mails to: notifications@cxf.apache.org
channel stopped

Mime
View raw message