cxf-notifications mailing list archives

Site index · List index
Message view « Date » · « Thread »
Top « Date » · « Thread »
From Apache Jenkins Server <jenk...@builds.apache.org>
Subject Build failed in Jenkins: CXF-3.1-deploy #1031
Date Fri, 02 Jun 2017 22:07:48 GMT
See <https://builds.apache.org/job/CXF-3.1-deploy/1031/display/redirect?page=changes>

Changes:

[sberyozkin] Minor updates to JCache provider

------------------------------------------
[...truncated 2.08 MB...]
[INFO] Building CXF WS-SecurityPolicy Signature Encryption Demo 3.1.12-SNAPSHOT
[INFO] ------------------------------------------------------------------------
[INFO] 
[INFO] --- maven-clean-plugin:2.5:clean (default-clean) @ wssec_sign_enc_policy ---
[INFO] 
[INFO] --- cxf-codegen-plugin:3.1.12-SNAPSHOT:wsdl2java (generate-sources) @ wssec_sign_enc_policy
---
[INFO] 
[INFO] --- maven-resources-plugin:2.6:resources (default-resources) @ wssec_sign_enc_policy
---
[INFO] Using 'UTF-8' encoding to copy filtered resources.
[INFO] Copying 9 resources
[INFO] 
[INFO] --- maven-compiler-plugin:3.1:compile (default-compile) @ wssec_sign_enc_policy ---
[INFO] Changes detected - recompiling the module!
[INFO] Compiling 11 source files to /home/jenkins/jenkins-slave/workspace/CXF-3.1-deploy/distribution/src/main/release/samples/ws_security/sign_enc_policy/target/classes
[INFO] 
[INFO] --- maven-resources-plugin:2.6:testResources (default-testResources) @ wssec_sign_enc_policy
---
[INFO] Using 'UTF-8' encoding to copy filtered resources.
[INFO] skip non existing resourceDirectory /home/jenkins/jenkins-slave/workspace/CXF-3.1-deploy/distribution/src/main/release/samples/ws_security/sign_enc_policy/src/test/resources
[INFO] 
[INFO] --- maven-compiler-plugin:3.1:testCompile (default-testCompile) @ wssec_sign_enc_policy
---
[INFO] No sources to compile
[INFO] 
[INFO] --- maven-surefire-plugin:2.12.4:test (default-test) @ wssec_sign_enc_policy ---
[INFO] Tests are skipped.
[INFO] 
[INFO] --- maven-jar-plugin:2.4:jar (default-jar) @ wssec_sign_enc_policy ---
[INFO] Building jar: /home/jenkins/jenkins-slave/workspace/CXF-3.1-deploy/distribution/src/main/release/samples/ws_security/sign_enc_policy/target/wssec_sign_enc_policy-3.1.12-SNAPSHOT.jar
[INFO] 
[INFO] --- maven-install-plugin:2.4:install (default-install) @ wssec_sign_enc_policy ---
[INFO] Installing /home/jenkins/jenkins-slave/workspace/CXF-3.1-deploy/distribution/src/main/release/samples/ws_security/sign_enc_policy/target/wssec_sign_enc_policy-3.1.12-SNAPSHOT.jar
to /home/jenkins/jenkins-slave/maven-repositories/1/org/apache/cxf/samples/wssec_sign_enc_policy/3.1.12-SNAPSHOT/wssec_sign_enc_policy-3.1.12-SNAPSHOT.jar
[INFO] Installing /home/jenkins/jenkins-slave/workspace/CXF-3.1-deploy/distribution/src/main/release/samples/ws_security/sign_enc_policy/pom.xml
to /home/jenkins/jenkins-slave/maven-repositories/1/org/apache/cxf/samples/wssec_sign_enc_policy/3.1.12-SNAPSHOT/wssec_sign_enc_policy-3.1.12-SNAPSHOT.pom
[INFO]                                                                         
[INFO] ------------------------------------------------------------------------
[INFO] Building WS-SecurityPolicy UT Demo 3.1.12-SNAPSHOT
[INFO] ------------------------------------------------------------------------
[INFO] 
[INFO] --- maven-clean-plugin:2.5:clean (default-clean) @ wssec_ut_policy ---
[INFO] 
[INFO] --- cxf-codegen-plugin:3.1.12-SNAPSHOT:wsdl2java (generate-sources) @ wssec_ut_policy
---
[INFO] 
[INFO] --- maven-resources-plugin:2.6:resources (default-resources) @ wssec_ut_policy ---
[INFO] Using 'UTF-8' encoding to copy filtered resources.
[INFO] Copying 4 resources
[INFO] 
[INFO] --- maven-compiler-plugin:3.1:compile (default-compile) @ wssec_ut_policy ---
[INFO] Changes detected - recompiling the module!
[INFO] Compiling 11 source files to /home/jenkins/jenkins-slave/workspace/CXF-3.1-deploy/distribution/src/main/release/samples/ws_security/ut_policy/target/classes
[INFO] 
[INFO] --- maven-resources-plugin:2.6:testResources (default-testResources) @ wssec_ut_policy
---
[INFO] Using 'UTF-8' encoding to copy filtered resources.
[INFO] skip non existing resourceDirectory /home/jenkins/jenkins-slave/workspace/CXF-3.1-deploy/distribution/src/main/release/samples/ws_security/ut_policy/src/test/resources
[INFO] 
[INFO] --- maven-compiler-plugin:3.1:testCompile (default-testCompile) @ wssec_ut_policy ---
[INFO] No sources to compile
[INFO] 
[INFO] --- maven-surefire-plugin:2.12.4:test (default-test) @ wssec_ut_policy ---
[INFO] Tests are skipped.
[INFO] 
[INFO] --- maven-jar-plugin:2.4:jar (default-jar) @ wssec_ut_policy ---
[INFO] Building jar: /home/jenkins/jenkins-slave/workspace/CXF-3.1-deploy/distribution/src/main/release/samples/ws_security/ut_policy/target/wssec_ut_policy-3.1.12-SNAPSHOT.jar
[INFO] 
[INFO] --- maven-install-plugin:2.4:install (default-install) @ wssec_ut_policy ---
[INFO] Installing /home/jenkins/jenkins-slave/workspace/CXF-3.1-deploy/distribution/src/main/release/samples/ws_security/ut_policy/target/wssec_ut_policy-3.1.12-SNAPSHOT.jar
to /home/jenkins/jenkins-slave/maven-repositories/1/org/apache/cxf/samples/wssec_ut_policy/3.1.12-SNAPSHOT/wssec_ut_policy-3.1.12-SNAPSHOT.jar
[INFO] Installing /home/jenkins/jenkins-slave/workspace/CXF-3.1-deploy/distribution/src/main/release/samples/ws_security/ut_policy/pom.xml
to /home/jenkins/jenkins-slave/maven-repositories/1/org/apache/cxf/samples/wssec_ut_policy/3.1.12-SNAPSHOT/wssec_ut_policy-3.1.12-SNAPSHOT.pom
[INFO]                                                                         
[INFO] ------------------------------------------------------------------------
[INFO] Building MTOM Demo for SWA and XOP 3.1.12-SNAPSHOT
[INFO] ------------------------------------------------------------------------
[INFO] 
[INFO] --- maven-clean-plugin:2.5:clean (default-clean) @ mtom ---
[INFO] 
[INFO] --- cxf-codegen-plugin:3.1.12-SNAPSHOT:wsdl2java (generate-sources) @ mtom ---
[INFO] 
[INFO] --- maven-resources-plugin:2.6:resources (default-resources) @ mtom ---
[INFO] Using 'UTF-8' encoding to copy filtered resources.
[INFO] Copying 2 resources
[INFO] 
[INFO] --- maven-compiler-plugin:3.1:compile (default-compile) @ mtom ---
[INFO] Changes detected - recompiling the module!
[INFO] Compiling 9 source files to /home/jenkins/jenkins-slave/workspace/CXF-3.1-deploy/distribution/src/main/release/samples/mtom/target/classes
[INFO] 
[INFO] --- maven-resources-plugin:2.6:testResources (default-testResources) @ mtom ---
[INFO] Using 'UTF-8' encoding to copy filtered resources.
[INFO] skip non existing resourceDirectory /home/jenkins/jenkins-slave/workspace/CXF-3.1-deploy/distribution/src/main/release/samples/mtom/src/test/resources
[INFO] 
[INFO] --- maven-compiler-plugin:3.1:testCompile (default-testCompile) @ mtom ---
[INFO] No sources to compile
[INFO] 
[INFO] --- maven-surefire-plugin:2.12.4:test (default-test) @ mtom ---
[INFO] Tests are skipped.
[INFO] 
[INFO] --- maven-jar-plugin:2.4:jar (default-jar) @ mtom ---
[INFO] Building jar: /home/jenkins/jenkins-slave/workspace/CXF-3.1-deploy/distribution/src/main/release/samples/mtom/target/mtom-3.1.12-SNAPSHOT.jar
[INFO] 
[INFO] --- maven-install-plugin:2.4:install (default-install) @ mtom ---
[INFO] Installing /home/jenkins/jenkins-slave/workspace/CXF-3.1-deploy/distribution/src/main/release/samples/mtom/target/mtom-3.1.12-SNAPSHOT.jar
to /home/jenkins/jenkins-slave/maven-repositories/1/org/apache/cxf/samples/mtom/3.1.12-SNAPSHOT/mtom-3.1.12-SNAPSHOT.jar
[INFO] Installing /home/jenkins/jenkins-slave/workspace/CXF-3.1-deploy/distribution/src/main/release/samples/mtom/pom.xml
to /home/jenkins/jenkins-slave/maven-repositories/1/org/apache/cxf/samples/mtom/3.1.12-SNAPSHOT/mtom-3.1.12-SNAPSHOT.pom
[INFO]                                                                         
[INFO] ------------------------------------------------------------------------
[INFO] Building JAX-WS Asynchronous Demo using Document/Literal Style 3.1.12-SNAPSHOT
[INFO] ------------------------------------------------------------------------
[INFO] 
[INFO] --- maven-clean-plugin:2.5:clean (default-clean) @ jaxws_async ---
[INFO] 
[INFO] --- cxf-codegen-plugin:3.1.12-SNAPSHOT:wsdl2java (generate-sources) @ jaxws_async ---
[INFO] 
[INFO] --- maven-resources-plugin:2.6:resources (default-resources) @ jaxws_async ---
[INFO] Using 'UTF-8' encoding to copy filtered resources.
[INFO] skip non existing resourceDirectory /home/jenkins/jenkins-slave/workspace/CXF-3.1-deploy/distribution/src/main/release/samples/jaxws_async/src/main/resources
[INFO] 
[INFO] --- maven-compiler-plugin:3.1:compile (default-compile) @ jaxws_async ---
[INFO] Changes detected - recompiling the module!
[INFO] Compiling 10 source files to /home/jenkins/jenkins-slave/workspace/CXF-3.1-deploy/distribution/src/main/release/samples/jaxws_async/target/classes
[INFO] 
[INFO] --- maven-resources-plugin:2.6:testResources (default-testResources) @ jaxws_async
---
[INFO] Using 'UTF-8' encoding to copy filtered resources.
[INFO] skip non existing resourceDirectory /home/jenkins/jenkins-slave/workspace/CXF-3.1-deploy/distribution/src/main/release/samples/jaxws_async/src/test/resources
[INFO] 
[INFO] --- maven-compiler-plugin:3.1:testCompile (default-testCompile) @ jaxws_async ---
[INFO] No sources to compile
[INFO] 
[INFO] --- maven-surefire-plugin:2.12.4:test (default-test) @ jaxws_async ---
[INFO] Tests are skipped.
[INFO] 
[INFO] --- maven-war-plugin:2.4:war (default-war) @ jaxws_async ---
[INFO] Packaging webapp
[INFO] Assembling webapp [jaxws_async] in [/home/jenkins/jenkins-slave/workspace/CXF-3.1-deploy/distribution/src/main/release/samples/jaxws_async/target/jaxws_async-3.1.12-SNAPSHOT]
[INFO] Processing war project
[INFO] Copying webapp resources [/home/jenkins/jenkins-slave/workspace/CXF-3.1-deploy/distribution/src/main/release/samples/jaxws_async/src/main/webapp]
[INFO] Webapp assembled in [109 msecs]
[INFO] Building war: /home/jenkins/jenkins-slave/workspace/CXF-3.1-deploy/distribution/src/main/release/samples/jaxws_async/target/jaxws_async-3.1.12-SNAPSHOT.war
[INFO] 
[INFO] --- maven-install-plugin:2.4:install (default-install) @ jaxws_async ---
[INFO] Installing /home/jenkins/jenkins-slave/workspace/CXF-3.1-deploy/distribution/src/main/release/samples/jaxws_async/target/jaxws_async-3.1.12-SNAPSHOT.war
to /home/jenkins/jenkins-slave/maven-repositories/1/org/apache/cxf/samples/jaxws_async/3.1.12-SNAPSHOT/jaxws_async-3.1.12-SNAPSHOT.war
[INFO] Installing /home/jenkins/jenkins-slave/workspace/CXF-3.1-deploy/distribution/src/main/release/samples/jaxws_async/pom.xml
to /home/jenkins/jenkins-slave/maven-repositories/1/org/apache/cxf/samples/jaxws_async/3.1.12-SNAPSHOT/jaxws_async-3.1.12-SNAPSHOT.pom
[INFO]                                                                         
[INFO] ------------------------------------------------------------------------
[INFO] Building Java First POJO Sample 3.1.12-SNAPSHOT
[INFO] ------------------------------------------------------------------------
[INFO] 
[INFO] --- maven-clean-plugin:2.5:clean (default-clean) @ java_first_pojo ---
[INFO] 
[INFO] --- maven-resources-plugin:2.6:resources (default-resources) @ java_first_pojo ---
[INFO] Using 'UTF-8' encoding to copy filtered resources.
[INFO] skip non existing resourceDirectory /home/jenkins/jenkins-slave/workspace/CXF-3.1-deploy/distribution/src/main/release/samples/java_first_pojo/src/main/resources
[INFO] 
[INFO] --- maven-compiler-plugin:3.1:compile (default-compile) @ java_first_pojo ---
[INFO] Changes detected - recompiling the module!
[INFO] Compiling 4 source files to /home/jenkins/jenkins-slave/workspace/CXF-3.1-deploy/distribution/src/main/release/samples/java_first_pojo/target/classes
[INFO] 
[INFO] --- maven-resources-plugin:2.6:testResources (default-testResources) @ java_first_pojo
---
[INFO] Using 'UTF-8' encoding to copy filtered resources.
[INFO] skip non existing resourceDirectory /home/jenkins/jenkins-slave/workspace/CXF-3.1-deploy/distribution/src/main/release/samples/java_first_pojo/src/test/resources
[INFO] 
[INFO] --- maven-compiler-plugin:3.1:testCompile (default-testCompile) @ java_first_pojo ---
[INFO] No sources to compile
[INFO] 
[INFO] --- maven-surefire-plugin:2.12.4:test (default-test) @ java_first_pojo ---
[INFO] Tests are skipped.
[INFO] 
[INFO] --- maven-jar-plugin:2.4:jar (default-jar) @ java_first_pojo ---
[INFO] Building jar: /home/jenkins/jenkins-slave/workspace/CXF-3.1-deploy/distribution/src/main/release/samples/java_first_pojo/target/java_first_pojo-3.1.12-SNAPSHOT.jar
[INFO] 
[INFO] --- maven-install-plugin:2.4:install (default-install) @ java_first_pojo ---
[INFO] Installing /home/jenkins/jenkins-slave/workspace/CXF-3.1-deploy/distribution/src/main/release/samples/java_first_pojo/target/java_first_pojo-3.1.12-SNAPSHOT.jar
to /home/jenkins/jenkins-slave/maven-repositories/1/org/apache/cxf/samples/java_first_pojo/3.1.12-SNAPSHOT/java_first_pojo-3.1.12-SNAPSHOT.jar
[INFO] Installing /home/jenkins/jenkins-slave/workspace/CXF-3.1-deploy/distribution/src/main/release/samples/java_first_pojo/pom.xml
to /home/jenkins/jenkins-slave/maven-repositories/1/org/apache/cxf/samples/java_first_pojo/3.1.12-SNAPSHOT/java_first_pojo-3.1.12-SNAPSHOT.pom
[INFO]                                                                         
[INFO] ------------------------------------------------------------------------
[INFO] Building WS-Policy Demo 3.1.12-SNAPSHOT
[INFO] ------------------------------------------------------------------------
[INFO] 
[INFO] --- maven-clean-plugin:2.5:clean (default-clean) @ ws_policy ---
[INFO] 
[INFO] --- cxf-codegen-plugin:3.1.12-SNAPSHOT:wsdl2java (generate-sources) @ ws_policy ---
[INFO] 
[INFO] --- maven-resources-plugin:2.6:resources (default-resources) @ ws_policy ---
[INFO] Using 'UTF-8' encoding to copy filtered resources.
[INFO] Copying 4 resources
[INFO] 
[INFO] --- maven-compiler-plugin:3.1:compile (default-compile) @ ws_policy ---
[INFO] Changes detected - recompiling the module!
[INFO] Compiling 17 source files to /home/jenkins/jenkins-slave/workspace/CXF-3.1-deploy/distribution/src/main/release/samples/ws_policy/target/classes
[INFO] 
[INFO] --- maven-resources-plugin:2.6:testResources (default-testResources) @ ws_policy ---
[INFO] Using 'UTF-8' encoding to copy filtered resources.
[INFO] skip non existing resourceDirectory /home/jenkins/jenkins-slave/workspace/CXF-3.1-deploy/distribution/src/main/release/samples/ws_policy/src/test/resources
[INFO] 
[INFO] --- maven-compiler-plugin:3.1:testCompile (default-testCompile) @ ws_policy ---
[INFO] No sources to compile
[INFO] 
[INFO] --- maven-surefire-plugin:2.12.4:test (default-test) @ ws_policy ---
[INFO] Tests are skipped.
[INFO] 
[INFO] --- maven-jar-plugin:2.4:jar (default-jar) @ ws_policy ---
[INFO] Building jar: /home/jenkins/jenkins-slave/workspace/CXF-3.1-deploy/distribution/src/main/release/samples/ws_policy/target/ws_policy-3.1.12-SNAPSHOT.jar
[INFO] 
[INFO] --- maven-install-plugin:2.4:install (default-install) @ ws_policy ---
[INFO] Installing /home/jenkins/jenkins-slave/workspace/CXF-3.1-deploy/distribution/src/main/release/samples/ws_policy/target/ws_policy-3.1.12-SNAPSHOT.jar
to /home/jenkins/jenkins-slave/maven-repositories/1/org/apache/cxf/samples/ws_policy/3.1.12-SNAPSHOT/ws_policy-3.1.12-SNAPSHOT.jar
[INFO] Installing /home/jenkins/jenkins-slave/workspace/CXF-3.1-deploy/distribution/src/main/release/samples/ws_policy/pom.xml
to /home/jenkins/jenkins-slave/maven-repositories/1/org/apache/cxf/samples/ws_policy/3.1.12-SNAPSHOT/ws_policy-3.1.12-SNAPSHOT.pom
[INFO]                                                                         
[INFO] ------------------------------------------------------------------------
[INFO] Building Hello World Client Demo using JavaScript 3.1.12-SNAPSHOT
[INFO] ------------------------------------------------------------------------
[INFO] 
[INFO] --- maven-clean-plugin:2.5:clean (default-clean) @ js_client ---
[INFO] 
[INFO] --- cxf-codegen-plugin:3.1.12-SNAPSHOT:wsdl2java (generate-sources) @ js_client ---
ERROR: qnode1 is offline; cannot locate JDK 1.7 (latest)
ERROR: qnode1 is offline; cannot locate Maven 3.2.5
ERROR: qnode1 is offline; cannot locate Maven 3.2.5
Agent went offline during the build
ERROR: Connection was broken: java.io.EOFException
	at java.io.ObjectInputStream$PeekInputStream.readFully(ObjectInputStream.java:2353)
	at java.io.ObjectInputStream$BlockDataInputStream.readShort(ObjectInputStream.java:2822)
	at java.io.ObjectInputStream.readStreamHeader(ObjectInputStream.java:804)
	at java.io.ObjectInputStream.<init>(ObjectInputStream.java:301)
	at hudson.remoting.ObjectInputStreamEx.<init>(ObjectInputStreamEx.java:48)
	at hudson.remoting.AbstractSynchronousByteArrayCommandTransport.read(AbstractSynchronousByteArrayCommandTransport.java:34)
	at hudson.remoting.SynchronousCommandTransport$ReaderThread.run(SynchronousCommandTransport.java:59)
Caused: java.io.IOException: Unexpected termination of the channel
	at hudson.remoting.SynchronousCommandTransport$ReaderThread.run(SynchronousCommandTransport.java:73)

Build step 'Invoke top-level Maven targets' marked build as failure
ERROR: Failed to parse POMs
java.io.IOException: Backing channel 'qnode1' is disconnected.
	at hudson.remoting.RemoteInvocationHandler.channelOrFail(RemoteInvocationHandler.java:192)
	at hudson.remoting.RemoteInvocationHandler.invoke(RemoteInvocationHandler.java:257)
	at com.sun.proxy.$Proxy124.isAlive(Unknown Source)
	at hudson.Launcher$RemoteLauncher$ProcImpl.isAlive(Launcher.java:1043)
	at hudson.maven.ProcessCache$MavenProcess.call(ProcessCache.java:166)
	at hudson.maven.MavenModuleSetBuild$MavenModuleSetBuildExecution.doRun(MavenModuleSetBuild.java:873)
	at hudson.model.AbstractBuild$AbstractBuildExecution.run(AbstractBuild.java:534)
	at hudson.model.Run.execute(Run.java:1728)
	at hudson.maven.MavenModuleSetBuild.run(MavenModuleSetBuild.java:544)
	at hudson.model.ResourceController.execute(ResourceController.java:98)
	at hudson.model.Executor.run(Executor.java:405)
Caused by: java.io.IOException: Unexpected termination of the channel
	at hudson.remoting.SynchronousCommandTransport$ReaderThread.run(SynchronousCommandTransport.java:73)
Caused by: java.io.EOFException
	at java.io.ObjectInputStream$PeekInputStream.readFully(ObjectInputStream.java:2353)
	at java.io.ObjectInputStream$BlockDataInputStream.readShort(ObjectInputStream.java:2822)
	at java.io.ObjectInputStream.readStreamHeader(ObjectInputStream.java:804)
	at java.io.ObjectInputStream.<init>(ObjectInputStream.java:301)
	at hudson.remoting.ObjectInputStreamEx.<init>(ObjectInputStreamEx.java:48)
	at hudson.remoting.AbstractSynchronousByteArrayCommandTransport.read(AbstractSynchronousByteArrayCommandTransport.java:34)
	at hudson.remoting.SynchronousCommandTransport$ReaderThread.run(SynchronousCommandTransport.java:59)
ERROR: qnode1 is offline; cannot locate JDK 1.7 (latest)
ERROR: qnode1 is offline; cannot locate Maven 3.2.5


Mime
View raw message