cxf-notifications mailing list archives

Site index · List index
Message view « Date » · « Thread »
Top « Date » · « Thread »
From Apache Jenkins Server <jenk...@builds.apache.org>
Subject Build failed in Jenkins: CXF-Master-Analysis #21
Date Fri, 26 May 2017 08:44:55 GMT
See <https://builds.apache.org/job/CXF-Master-Analysis/21/display/redirect?page=changes>

Changes:

[Dennis Kieselhorst] Update maven-dependency-plugin

------------------------------------------
[...truncated 817.43 KB...]
[JENKINS] Archiving <https://builds.apache.org/job/CXF-Master-Analysis/ws/maven-plugins/wsdl-validator-plugin/pom.xml>
to org.apache.cxf/cxf-wsdl-validator-plugin/3.2.0-SNAPSHOT/cxf-wsdl-validator-plugin-3.2.0-SNAPSHOT.pom
No prior successful build to compare, so performing full copy of artifacts
[JENKINS] Archiving <https://builds.apache.org/job/CXF-Master-Analysis/ws/services/sts/systests/pom.xml>
to org.apache.cxf.services.sts/cxf-services-sts-systests/3.2.0-SNAPSHOT/cxf-services-sts-systests-3.2.0-SNAPSHOT.pom
No prior successful build to compare, so performing full copy of artifacts
[JENKINS] Archiving <https://builds.apache.org/job/CXF-Master-Analysis/ws/osgi/karaf/features/pom.xml>
to org.apache.cxf.karaf/apache-cxf/3.2.0-SNAPSHOT/apache-cxf-3.2.0-SNAPSHOT.pom
No prior successful build to compare, so performing full copy of artifacts
[JENKINS] Archiving <https://builds.apache.org/job/CXF-Master-Analysis/ws/distribution/src/main/release/samples/restful_dispatch/pom.xml>
to org.apache.cxf.samples/restful_dispatch/3.2.0-SNAPSHOT/restful_dispatch-3.2.0-SNAPSHOT.pom
No prior successful build to compare, so performing full copy of artifacts
[JENKINS] Archiving <https://builds.apache.org/job/CXF-Master-Analysis/ws/distribution/src/main/release/samples/aegis/pom.xml>
to org.apache.cxf.samples/aegis/3.2.0-SNAPSHOT/aegis-3.2.0-SNAPSHOT.pom
No prior successful build to compare, so performing full copy of artifacts
[JENKINS] Archiving <https://builds.apache.org/job/CXF-Master-Analysis/ws/tools/wsdlto/test/pom.xml>
to org.apache.cxf/cxf-tools-wsdlto-test/3.2.0-SNAPSHOT/cxf-tools-wsdlto-test-3.2.0-SNAPSHOT.pom
No prior successful build to compare, so performing full copy of artifacts
[JENKINS] Archiving <https://builds.apache.org/job/CXF-Master-Analysis/ws/pom.xml> to
org.apache.cxf/cxf/3.2.0-SNAPSHOT/cxf-3.2.0-SNAPSHOT.pom
[JENKINS] Archiving <https://builds.apache.org/job/CXF-Master-Analysis/ws/services/xkms/xkms-war/pom.xml>
to org.apache.cxf.services.xkms/cxf-services-xkms-war/3.2.0-SNAPSHOT/cxf-services-xkms-war-3.2.0-SNAPSHOT.pom
No prior successful build to compare, so performing full copy of artifacts
[JENKINS] Archiving <https://builds.apache.org/job/CXF-Master-Analysis/ws/distribution/src/main/release/samples/ws_security/sign_enc/pom.xml>
to org.apache.cxf.samples/wssec_sign_enc/3.2.0-SNAPSHOT/wssec_sign_enc-3.2.0-SNAPSHOT.pom
No prior successful build to compare, so performing full copy of artifacts
[JENKINS] Archiving <https://builds.apache.org/job/CXF-Master-Analysis/ws/services/xkms/xkms-x509-repo-ldap/pom.xml>
to org.apache.cxf.services.xkms/cxf-services-xkms-x509-repo-ldap/3.2.0-SNAPSHOT/cxf-services-xkms-x509-repo-ldap-3.2.0-SNAPSHOT.pom
No prior successful build to compare, so performing full copy of artifacts
[JENKINS] Archiving <https://builds.apache.org/job/CXF-Master-Analysis/ws/rt/databinding/pom.xml>
to org.apache.cxf/cxf-rt-databinding/3.2.0-SNAPSHOT/cxf-rt-databinding-3.2.0-SNAPSHOT.pom
No prior successful build to compare, so performing full copy of artifacts
[JENKINS] Archiving <https://builds.apache.org/job/CXF-Master-Analysis/ws/rt/rs/security/cors/pom.xml>
to org.apache.cxf/cxf-rt-rs-security-cors/3.2.0-SNAPSHOT/cxf-rt-rs-security-cors-3.2.0-SNAPSHOT.pom
No prior successful build to compare, so performing full copy of artifacts
[JENKINS] Archiving <https://builds.apache.org/job/CXF-Master-Analysis/ws/distribution/src/main/release/samples/wsdl_first_soap12/pom.xml>
to org.apache.cxf.samples/wsdl_first_soap12/3.2.0-SNAPSHOT/wsdl_first_soap12-3.2.0-SNAPSHOT.pom
No prior successful build to compare, so performing full copy of artifacts
[JENKINS] Archiving <https://builds.apache.org/job/CXF-Master-Analysis/ws/rt/frontend/pom.xml>
to org.apache.cxf/cxf-rt-frontend/3.2.0-SNAPSHOT/cxf-rt-frontend-3.2.0-SNAPSHOT.pom
No prior successful build to compare, so performing full copy of artifacts
[JENKINS] Archiving <https://builds.apache.org/job/CXF-Master-Analysis/ws/rt/rs/pom.xml>
to org.apache.cxf/cxf-rt-rs/3.2.0-SNAPSHOT/cxf-rt-rs-3.2.0-SNAPSHOT.pom
No prior successful build to compare, so performing full copy of artifacts
[JENKINS] Archiving <https://builds.apache.org/job/CXF-Master-Analysis/ws/integration/cdi/pom.xml>
to org.apache.cxf/cxf-integration-cdi/3.2.0-SNAPSHOT/cxf-integration-cdi-3.2.0-SNAPSHOT.pom
No prior successful build to compare, so performing full copy of artifacts
[JENKINS] Archiving <https://builds.apache.org/job/CXF-Master-Analysis/ws/distribution/src/main/release/samples/jax_rs/websocket_osgi/pom.xml>
to org.apache.cxf.samples/jax_rs_websocket_osgi/3.2.0-SNAPSHOT/jax_rs_websocket_osgi-3.2.0-SNAPSHOT.pom
No prior successful build to compare, so performing full copy of artifacts
[JENKINS] Archiving <https://builds.apache.org/job/CXF-Master-Analysis/ws/rt/security-saml/pom.xml>
to org.apache.cxf/cxf-rt-security-saml/3.2.0-SNAPSHOT/cxf-rt-security-saml-3.2.0-SNAPSHOT.pom
No prior successful build to compare, so performing full copy of artifacts
[JENKINS] Archiving <https://builds.apache.org/job/CXF-Master-Analysis/ws/systests/container-integration/pom.xml>
to org.apache.cxf.systests/cxf-systests-container-integration/3.2.0-SNAPSHOT/cxf-systests-container-integration-3.2.0-SNAPSHOT.pom
No prior successful build to compare, so performing full copy of artifacts
[JENKINS] Archiving <https://builds.apache.org/job/CXF-Master-Analysis/ws/systests/cdi/pom.xml>
to org.apache.cxf.systests/cxf-systests-cdi/3.2.0-SNAPSHOT/cxf-systests-cdi-3.2.0-SNAPSHOT.pom
No prior successful build to compare, so performing full copy of artifacts
[JENKINS] Archiving <https://builds.apache.org/job/CXF-Master-Analysis/ws/integration/spring-boot/starter-jaxws/pom.xml>
to org.apache.cxf/cxf-spring-boot-starter-jaxws/3.2.0-SNAPSHOT/cxf-spring-boot-starter-jaxws-3.2.0-SNAPSHOT.pom
No prior successful build to compare, so performing full copy of artifacts
[JENKINS] Archiving <https://builds.apache.org/job/CXF-Master-Analysis/ws/distribution/src/main/release/samples/jax_rs/search/pom.xml>
to org.apache.cxf.samples/jax_rs_search/3.2.0-SNAPSHOT/jax_rs_search-3.2.0-SNAPSHOT.pom
No prior successful build to compare, so performing full copy of artifacts
[JENKINS] Archiving <https://builds.apache.org/job/CXF-Master-Analysis/ws/distribution/src/main/release/samples/jax_rs/description_swagger/pom.xml>
to org.apache.cxf.samples/jax_rs_description_swagger/3.2.0-SNAPSHOT/jax_rs_description_swagger-3.2.0-SNAPSHOT.pom
No prior successful build to compare, so performing full copy of artifacts
[JENKINS] Archiving <https://builds.apache.org/job/CXF-Master-Analysis/ws/distribution/src/main/release/samples/corba/hello_world/pom.xml>
to org.apache.cxf.samples/corba-hello-world/3.2.0-SNAPSHOT/corba-hello-world-3.2.0-SNAPSHOT.pom
No prior successful build to compare, so performing full copy of artifacts
[JENKINS] Archiving <https://builds.apache.org/job/CXF-Master-Analysis/ws/distribution/src/main/release/samples/jax_rs/description_swagger2/pom.xml>
to org.apache.cxf.samples/jax_rs_description_swagger2/3.2.0-SNAPSHOT/jax_rs_description_swagger2-3.2.0-SNAPSHOT.pom
No prior successful build to compare, so performing full copy of artifacts
[JENKINS] Archiving <https://builds.apache.org/job/CXF-Master-Analysis/ws/distribution/src/main/release/samples/clustering/failover_server/pom.xml>
to org.apache.cxf.samples/failover_server/3.2.0-SNAPSHOT/failover_server-3.2.0-SNAPSHOT.pom
No prior successful build to compare, so performing full copy of artifacts
[JENKINS] Archiving <https://builds.apache.org/job/CXF-Master-Analysis/ws/rt/rs/extensions/json-basic/pom.xml>
to org.apache.cxf/cxf-rt-rs-json-basic/3.2.0-SNAPSHOT/cxf-rt-rs-json-basic-3.2.0-SNAPSHOT.pom
No prior successful build to compare, so performing full copy of artifacts
[JENKINS] Archiving <https://builds.apache.org/job/CXF-Master-Analysis/ws/distribution/src/main/release/samples/jax_rs/minimal_osgi/pom.xml>
to org.apache.cxf.samples/jax_rs_minimal_osgi/3.2.0-SNAPSHOT/jax_rs_minimal_osgi-3.2.0-SNAPSHOT.pom
No prior successful build to compare, so performing full copy of artifacts
[JENKINS] Archiving <https://builds.apache.org/job/CXF-Master-Analysis/ws/rt/rs/client/pom.xml>
to org.apache.cxf/cxf-rt-rs-client/3.2.0-SNAPSHOT/cxf-rt-rs-client-3.2.0-SNAPSHOT.pom
No prior successful build to compare, so performing full copy of artifacts
[JENKINS] Archiving <https://builds.apache.org/job/CXF-Master-Analysis/ws/distribution/src/main/release/samples/jax_rs/description_swagger2_osgi/pom.xml>
to org.apache.cxf.samples/jax_rs_description_swagger2_osgi/3.2.0-SNAPSHOT/jax_rs_description_swagger2_osgi-3.2.0-SNAPSHOT.pom
No prior successful build to compare, so performing full copy of artifacts
[JENKINS] Archiving <https://builds.apache.org/job/CXF-Master-Analysis/ws/testutils/pom.xml>
to org.apache.cxf/cxf-testutils/3.2.0-SNAPSHOT/cxf-testutils-3.2.0-SNAPSHOT.pom
No prior successful build to compare, so performing full copy of artifacts
[JENKINS] Archiving <https://builds.apache.org/job/CXF-Master-Analysis/ws/rt/rs/extensions/providers/pom.xml>
to org.apache.cxf/cxf-rt-rs-extension-providers/3.2.0-SNAPSHOT/cxf-rt-rs-extension-providers-3.2.0-SNAPSHOT.pom
No prior successful build to compare, so performing full copy of artifacts
[JENKINS] Archiving <https://builds.apache.org/job/CXF-Master-Analysis/ws/services/xkms/xkms-x509-handlers/pom.xml>
to org.apache.cxf.services.xkms/cxf-services-xkms-x509-handlers/3.2.0-SNAPSHOT/cxf-services-xkms-x509-handlers-3.2.0-SNAPSHOT.pom
No prior successful build to compare, so performing full copy of artifacts
[JENKINS] Archiving <https://builds.apache.org/job/CXF-Master-Analysis/ws/rt/frontend/js/pom.xml>
to org.apache.cxf/cxf-rt-frontend-js/3.2.0-SNAPSHOT/cxf-rt-frontend-js-3.2.0-SNAPSHOT.pom
No prior successful build to compare, so performing full copy of artifacts
[JENKINS] Archiving <https://builds.apache.org/job/CXF-Master-Analysis/ws/tools/validator/pom.xml>
to org.apache.cxf/cxf-tools-validator/3.2.0-SNAPSHOT/cxf-tools-validator-3.2.0-SNAPSHOT.pom
No prior successful build to compare, so performing full copy of artifacts
[JENKINS] Archiving <https://builds.apache.org/job/CXF-Master-Analysis/ws/systests/cdi/base/pom.xml>
to org.apache.cxf.systests/cxf-systests-cdi-base/3.2.0-SNAPSHOT/cxf-systests-cdi-base-3.2.0-SNAPSHOT.pom
No prior successful build to compare, so performing full copy of artifacts
[JENKINS] Archiving <https://builds.apache.org/job/CXF-Master-Analysis/ws/rt/rs/sse/pom.xml>
to org.apache.cxf/cxf-rt-rs-sse/3.2.0-SNAPSHOT/cxf-rt-rs-sse-3.2.0-SNAPSHOT.pom
No prior successful build to compare, so performing full copy of artifacts
[JENKINS] Archiving <https://builds.apache.org/job/CXF-Master-Analysis/ws/distribution/src/main/release/samples/wsdl_first_rpclit/pom.xml>
to org.apache.cxf.samples/wsdl_first_rpclit/3.2.0-SNAPSHOT/wsdl_first_rpclit-3.2.0-SNAPSHOT.pom
No prior successful build to compare, so performing full copy of artifacts
[JENKINS] Archiving <https://builds.apache.org/job/CXF-Master-Analysis/ws/distribution/pom.xml>
to org.apache.cxf/apache-cxf/3.2.0-SNAPSHOT/apache-cxf-3.2.0-SNAPSHOT.pom
No prior successful build to compare, so performing full copy of artifacts
[JENKINS] Archiving <https://builds.apache.org/job/CXF-Master-Analysis/ws/distribution/javadoc/pom.xml>
to org.apache.cxf/cxf-distribution-javadoc/3.2.0-SNAPSHOT/cxf-distribution-javadoc-3.2.0-SNAPSHOT.pom
No prior successful build to compare, so performing full copy of artifacts
[JENKINS] Archiving <https://builds.apache.org/job/CXF-Master-Analysis/ws/distribution/src/main/release/samples/sts/pom.xml>
to org.apache.cxf.samples/sts/3.2.0-SNAPSHOT/sts-3.2.0-SNAPSHOT.pom
No prior successful build to compare, so performing full copy of artifacts
[JENKINS] Archiving <https://builds.apache.org/job/CXF-Master-Analysis/ws/distribution/src/main/release/samples/jax_rs/description_swagger2_spring/pom.xml>
to org.apache.cxf.samples/jax_rs_description_swagger2_spring/3.2.0-SNAPSHOT/jax_rs_description_swagger2_spring-3.2.0-SNAPSHOT.pom
No prior successful build to compare, so performing full copy of artifacts
[JENKINS] Archiving <https://builds.apache.org/job/CXF-Master-Analysis/ws/systests/tracing/pom.xml>
to org.apache.cxf.systests/cxf-systests-tracing/3.2.0-SNAPSHOT/cxf-systests-tracing-3.2.0-SNAPSHOT.pom
No prior successful build to compare, so performing full copy of artifacts
[JENKINS] Archiving <https://builds.apache.org/job/CXF-Master-Analysis/ws/services/sts/sts-core/pom.xml>
to org.apache.cxf.services.sts/cxf-services-sts-core/3.2.0-SNAPSHOT/cxf-services-sts-core-3.2.0-SNAPSHOT.pom
No prior successful build to compare, so performing full copy of artifacts
[JENKINS] Archiving <https://builds.apache.org/job/CXF-Master-Analysis/ws/integration/pom.xml>
to org.apache.cxf/cxf-integration/3.2.0-SNAPSHOT/cxf-integration-3.2.0-SNAPSHOT.pom
No prior successful build to compare, so performing full copy of artifacts
[JENKINS] Archiving <https://builds.apache.org/job/CXF-Master-Analysis/ws/distribution/src/main/release/samples/js_browser_client_simple/pom.xml>
to org.apache.cxf.samples/js_browser_client_simple/3.2.0-SNAPSHOT/js_browser_client_simple-3.2.0-SNAPSHOT.pom
No prior successful build to compare, so performing full copy of artifacts
[JENKINS] Archiving <https://builds.apache.org/job/CXF-Master-Analysis/ws/rt/rs/security/sso/saml/pom.xml>
to org.apache.cxf/cxf-rt-rs-security-sso-saml/3.2.0-SNAPSHOT/cxf-rt-rs-security-sso-saml-3.2.0-SNAPSHOT.pom
No prior successful build to compare, so performing full copy of artifacts
[JENKINS] Archiving <https://builds.apache.org/job/CXF-Master-Analysis/ws/systests/cdi/cdi-weld/cdi-producers-weld/pom.xml>
to org.apache.cxf.systests/cxf-systests-cdi-weld-producers/3.2.0-SNAPSHOT/cxf-systests-cdi-weld-producers-3.2.0-SNAPSHOT.pom
No prior successful build to compare, so performing full copy of artifacts
[JENKINS] Archiving <https://builds.apache.org/job/CXF-Master-Analysis/ws/rt/rs/security/jose-parent/pom.xml>
to org.apache.cxf/cxf-rt-rs-security-jose-parent/3.2.0-SNAPSHOT/cxf-rt-rs-security-jose-parent-3.2.0-SNAPSHOT.pom
No prior successful build to compare, so performing full copy of artifacts
[JENKINS] Archiving <https://builds.apache.org/job/CXF-Master-Analysis/ws/rt/rs/security/xml/pom.xml>
to org.apache.cxf/cxf-rt-rs-security-xml/3.2.0-SNAPSHOT/cxf-rt-rs-security-xml-3.2.0-SNAPSHOT.pom
No prior successful build to compare, so performing full copy of artifacts
[JENKINS] Archiving <https://builds.apache.org/job/CXF-Master-Analysis/ws/distribution/src/main/release/samples/jaxws_dispatch_provider/pom.xml>
to org.apache.cxf.samples/jaxws_dispatch_provider/3.2.0-SNAPSHOT/jaxws_dispatch_provider-3.2.0-SNAPSHOT.pom
No prior successful build to compare, so performing full copy of artifacts
[JENKINS] Archiving <https://builds.apache.org/job/CXF-Master-Analysis/ws/services/wsn/wsn-api/pom.xml>
to org.apache.cxf.services.wsn/cxf-services-wsn-api/3.2.0-SNAPSHOT/cxf-services-wsn-api-3.2.0-SNAPSHOT.pom
No prior successful build to compare, so performing full copy of artifacts
[JENKINS] Archiving <https://builds.apache.org/job/CXF-Master-Analysis/ws/rt/bindings/xml/pom.xml>
to org.apache.cxf/cxf-rt-bindings-xml/3.2.0-SNAPSHOT/cxf-rt-bindings-xml-3.2.0-SNAPSHOT.pom
No prior successful build to compare, so performing full copy of artifacts
[JENKINS] Archiving <https://builds.apache.org/job/CXF-Master-Analysis/ws/rt/management/pom.xml>
to org.apache.cxf/cxf-rt-management/3.2.0-SNAPSHOT/cxf-rt-management-3.2.0-SNAPSHOT.pom
No prior successful build to compare, so performing full copy of artifacts
[JENKINS] Archiving <https://builds.apache.org/job/CXF-Master-Analysis/ws/tools/wadlto/jaxrs/pom.xml>
to org.apache.cxf/cxf-tools-wadlto-jaxrs/3.2.0-SNAPSHOT/cxf-tools-wadlto-jaxrs-3.2.0-SNAPSHOT.pom
No prior successful build to compare, so performing full copy of artifacts
[JENKINS] Archiving <https://builds.apache.org/job/CXF-Master-Analysis/ws/distribution/src/main/release/samples/groovy_spring_support/pom.xml>
to org.apache.cxf.samples/groovy_spring_support/3.2.0-SNAPSHOT/groovy_spring_support-3.2.0-SNAPSHOT.pom
No prior successful build to compare, so performing full copy of artifacts
[JENKINS] Archiving <https://builds.apache.org/job/CXF-Master-Analysis/ws/distribution/src/main/release/samples/jax_server_aegis_client/pom.xml>
to org.apache.cxf.samples/jax_service_aegis_client/3.2.0-SNAPSHOT/jax_service_aegis_client-3.2.0-SNAPSHOT.pom
No prior successful build to compare, so performing full copy of artifacts
[JENKINS] Archiving <https://builds.apache.org/job/CXF-Master-Analysis/ws/integration/spring-boot/autoconfigure/pom.xml>
to org.apache.cxf/cxf-spring-boot-autoconfigure/3.2.0-SNAPSHOT/cxf-spring-boot-autoconfigure-3.2.0-SNAPSHOT.pom
No prior successful build to compare, so performing full copy of artifacts
[JENKINS] Archiving <https://builds.apache.org/job/CXF-Master-Analysis/ws/tools/wadlto/pom.xml>
to org.apache.cxf/cxf-tools-wadlto/3.2.0-SNAPSHOT/cxf-tools-wadlto-3.2.0-SNAPSHOT.pom
No prior successful build to compare, so performing full copy of artifacts
[JENKINS] Archiving <https://builds.apache.org/job/CXF-Master-Analysis/ws/distribution/src/main/release/samples/jax_rs/tracing_brave/pom.xml>
to org.apache.cxf.samples/jax_rs_tracing_brave/3.2.0-SNAPSHOT/jax_rs_tracing_brave-3.2.0-SNAPSHOT.pom
No prior successful build to compare, so performing full copy of artifacts
[JENKINS] Archiving <https://builds.apache.org/job/CXF-Master-Analysis/ws/distribution/src/main/release/samples/js_client/pom.xml>
to org.apache.cxf.samples/js_client/3.2.0-SNAPSHOT/js_client-3.2.0-SNAPSHOT.pom
No prior successful build to compare, so performing full copy of artifacts
[JENKINS] Archiving <https://builds.apache.org/job/CXF-Master-Analysis/ws/rt/rs/http-sci/pom.xml>
to org.apache.cxf/cxf-rt-rs-http-sci/3.2.0-SNAPSHOT/cxf-rt-rs-http-sci-3.2.0-SNAPSHOT.pom
No prior successful build to compare, so performing full copy of artifacts
[JENKINS] Archiving <https://builds.apache.org/job/CXF-Master-Analysis/ws/systests/ws-transfer/pom.xml>
to org.apache.cxf/cxf-systests-ws-transfer/3.2.0-SNAPSHOT/cxf-systests-ws-transfer-3.2.0-SNAPSHOT.pom
No prior successful build to compare, so performing full copy of artifacts
[JENKINS] Archiving <https://builds.apache.org/job/CXF-Master-Analysis/ws/distribution/src/main/release/samples/jax_rs/basic_oidc/pom.xml>
to org.apache.cxf.samples/jax_rs_basic_oidc/3.2.0-SNAPSHOT/jax_rs_basic_oidc-3.2.0-SNAPSHOT.pom
No prior successful build to compare, so performing full copy of artifacts
[JENKINS] Archiving <https://builds.apache.org/job/CXF-Master-Analysis/ws/rt/ws/addr/pom.xml>
to org.apache.cxf/cxf-rt-ws-addr/3.2.0-SNAPSHOT/cxf-rt-ws-addr-3.2.0-SNAPSHOT.pom
No prior successful build to compare, so performing full copy of artifacts
[JENKINS] Archiving <https://builds.apache.org/job/CXF-Master-Analysis/ws/tools/wsdlto/pom.xml>
to org.apache.cxf/cxf-tools-wsdlto/3.2.0-SNAPSHOT/cxf-tools-wsdlto-3.2.0-SNAPSHOT.pom
No prior successful build to compare, so performing full copy of artifacts
[JENKINS] Archiving <https://builds.apache.org/job/CXF-Master-Analysis/ws/distribution/src/main/release/samples/jax_rs/spring_security/pom.xml>
to org.apache.cxf.samples/jax_rs_spring_security/3.2.0-SNAPSHOT/jax_rs_spring_security-3.2.0-SNAPSHOT.pom
No prior successful build to compare, so performing full copy of artifacts
[JENKINS] Archiving <https://builds.apache.org/job/CXF-Master-Analysis/ws/tools/wsdlto/frontend/javascript/pom.xml>
to org.apache.cxf/cxf-tools-wsdlto-frontend-javascript/3.2.0-SNAPSHOT/cxf-tools-wsdlto-frontend-javascript-3.2.0-SNAPSHOT.pom
No prior successful build to compare, so performing full copy of artifacts
[JENKINS] Archiving <https://builds.apache.org/job/CXF-Master-Analysis/ws/distribution/src/main/release/samples/jax_rs/basic/pom.xml>
to org.apache.cxf.samples/jax_rs_basic/3.2.0-SNAPSHOT/jax_rs_basic-3.2.0-SNAPSHOT.pom
No prior successful build to compare, so performing full copy of artifacts
[JENKINS] Archiving <https://builds.apache.org/job/CXF-Master-Analysis/ws/distribution/src/main/release/samples/ws_security/ut/pom.xml>
to org.apache.cxf.samples/wssec_ut/3.2.0-SNAPSHOT/wssec_ut-3.2.0-SNAPSHOT.pom
No prior successful build to compare, so performing full copy of artifacts
[JENKINS] Archiving <https://builds.apache.org/job/CXF-Master-Analysis/ws/distribution/src/main/release/samples/ws_security/ut_policy/pom.xml>
to org.apache.cxf.samples/wssec_ut_policy/3.2.0-SNAPSHOT/wssec_ut_policy-3.2.0-SNAPSHOT.pom
No prior successful build to compare, so performing full copy of artifacts
[JENKINS] Archiving <https://builds.apache.org/job/CXF-Master-Analysis/ws/rt/transports/local/pom.xml>
to org.apache.cxf/cxf-rt-transports-local/3.2.0-SNAPSHOT/cxf-rt-transports-local-3.2.0-SNAPSHOT.pom
No prior successful build to compare, so performing full copy of artifacts
[JENKINS] Archiving <https://builds.apache.org/job/CXF-Master-Analysis/ws/distribution/src/main/release/samples/wsdl_first_xml_wrapped/pom.xml>
to org.apache.cxf.samples/wsdl_first_xml_wrapped/3.2.0-SNAPSHOT/wsdl_first_xml_wrapped-3.2.0-SNAPSHOT.pom
No prior successful build to compare, so performing full copy of artifacts
[JENKINS] Archiving <https://builds.apache.org/job/CXF-Master-Analysis/ws/distribution/src/main/release/samples/jaxws_spring_boot/pom.xml>
to org.apache.cxf.samples/spring-boot-sample-ws-cxf/3.2.0-SNAPSHOT/spring-boot-sample-ws-cxf-3.2.0-SNAPSHOT.pom
No prior successful build to compare, so performing full copy of artifacts
[JENKINS] Archiving <https://builds.apache.org/job/CXF-Master-Analysis/ws/distribution/src/main/release/samples/configuration_interceptor/pom.xml>
to org.apache.cxf.samples/configuration_interceptor/3.2.0-SNAPSHOT/configuration_interceptor-3.2.0-SNAPSHOT.pom
No prior successful build to compare, so performing full copy of artifacts
[JENKINS] Archiving <https://builds.apache.org/job/CXF-Master-Analysis/ws/distribution/src/main/release/samples/java_first_jaxws_factory_bean/pom.xml>
to org.apache.cxf.samples/java_first_jaxws_factory_bean/3.2.0-SNAPSHOT/java_first_jaxws_factory_bean-3.2.0-SNAPSHOT.pom
No prior successful build to compare, so performing full copy of artifacts
[JENKINS] Archiving <https://builds.apache.org/job/CXF-Master-Analysis/ws/distribution/src/main/release/samples/js_provider/pom.xml>
to org.apache.cxf.samples/js_provider/3.2.0-SNAPSHOT/js_provider-3.2.0-SNAPSHOT.pom
No prior successful build to compare, so performing full copy of artifacts
[JENKINS] Archiving <https://builds.apache.org/job/CXF-Master-Analysis/ws/distribution/src/main/release/samples/clustering/failover_jaxws_osgi/pom.xml>
to org.apache.cxf.samples/failover_jaxws_osgi/3.2.0-SNAPSHOT/failover_jaxws_osgi-3.2.0-SNAPSHOT.pom
No prior successful build to compare, so performing full copy of artifacts
[JENKINS] Archiving <https://builds.apache.org/job/CXF-Master-Analysis/ws/rt/rs/description-swagger/pom.xml>
to org.apache.cxf/cxf-rt-rs-service-description-swagger/3.2.0-SNAPSHOT/cxf-rt-rs-service-description-swagger-3.2.0-SNAPSHOT.pom
No prior successful build to compare, so performing full copy of artifacts
[JENKINS] Archiving <https://builds.apache.org/job/CXF-Master-Analysis/ws/rt/frontend/jaxrs/pom.xml>
to org.apache.cxf/cxf-rt-frontend-jaxrs/3.2.0-SNAPSHOT/cxf-rt-frontend-jaxrs-3.2.0-SNAPSHOT.pom
No prior successful build to compare, so performing full copy of artifacts
[JENKINS] Archiving <https://builds.apache.org/job/CXF-Master-Analysis/ws/distribution/src/main/release/samples/ws_eventing/pom.xml>
to org.apache.cxf.samples/ws_eventing/3.2.0-SNAPSHOT/ws_eventing-3.2.0-SNAPSHOT.pom
No prior successful build to compare, so performing full copy of artifacts
[JENKINS] Archiving <https://builds.apache.org/job/CXF-Master-Analysis/ws/rt/rs/extensions/search/pom.xml>
to org.apache.cxf/cxf-rt-rs-extension-search/3.2.0-SNAPSHOT/cxf-rt-rs-extension-search-3.2.0-SNAPSHOT.pom
No prior successful build to compare, so performing full copy of artifacts
[JENKINS] Archiving <https://builds.apache.org/job/CXF-Master-Analysis/ws/rt/rs/description/pom.xml>
to org.apache.cxf/cxf-rt-rs-service-description/3.2.0-SNAPSHOT/cxf-rt-rs-service-description-3.2.0-SNAPSHOT.pom
No prior successful build to compare, so performing full copy of artifacts
[JENKINS] Archiving <https://builds.apache.org/job/CXF-Master-Analysis/ws/rt/bindings/pom.xml>
to org.apache.cxf/cxf-rt-bindings/3.2.0-SNAPSHOT/cxf-rt-bindings-3.2.0-SNAPSHOT.pom
No prior successful build to compare, so performing full copy of artifacts
[JENKINS] Archiving <https://builds.apache.org/job/CXF-Master-Analysis/ws/distribution/src/main/release/samples/jms_pubsub/pom.xml>
to org.apache.cxf.samples/jms_pubsub/3.2.0-SNAPSHOT/jms_pubsub-3.2.0-SNAPSHOT.pom
No prior successful build to compare, so performing full copy of artifacts
[JENKINS] Archiving <https://builds.apache.org/job/CXF-Master-Analysis/ws/services/xkms/xkms-osgi/pom.xml>
to org.apache.cxf.services.xkms/cxf-services-xkms-osgi/3.2.0-SNAPSHOT/cxf-services-xkms-osgi-3.2.0-SNAPSHOT.pom
No prior successful build to compare, so performing full copy of artifacts
[JENKINS] Archiving <https://builds.apache.org/job/CXF-Master-Analysis/ws/distribution/src/main/release/samples/corba/bank_ws_addressing/pom.xml>
to org.apache.cxf.samples/corba-bank-ws-addressing/3.2.0-SNAPSHOT/corba-bank-ws-addressing-3.2.0-SNAPSHOT.pom
No prior successful build to compare, so performing full copy of artifacts
[JENKINS] Archiving <https://builds.apache.org/job/CXF-Master-Analysis/ws/integration/spring-boot/starter-jaxrs/pom.xml>
to org.apache.cxf/cxf-spring-boot-starter-jaxrs/3.2.0-SNAPSHOT/cxf-spring-boot-starter-jaxrs-3.2.0-SNAPSHOT.pom
No prior successful build to compare, so performing full copy of artifacts
[JENKINS] Archiving <https://builds.apache.org/job/CXF-Master-Analysis/ws/maven-plugins/java2wadl-plugin/pom.xml>
to org.apache.cxf/cxf-java2wadl-plugin/3.2.0-SNAPSHOT/cxf-java2wadl-plugin-3.2.0-SNAPSHOT.pom
No prior successful build to compare, so performing full copy of artifacts
[JENKINS] Archiving <https://builds.apache.org/job/CXF-Master-Analysis/ws/systests/container-integration/grizzly/pom.xml>
to org.apache.cxf.systests/cxf-systests-ci-grizzly/3.2.0-SNAPSHOT/cxf-systests-ci-grizzly-3.2.0-SNAPSHOT.pom
No prior successful build to compare, so performing full copy of artifacts
[JENKINS] Archiving <https://builds.apache.org/job/CXF-Master-Analysis/ws/rt/bindings/corba/pom.xml>
to org.apache.cxf/cxf-rt-bindings-corba/3.2.0-SNAPSHOT/cxf-rt-bindings-corba-3.2.0-SNAPSHOT.pom
No prior successful build to compare, so performing full copy of artifacts
[JENKINS] Archiving <https://builds.apache.org/job/CXF-Master-Analysis/ws/distribution/src/main/release/samples/js_browser_client_java_first/pom.xml>
to org.apache.cxf.samples/js_browser_client_java/3.2.0-SNAPSHOT/js_browser_client_java-3.2.0-SNAPSHOT.pom
No prior successful build to compare, so performing full copy of artifacts
[JENKINS] Archiving <https://builds.apache.org/job/CXF-Master-Analysis/ws/maven-plugins/archetypes/pom.xml>
to org.apache.cxf/cxf-archetypes/3.2.0-SNAPSHOT/cxf-archetypes-3.2.0-SNAPSHOT.pom
No prior successful build to compare, so performing full copy of artifacts
[JENKINS] Archiving <https://builds.apache.org/job/CXF-Master-Analysis/ws/rt/bindings/soap/pom.xml>
to org.apache.cxf/cxf-rt-bindings-soap/3.2.0-SNAPSHOT/cxf-rt-bindings-soap-3.2.0-SNAPSHOT.pom
No prior successful build to compare, so performing full copy of artifacts
[JENKINS] Archiving <https://builds.apache.org/job/CXF-Master-Analysis/ws/services/wsn/pom.xml>
to org.apache.cxf.services.wsn/cxf-services-wsn/3.2.0-SNAPSHOT/cxf-services-wsn-3.2.0-SNAPSHOT.pom
No prior successful build to compare, so performing full copy of artifacts
[JENKINS] Archiving <https://builds.apache.org/job/CXF-Master-Analysis/ws/services/sts/pom.xml>
to org.apache.cxf.services.sts/cxf-services-sts/3.2.0-SNAPSHOT/cxf-services-sts-3.2.0-SNAPSHOT.pom
No prior successful build to compare, so performing full copy of artifacts
[JENKINS] Archiving <https://builds.apache.org/job/CXF-Master-Analysis/ws/rt/rs/security/sso/oidc/pom.xml>
to org.apache.cxf/cxf-rt-rs-security-sso-oidc/3.2.0-SNAPSHOT/cxf-rt-rs-security-sso-oidc-3.2.0-SNAPSHOT.pom
No prior successful build to compare, so performing full copy of artifacts
[JENKINS] Archiving <https://builds.apache.org/job/CXF-Master-Analysis/ws/rt/ws/transfer/pom.xml>
to org.apache.cxf/cxf-rt-ws-transfer/3.2.0-SNAPSHOT/cxf-rt-ws-transfer-3.2.0-SNAPSHOT.pom
No prior successful build to compare, so performing full copy of artifacts
[JENKINS] Archiving <https://builds.apache.org/job/CXF-Master-Analysis/ws/systests/uncategorized/pom.xml>
to org.apache.cxf.systests/cxf-systests-uncategorized/3.2.0-SNAPSHOT/cxf-systests-uncategorized-3.2.0-SNAPSHOT.pom
No prior successful build to compare, so performing full copy of artifacts
[JENKINS] Archiving <https://builds.apache.org/job/CXF-Master-Analysis/ws/rt/wsdl/pom.xml>
to org.apache.cxf/cxf-rt-wsdl/3.2.0-SNAPSHOT/cxf-rt-wsdl-3.2.0-SNAPSHOT.pom
No prior successful build to compare, so performing full copy of artifacts
[JENKINS] Archiving <https://builds.apache.org/job/CXF-Master-Analysis/ws/services/xkms/xkms-service/pom.xml>
to org.apache.cxf.services.xkms/cxf-services-xkms-service/3.2.0-SNAPSHOT/cxf-services-xkms-service-3.2.0-SNAPSHOT.pom
No prior successful build to compare, so performing full copy of artifacts
channel stopped
ERROR: Failed to parse POMs
java.io.IOException: java.util.concurrent.ExecutionException: java.lang.OutOfMemoryError:
GC overhead limit exceeded
	at hudson.FilePath.copyRecursiveTo(FilePath.java:2215)
	at jenkins.model.StandardArtifactManager.archive(StandardArtifactManager.java:61)
	at com.cloudbees.jenkins.plugins.jsync.archiver.JSyncArtifactManager.remoteSync(JSyncArtifactManager.java:121)
	at com.cloudbees.jenkins.plugins.jsync.archiver.JSyncArtifactManager.archive(JSyncArtifactManager.java:76)
	at hudson.maven.MavenBuild$ProxyImpl.performArchiving(MavenBuild.java:486)
	at hudson.maven.MavenModuleSetBuild$MavenModuleSetBuildExecution.doRun(MavenModuleSetBuild.java:875)
	at hudson.model.AbstractBuild$AbstractBuildExecution.run(AbstractBuild.java:534)
	at hudson.model.Run.execute(Run.java:1728)
	at hudson.maven.MavenModuleSetBuild.run(MavenModuleSetBuild.java:544)
	at hudson.model.ResourceController.execute(ResourceController.java:98)
	at hudson.model.Executor.run(Executor.java:405)
Caused by: java.util.concurrent.ExecutionException: java.lang.OutOfMemoryError: GC overhead
limit exceeded
	at hudson.remoting.Channel$2.adapt(Channel.java:862)
	at hudson.remoting.Channel$2.adapt(Channel.java:857)
	at hudson.remoting.FutureAdapter.get(FutureAdapter.java:55)
	at hudson.FilePath.copyRecursiveTo(FilePath.java:2213)
	... 10 more
Caused by: java.lang.OutOfMemoryError: GC overhead limit exceeded
	at java.nio.ByteBuffer.wrap(ByteBuffer.java:369)
	at java.nio.ByteBuffer.wrap(ByteBuffer.java:392)
	at sun.nio.fs.UnixPath.encode(UnixPath.java:135)
	at sun.nio.fs.UnixPath.<init>(UnixPath.java:71)
	at sun.nio.fs.UnixFileSystem.getPath(UnixFileSystem.java:281)
	at java.io.File.toPath(File.java:2186)
	at hudson.Util.resolveSymlink(Util.java:1457)
	at hudson.util.DirScanner.scanSingle(DirScanner.java:37)
	at hudson.FilePath$ExplicitlySpecifiedDirScanner.scan(FilePath.java:2804)
	at hudson.FilePath.writeToTar(FilePath.java:2251)
	at hudson.FilePath.access$2100(FilePath.java:195)
	at hudson.FilePath$45.invoke(FilePath.java:2194)
	at hudson.FilePath$45.invoke(FilePath.java:2190)
	at hudson.FilePath$FileCallableWrapper.call(FilePath.java:2731)
	at hudson.remoting.UserRequest.perform(UserRequest.java:153)
	at hudson.remoting.UserRequest.perform(UserRequest.java:50)
	at hudson.remoting.Request$2.run(Request.java:336)
	at hudson.remoting.InterceptingExecutorService$1.call(InterceptingExecutorService.java:68)
	at java.util.concurrent.FutureTask.run(FutureTask.java:262)
	at java.util.concurrent.ThreadPoolExecutor.runWorker(ThreadPoolExecutor.java:1145)
	at java.util.concurrent.ThreadPoolExecutor$Worker.run(ThreadPoolExecutor.java:615)
	at java.lang.Thread.run(Thread.java:745)
	at ......remote call to ubuntu-eu2(Native Method)
	at hudson.remoting.Channel.attachCallSiteStackTrace(Channel.java:1545)
	at hudson.remoting.UserResponse.retrieve(UserRequest.java:253)
	at hudson.remoting.Channel$2.adapt(Channel.java:860)
	... 13 more

Mime
View raw message