cxf-notifications mailing list archives

Site index · List index
Message view « Date » · « Thread »
Top « Date » · « Thread »
From Apache Jenkins Server <jenk...@builds.apache.org>
Subject Build failed in Jenkins: CXF-trunk-deploy #2126
Date Thu, 16 Feb 2017 06:51:35 GMT
See <https://builds.apache.org/job/CXF-trunk-deploy/2126/changes>

Changes:

[freeman.fang] [CXF-6866]bindingId on Client/ServerFactoryBean does not overrule WSDL

[coheigea] Moving public loggers to private

[coheigea] Replace .size() > 0 with !isEmpty() for collections

[coheigea] Enabling MTOM security tests

[sberyozkin] Better support for the value contexts such as Application or Sse

[sberyozkin] Delaying injecting the contexts after the CXF features have been

[reta] Upgrading to JAX-RS 2.1-m04, updating SSE server-side implementation to

------------------------------------------
Started by an SCM change
[EnvInject] - Loading node environment variables.
Building remotely on H21 (ubuntu) in workspace <https://builds.apache.org/job/CXF-trunk-deploy/ws/>
Cloning the remote Git repository
Cloning repository https://git-wip-us.apache.org/repos/asf/cxf.git
 > git init <https://builds.apache.org/job/CXF-trunk-deploy/ws/> # timeout=10
Fetching upstream changes from https://git-wip-us.apache.org/repos/asf/cxf.git
 > git --version # timeout=10
 > git -c core.askpass=true fetch --tags --progress https://git-wip-us.apache.org/repos/asf/cxf.git
+refs/heads/*:refs/remotes/origin/*
 > git config remote.origin.url https://git-wip-us.apache.org/repos/asf/cxf.git # timeout=10
 > git config --add remote.origin.fetch +refs/heads/*:refs/remotes/origin/* # timeout=10
 > git config remote.origin.url https://git-wip-us.apache.org/repos/asf/cxf.git # timeout=10
Fetching upstream changes from https://git-wip-us.apache.org/repos/asf/cxf.git
 > git -c core.askpass=true fetch --tags --progress https://git-wip-us.apache.org/repos/asf/cxf.git
+refs/heads/*:refs/remotes/origin/*
 > git rev-parse refs/remotes/origin/master^{commit} # timeout=10
 > git rev-parse refs/remotes/origin/origin/master^{commit} # timeout=10
Checking out Revision 1b8064f475b09323c5c11d9e8a4e1440879cae26 (refs/remotes/origin/master)
 > git config core.sparsecheckout # timeout=10
 > git checkout -f 1b8064f475b09323c5c11d9e8a4e1440879cae26
 > git rev-list 9323b68565ef79717e9d3e60744dd1bf63c1a5d8 # timeout=10
Parsing POMs
Downloaded artifact http://repo.maven.apache.org/maven2/org/springframework/boot/spring-boot-dependencies/1.5.1.RELEASE/spring-boot-dependencies-1.5.1.RELEASE.pom
Downloaded artifact http://repo.maven.apache.org/maven2/com/fasterxml/jackson/jackson-bom/2.8.6/jackson-bom-2.8.6.pom
Downloaded artifact http://repo.maven.apache.org/maven2/org/apache/logging/log4j/log4j-bom/2.7/log4j-bom-2.7.pom
Downloaded artifact http://repo.maven.apache.org/maven2/org/springframework/spring-framework-bom/4.3.6.RELEASE/spring-framework-bom-4.3.6.RELEASE.pom
Downloaded artifact http://repo.maven.apache.org/maven2/org/springframework/data/spring-data-releasetrain/Ingalls-RELEASE/spring-data-releasetrain-Ingalls-RELEASE.pom
Downloaded artifact http://repo.maven.apache.org/maven2/org/springframework/data/build/spring-data-build/1.9.0.RELEASE/spring-data-build-1.9.0.RELEASE.pom
Downloaded artifact http://repo.maven.apache.org/maven2/org/springframework/integration/spring-integration-bom/4.3.7.RELEASE/spring-integration-bom-4.3.7.RELEASE.pom
Downloaded artifact http://repo.maven.apache.org/maven2/org/springframework/security/spring-security-bom/4.2.1.RELEASE/spring-security-bom-4.2.1.RELEASE.pom
Downloaded artifact http://repo.maven.apache.org/maven2/org/springframework/cloud/spring-cloud-netflix/1.2.1.RELEASE/spring-cloud-netflix-1.2.1.RELEASE.pom
Downloaded artifact http://repo.maven.apache.org/maven2/org/springframework/cloud/spring-cloud-build/1.2.1.RELEASE/spring-cloud-build-1.2.1.RELEASE.pom
Downloaded artifact http://repo.maven.apache.org/maven2/org/springframework/cloud/spring-cloud-netflix-dependencies/1.2.1.RELEASE/spring-cloud-netflix-dependencies-1.2.1.RELEASE.pom
Downloaded artifact http://repo.maven.apache.org/maven2/org/springframework/cloud/spring-cloud-dependencies-parent/1.2.1.RELEASE/spring-cloud-dependencies-parent-1.2.1.RELEASE.pom
Downloaded artifact http://repo.maven.apache.org/maven2/org/springframework/cloud/spring-cloud-commons-dependencies/1.1.4.RELEASE/spring-cloud-commons-dependencies-1.1.4.RELEASE.pom
Downloaded artifact http://repo.maven.apache.org/maven2/org/springframework/cloud/spring-cloud-dependencies-parent/1.1.2.RELEASE/spring-cloud-dependencies-parent-1.1.2.RELEASE.pom
Downloaded artifact http://repo.maven.apache.org/maven2/org/springframework/cloud/spring-cloud-config-dependencies/1.2.1.RELEASE/spring-cloud-config-dependencies-1.2.1.RELEASE.pom
Downloaded artifact http://repo.maven.apache.org/maven2/org/springframework/cloud/spring-cloud-stream-dependencies/Brooklyn.RELEASE/spring-cloud-stream-dependencies-Brooklyn.RELEASE.pom
Downloaded artifact http://repo.maven.apache.org/maven2/org/springframework/boot/spring-boot-dependencies/1.4.1.RELEASE/spring-boot-dependencies-1.4.1.RELEASE.pom
Downloaded artifact http://repo.maven.apache.org/maven2/org/springframework/spring-framework-bom/4.3.3.RELEASE/spring-framework-bom-4.3.3.RELEASE.pom
Downloaded artifact http://repo.maven.apache.org/maven2/org/springframework/data/spring-data-releasetrain/Hopper-SR3/spring-data-releasetrain-Hopper-SR3.pom
Downloaded artifact http://repo.maven.apache.org/maven2/org/springframework/data/build/spring-data-build/1.8.3.RELEASE/spring-data-build-1.8.3.RELEASE.pom
Downloaded artifact http://repo.maven.apache.org/maven2/org/springframework/integration/spring-integration-bom/4.3.2.RELEASE/spring-integration-bom-4.3.2.RELEASE.pom
Downloaded artifact http://repo.maven.apache.org/maven2/org/springframework/security/spring-security-bom/4.1.3.RELEASE/spring-security-bom-4.1.3.RELEASE.pom
ERROR: Failed to parse POMs
java.io.IOException: remote file operation failed: <https://builds.apache.org/job/CXF-trunk-deploy/ws/>
at hudson.remoting.Channel@6ff280b:H21: hudson.remoting.ProxyException: hudson.maven.MavenModuleSetBuild$MavenExecutionException:
org.apache.maven.project.ProjectBuildingException: Some problems were encountered while processing
the POMs:
[ERROR] 'dependencies.dependency.version' for org.springframework.boot:spring-boot-starter-ws:jar
is missing. @ line 31, column 21

	at hudson.FilePath.act(FilePath.java:1014)
	at hudson.FilePath.act(FilePath.java:996)
	at hudson.maven.MavenModuleSetBuild$MavenModuleSetBuildExecution.parsePoms(MavenModuleSetBuild.java:960)
	at hudson.maven.MavenModuleSetBuild$MavenModuleSetBuildExecution.doRun(MavenModuleSetBuild.java:679)
	at hudson.model.AbstractBuild$AbstractBuildExecution.run(AbstractBuild.java:534)
	at hudson.model.Run.execute(Run.java:1741)
	at hudson.maven.MavenModuleSetBuild.run(MavenModuleSetBuild.java:531)
	at hudson.model.ResourceController.execute(ResourceController.java:98)
	at hudson.model.Executor.run(Executor.java:410)
Caused by: hudson.remoting.ProxyException: hudson.maven.MavenModuleSetBuild$MavenExecutionException:
org.apache.maven.project.ProjectBuildingException: Some problems were encountered while processing
the POMs:
[ERROR] 'dependencies.dependency.version' for org.springframework.boot:spring-boot-starter-ws:jar
is missing. @ line 31, column 21

	at hudson.maven.MavenModuleSetBuild$PomParser.invoke(MavenModuleSetBuild.java:1364)
	at hudson.maven.MavenModuleSetBuild$PomParser.invoke(MavenModuleSetBuild.java:1098)
	at hudson.FilePath$FileCallableWrapper.call(FilePath.java:2772)
	at hudson.remoting.UserRequest.perform(UserRequest.java:153)
	at hudson.remoting.UserRequest.perform(UserRequest.java:50)
	at hudson.remoting.Request$2.run(Request.java:332)
	at hudson.remoting.InterceptingExecutorService$1.call(InterceptingExecutorService.java:68)
	at java.util.concurrent.FutureTask.run(FutureTask.java:266)
	at java.util.concurrent.ThreadPoolExecutor.runWorker(ThreadPoolExecutor.java:1142)
	at java.util.concurrent.ThreadPoolExecutor$Worker.run(ThreadPoolExecutor.java:617)
	at java.lang.Thread.run(Thread.java:745)
	at ......remote call to H21(Native Method)
	at hudson.remoting.Channel.attachCallSiteStackTrace(Channel.java:1416)
	at hudson.remoting.UserResponse.retrieve(UserRequest.java:253)
	at hudson.remoting.Channel.call(Channel.java:781)
	at hudson.FilePath.act(FilePath.java:1007)
	... 8 more
Caused by: hudson.remoting.ProxyException: org.apache.maven.project.ProjectBuildingException:
Some problems were encountered while processing the POMs:
[ERROR] 'dependencies.dependency.version' for org.springframework.boot:spring-boot-starter-ws:jar
is missing. @ line 31, column 21

	at org.apache.maven.project.DefaultProjectBuilder.build(DefaultProjectBuilder.java:364)
	at hudson.maven.MavenEmbedder.buildProjects(MavenEmbedder.java:361)
	at hudson.maven.MavenEmbedder.readProjects(MavenEmbedder.java:331)
	at hudson.maven.MavenModuleSetBuild$PomParser.invoke(MavenModuleSetBuild.java:1301)
	at hudson.maven.MavenModuleSetBuild$PomParser.invoke(MavenModuleSetBuild.java:1098)
	at hudson.FilePath$FileCallableWrapper.call(FilePath.java:2772)
	at hudson.remoting.UserRequest.perform(UserRequest.java:153)
	at hudson.remoting.UserRequest.perform(UserRequest.java:50)
	at hudson.remoting.Request$2.run(Request.java:332)
	at hudson.remoting.InterceptingExecutorService$1.call(InterceptingExecutorService.java:68)
	at java.util.concurrent.FutureTask.run(FutureTask.java:266)
	at java.util.concurrent.ThreadPoolExecutor.runWorker(ThreadPoolExecutor.java:1142)
	at java.util.concurrent.ThreadPoolExecutor$Worker.run(ThreadPoolExecutor.java:617)
	at java.lang.Thread.run(Thread.java:745)

Mime
View raw message