cxf-notifications mailing list archives

Site index · List index
Message view « Date » · « Thread »
Top « Date » · « Thread »
From Apache Jenkins Server <jenk...@builds.apache.org>
Subject Build failed in Jenkins: CXF-trunk-deploy #2131
Date Wed, 22 Feb 2017 06:51:44 GMT
See <https://builds.apache.org/job/CXF-trunk-deploy/2131/display/redirect?page=changes>

Changes:

[sberyozkin] [CXF-7258] Trying the default SwaggerUIResolver if the OSGI one returns

------------------------------------------
Started by an SCM change
[EnvInject] - Loading node environment variables.
Building remotely on H15 (ubuntu) in workspace <https://builds.apache.org/job/CXF-trunk-deploy/ws/>
Cloning the remote Git repository
Cloning repository https://git-wip-us.apache.org/repos/asf/cxf.git
 > git init <https://builds.apache.org/job/CXF-trunk-deploy/ws/> # timeout=10
Fetching upstream changes from https://git-wip-us.apache.org/repos/asf/cxf.git
 > git --version # timeout=10
 > git fetch --tags --progress https://git-wip-us.apache.org/repos/asf/cxf.git +refs/heads/*:refs/remotes/origin/*
 > git config remote.origin.url https://git-wip-us.apache.org/repos/asf/cxf.git # timeout=10
 > git config --add remote.origin.fetch +refs/heads/*:refs/remotes/origin/* # timeout=10
 > git config remote.origin.url https://git-wip-us.apache.org/repos/asf/cxf.git # timeout=10
Fetching upstream changes from https://git-wip-us.apache.org/repos/asf/cxf.git
 > git fetch --tags --progress https://git-wip-us.apache.org/repos/asf/cxf.git +refs/heads/*:refs/remotes/origin/*
 > git rev-parse refs/remotes/origin/master^{commit} # timeout=10
 > git rev-parse refs/remotes/origin/origin/master^{commit} # timeout=10
Checking out Revision 8fb21e240890412c10b4e1b99e64e3d68c7d3d87 (refs/remotes/origin/master)
 > git config core.sparsecheckout # timeout=10
 > git checkout -f 8fb21e240890412c10b4e1b99e64e3d68c7d3d87
 > git rev-list 70b3bdd8303ffade04b31ac4e344726e7a273c0e # timeout=10
Parsing POMs
Downloaded artifact http://repo.maven.apache.org/maven2/org/springframework/boot/spring-boot-dependencies/1.5.1.RELEASE/spring-boot-dependencies-1.5.1.RELEASE.pom
Downloaded artifact http://repo.maven.apache.org/maven2/org/apache/logging/log4j/log4j-bom/2.7/log4j-bom-2.7.pom
Downloaded artifact http://repo.maven.apache.org/maven2/org/springframework/spring-framework-bom/4.3.6.RELEASE/spring-framework-bom-4.3.6.RELEASE.pom
Downloaded artifact http://repo.maven.apache.org/maven2/org/springframework/data/spring-data-releasetrain/Ingalls-RELEASE/spring-data-releasetrain-Ingalls-RELEASE.pom
Downloaded artifact http://repo.maven.apache.org/maven2/org/springframework/data/build/spring-data-build/1.9.0.RELEASE/spring-data-build-1.9.0.RELEASE.pom
Downloaded artifact http://repo.maven.apache.org/maven2/org/springframework/integration/spring-integration-bom/4.3.7.RELEASE/spring-integration-bom-4.3.7.RELEASE.pom
Downloaded artifact http://repo.maven.apache.org/maven2/org/springframework/security/spring-security-bom/4.2.1.RELEASE/spring-security-bom-4.2.1.RELEASE.pom
ERROR: Failed to parse POMs
java.io.IOException: remote file operation failed: <https://builds.apache.org/job/CXF-trunk-deploy/ws/>
at hudson.remoting.Channel@8a573bf:H15: hudson.remoting.ProxyException: hudson.maven.MavenModuleSetBuild$MavenExecutionException:
org.apache.maven.project.ProjectBuildingException: Some problems were encountered while processing
the POMs:
[ERROR] 'dependencies.dependency.version' for org.springframework.boot:spring-boot-starter-ws:jar
is missing. @ line 31, column 21

	at hudson.FilePath.act(FilePath.java:992)
	at hudson.FilePath.act(FilePath.java:974)
	at hudson.maven.MavenModuleSetBuild$MavenModuleSetBuildExecution.parsePoms(MavenModuleSetBuild.java:980)
	at hudson.maven.MavenModuleSetBuild$MavenModuleSetBuildExecution.doRun(MavenModuleSetBuild.java:692)
	at hudson.model.AbstractBuild$AbstractBuildExecution.run(AbstractBuild.java:534)
	at hudson.model.Run.execute(Run.java:1728)
	at hudson.maven.MavenModuleSetBuild.run(MavenModuleSetBuild.java:544)
	at hudson.model.ResourceController.execute(ResourceController.java:98)
	at hudson.model.Executor.run(Executor.java:404)
Caused by: hudson.remoting.ProxyException: hudson.maven.MavenModuleSetBuild$MavenExecutionException:
org.apache.maven.project.ProjectBuildingException: Some problems were encountered while processing
the POMs:
[ERROR] 'dependencies.dependency.version' for org.springframework.boot:spring-boot-starter-ws:jar
is missing. @ line 31, column 21

	at hudson.maven.MavenModuleSetBuild$PomParser.invoke(MavenModuleSetBuild.java:1384)
	at hudson.maven.MavenModuleSetBuild$PomParser.invoke(MavenModuleSetBuild.java:1118)
	at hudson.FilePath$FileCallableWrapper.call(FilePath.java:2731)
	at hudson.remoting.UserRequest.perform(UserRequest.java:153)
	at hudson.remoting.UserRequest.perform(UserRequest.java:50)
	at hudson.remoting.Request$2.run(Request.java:336)
	at hudson.remoting.InterceptingExecutorService$1.call(InterceptingExecutorService.java:68)
	at java.util.concurrent.FutureTask.run(FutureTask.java:262)
	at java.util.concurrent.ThreadPoolExecutor.runWorker(ThreadPoolExecutor.java:1145)
	at java.util.concurrent.ThreadPoolExecutor$Worker.run(ThreadPoolExecutor.java:615)
	at java.lang.Thread.run(Thread.java:745)
	at ......remote call to H15(Native Method)
	at hudson.remoting.Channel.attachCallSiteStackTrace(Channel.java:1537)
	at hudson.remoting.UserResponse.retrieve(UserRequest.java:253)
	at hudson.remoting.Channel.call(Channel.java:822)
	at hudson.FilePath.act(FilePath.java:985)
	... 8 more
Caused by: hudson.remoting.ProxyException: org.apache.maven.project.ProjectBuildingException:
Some problems were encountered while processing the POMs:
[ERROR] 'dependencies.dependency.version' for org.springframework.boot:spring-boot-starter-ws:jar
is missing. @ line 31, column 21

	at org.apache.maven.project.DefaultProjectBuilder.build(DefaultProjectBuilder.java:364)
	at hudson.maven.MavenEmbedder.buildProjects(MavenEmbedder.java:361)
	at hudson.maven.MavenEmbedder.readProjects(MavenEmbedder.java:331)
	at hudson.maven.MavenModuleSetBuild$PomParser.invoke(MavenModuleSetBuild.java:1321)
	at hudson.maven.MavenModuleSetBuild$PomParser.invoke(MavenModuleSetBuild.java:1118)
	at hudson.FilePath$FileCallableWrapper.call(FilePath.java:2731)
	at hudson.remoting.UserRequest.perform(UserRequest.java:153)
	at hudson.remoting.UserRequest.perform(UserRequest.java:50)
	at hudson.remoting.Request$2.run(Request.java:336)
	at hudson.remoting.InterceptingExecutorService$1.call(InterceptingExecutorService.java:68)
	at java.util.concurrent.FutureTask.run(FutureTask.java:262)
	at java.util.concurrent.ThreadPoolExecutor.runWorker(ThreadPoolExecutor.java:1145)
	at java.util.concurrent.ThreadPoolExecutor$Worker.run(ThreadPoolExecutor.java:615)
	at java.lang.Thread.run(Thread.java:745)

Mime
View raw message