cxf-notifications mailing list archives

Site index · List index
Message view « Date » · « Thread »
Top « Date » · « Thread »
From Apache Jenkins Server <jenk...@builds.apache.org>
Subject Build failed in Jenkins: CXF-trunk-deploy » Apache CXF Samples LogBrowser #2078
Date Mon, 19 Dec 2016 07:17:01 GMT
See <https://builds.apache.org/job/CXF-trunk-deploy/org.apache.cxf.samples$logbrowser/2078/>

------------------------------------------
[INFO]                                                                         
[INFO] ------------------------------------------------------------------------
[INFO] Building Apache CXF Samples LogBrowser 3.2.0-SNAPSHOT
[INFO] ------------------------------------------------------------------------
[INFO] 
[INFO] --- maven-clean-plugin:2.5:clean (default-clean) @ logbrowser ---
[INFO] Deleting <https://builds.apache.org/job/CXF-trunk-deploy/org.apache.cxf.samples$logbrowser/ws/target>
[INFO] 
[INFO] --- maven-resources-plugin:2.6:resources (default-resources) @ logbrowser ---
[INFO] Using 'UTF-8' encoding to copy filtered resources.
[INFO] skip non existing resourceDirectory <https://builds.apache.org/job/CXF-trunk-deploy/org.apache.cxf.samples$logbrowser/ws/src/main/resources>
[INFO] 
[INFO] --- maven-compiler-plugin:3.3:compile (default-compile) @ logbrowser ---
[INFO] Changes detected - recompiling the module!
[INFO] Compiling 4 source files to <https://builds.apache.org/job/CXF-trunk-deploy/org.apache.cxf.samples$logbrowser/ws/target/classes>
[INFO] -------------------------------------------------------------
[ERROR] COMPILATION ERROR : 
[INFO] -------------------------------------------------------------
[ERROR] <https://builds.apache.org/job/CXF-trunk-deploy/org.apache.cxf.samples$logbrowser/ws/src/main/java/demo/service/CustomerService.java>:[36,31]
package org.apache.commons.lang does not exist
[ERROR] <https://builds.apache.org/job/CXF-trunk-deploy/org.apache.cxf.samples$logbrowser/ws/src/main/java/demo/service/CustomerService.java>:[49,9]
cannot find symbol
  symbol:   variable Validate
  location: class demo.service.CustomerService
[ERROR] <https://builds.apache.org/job/CXF-trunk-deploy/org.apache.cxf.samples$logbrowser/ws/src/main/java/demo/service/CustomerService.java>:[50,9]
cannot find symbol
  symbol:   variable Validate
  location: class demo.service.CustomerService
[ERROR] <https://builds.apache.org/job/CXF-trunk-deploy/org.apache.cxf.samples$logbrowser/ws/src/main/java/demo/service/CustomerService.java>:[66,9]
cannot find symbol
  symbol:   variable Validate
  location: class demo.service.CustomerService
[ERROR] <https://builds.apache.org/job/CXF-trunk-deploy/org.apache.cxf.samples$logbrowser/ws/src/main/java/demo/service/CustomerService.java>:[85,9]
cannot find symbol
  symbol:   variable Validate
  location: class demo.service.CustomerService
[ERROR] <https://builds.apache.org/job/CXF-trunk-deploy/org.apache.cxf.samples$logbrowser/ws/src/main/java/demo/service/CustomerService.java>:[86,9]
cannot find symbol
  symbol:   variable Validate
  location: class demo.service.CustomerService
[INFO] 6 errors 
[INFO] -------------------------------------------------------------

Mime
View raw message