cxf-notifications mailing list archives

Site index · List index
Message view « Date » · « Thread »
Top « Date » · « Thread »
From Apache Jenkins Server <jenk...@builds.apache.org>
Subject Build failed in Jenkins: CXF-3.1-deploy #802
Date Fri, 18 Nov 2016 06:15:48 GMT
See <https://builds.apache.org/job/CXF-3.1-deploy/802/changes>

Changes:

[johndament] CXF-7133: Clean up how default app is loaded and avoid extra XML

[reta] CXF-7134: Store the creational context of each bean being created so

------------------------------------------
[...truncated 9261 lines...]
[ERROR]   The project org.apache.cxf:cxf-rt-rs-service-description:3.1.9-SNAPSHOT (<https://builds.apache.org/job/CXF-3.1-deploy/ws/rt/rs/description/pom.xml)> has 2 errors
[ERROR]     Unresolveable build extension: Plugin org.apache.felix:maven-bundle-plugin:2.4.0 or one of its dependencies could not be resolved: Failed to read artifact descriptor for org.apache.felix:maven-bundle-plugin:jar:2.4.0: Could not transfer artifact org.apache:apache:pom:9 from/to central (https://repo.maven.apache.org/maven2): <https://builds.apache.org/job/CXF-3.1-deploy/ws/.repository/org/apache/apache/9/apache-9.pom.part.lock> (No such file or directory) -> [Help 2]
[ERROR]     Unknown packaging: bundle @ org.apache.cxf:cxf-rt-rs-service-description:[unknown-version], <https://builds.apache.org/job/CXF-3.1-deploy/ws/rt/rs/description/pom.xml,> line 23, column 16
[ERROR]   
[ERROR]   The project org.apache.cxf:cxf-rt-rs-service-description-swagger:3.1.9-SNAPSHOT (<https://builds.apache.org/job/CXF-3.1-deploy/ws/rt/rs/description-swagger/pom.xml)> has 2 errors
[ERROR]     Unresolveable build extension: Plugin org.apache.felix:maven-bundle-plugin:2.4.0 or one of its dependencies could not be resolved: Failed to read artifact descriptor for org.apache.felix:maven-bundle-plugin:jar:2.4.0: Could not transfer artifact org.apache:apache:pom:9 from/to central (https://repo.maven.apache.org/maven2): <https://builds.apache.org/job/CXF-3.1-deploy/ws/.repository/org/apache/apache/9/apache-9.pom.part.lock> (No such file or directory) -> [Help 2]
[ERROR]     Unknown packaging: bundle @ org.apache.cxf:cxf-rt-rs-service-description-swagger:[unknown-version], <https://builds.apache.org/job/CXF-3.1-deploy/ws/rt/rs/description-swagger/pom.xml,> line 23, column 16
[ERROR]   
[ERROR]   The project org.apache.cxf:cxf-rt-rs-json-basic:3.1.9-SNAPSHOT (<https://builds.apache.org/job/CXF-3.1-deploy/ws/rt/rs/extensions/json-basic/pom.xml)> has 2 errors
[ERROR]     Unresolveable build extension: Plugin org.apache.felix:maven-bundle-plugin:2.4.0 or one of its dependencies could not be resolved: Failed to read artifact descriptor for org.apache.felix:maven-bundle-plugin:jar:2.4.0: Could not transfer artifact org.apache:apache:pom:9 from/to central (https://repo.maven.apache.org/maven2): <https://builds.apache.org/job/CXF-3.1-deploy/ws/.repository/org/apache/apache/9/apache-9.pom.part.lock> (No such file or directory) -> [Help 2]
[ERROR]     Unknown packaging: bundle @ org.apache.cxf:cxf-rt-rs-json-basic:[unknown-version], <https://builds.apache.org/job/CXF-3.1-deploy/ws/rt/rs/extensions/json-basic/pom.xml,> line 23, column 16
[ERROR]   
[ERROR]   The project org.apache.cxf:cxf-rt-rs-extension-providers:3.1.9-SNAPSHOT (<https://builds.apache.org/job/CXF-3.1-deploy/ws/rt/rs/extensions/providers/pom.xml)> has 2 errors
[ERROR]     Unresolveable build extension: Plugin org.apache.felix:maven-bundle-plugin:2.4.0 or one of its dependencies could not be resolved: Failed to read artifact descriptor for org.apache.felix:maven-bundle-plugin:jar:2.4.0: Could not transfer artifact org.apache:apache:pom:9 from/to central (https://repo.maven.apache.org/maven2): <https://builds.apache.org/job/CXF-3.1-deploy/ws/.repository/org/apache/apache/9/apache-9.pom.part.lock> (No such file or directory) -> [Help 2]
[ERROR]     Unknown packaging: bundle @ org.apache.cxf:cxf-rt-rs-extension-providers:[unknown-version], <https://builds.apache.org/job/CXF-3.1-deploy/ws/rt/rs/extensions/providers/pom.xml,> line 23, column 16
[ERROR]   
[ERROR]   The project org.apache.cxf:cxf-rt-rs-extension-search:3.1.9-SNAPSHOT (<https://builds.apache.org/job/CXF-3.1-deploy/ws/rt/rs/extensions/search/pom.xml)> has 2 errors
[ERROR]     Unresolveable build extension: Plugin org.apache.felix:maven-bundle-plugin:2.4.0 or one of its dependencies could not be resolved: Failed to read artifact descriptor for org.apache.felix:maven-bundle-plugin:jar:2.4.0: Could not transfer artifact org.apache:apache:pom:9 from/to central (https://repo.maven.apache.org/maven2): <https://builds.apache.org/job/CXF-3.1-deploy/ws/.repository/org/apache/apache/9/apache-9.pom.part.lock> (No such file or directory) -> [Help 2]
[ERROR]     Unknown packaging: bundle @ org.apache.cxf:cxf-rt-rs-extension-search:[unknown-version], <https://builds.apache.org/job/CXF-3.1-deploy/ws/rt/rs/extensions/search/pom.xml,> line 23, column 16
[ERROR]   
[ERROR]   The project org.apache.cxf:cxf-rt-rs-security-xml:3.1.9-SNAPSHOT (<https://builds.apache.org/job/CXF-3.1-deploy/ws/rt/rs/security/xml/pom.xml)> has 2 errors
[ERROR]     Unresolveable build extension: Plugin org.apache.felix:maven-bundle-plugin:2.4.0 or one of its dependencies could not be resolved: Failed to read artifact descriptor for org.apache.felix:maven-bundle-plugin:jar:2.4.0: Could not transfer artifact org.apache:apache:pom:9 from/to central (https://repo.maven.apache.org/maven2): <https://builds.apache.org/job/CXF-3.1-deploy/ws/.repository/org/apache/apache/9/apache-9.pom.part.lock> (No such file or directory) -> [Help 2]
[ERROR]     Unknown packaging: bundle @ org.apache.cxf:cxf-rt-rs-security-xml:[unknown-version], <https://builds.apache.org/job/CXF-3.1-deploy/ws/rt/rs/security/xml/pom.xml,> line 23, column 16
[ERROR]   
[ERROR]   The project org.apache.cxf:cxf-rt-rs-security-jose:3.1.9-SNAPSHOT (<https://builds.apache.org/job/CXF-3.1-deploy/ws/rt/rs/security/jose-parent/jose/pom.xml)> has 2 errors
[ERROR]     Unresolveable build extension: Plugin org.apache.felix:maven-bundle-plugin:2.4.0 or one of its dependencies could not be resolved: Failed to read artifact descriptor for org.apache.felix:maven-bundle-plugin:jar:2.4.0: Could not transfer artifact org.apache:apache:pom:9 from/to central (https://repo.maven.apache.org/maven2): <https://builds.apache.org/job/CXF-3.1-deploy/ws/.repository/org/apache/apache/9/apache-9.pom.part.lock> (No such file or directory) -> [Help 2]
[ERROR]     Unknown packaging: bundle @ org.apache.cxf:cxf-rt-rs-security-jose:[unknown-version], <https://builds.apache.org/job/CXF-3.1-deploy/ws/rt/rs/security/jose-parent/jose/pom.xml,> line 23, column 16
[ERROR]   
[ERROR]   The project org.apache.cxf:cxf-rt-rs-security-jose-jaxrs:3.1.9-SNAPSHOT (<https://builds.apache.org/job/CXF-3.1-deploy/ws/rt/rs/security/jose-parent/jose-jaxrs/pom.xml)> has 2 errors
[ERROR]     Unresolveable build extension: Plugin org.apache.felix:maven-bundle-plugin:2.4.0 or one of its dependencies could not be resolved: Failed to read artifact descriptor for org.apache.felix:maven-bundle-plugin:jar:2.4.0: Could not transfer artifact org.apache:apache:pom:9 from/to central (https://repo.maven.apache.org/maven2): <https://builds.apache.org/job/CXF-3.1-deploy/ws/.repository/org/apache/apache/9/apache-9.pom.part.lock> (No such file or directory) -> [Help 2]
[ERROR]     Unknown packaging: bundle @ org.apache.cxf:cxf-rt-rs-security-jose-jaxrs:[unknown-version], <https://builds.apache.org/job/CXF-3.1-deploy/ws/rt/rs/security/jose-parent/jose-jaxrs/pom.xml,> line 23, column 16
[ERROR]   
[ERROR]   The project org.apache.cxf:cxf-rt-rs-security-oauth-parent:3.1.9-SNAPSHOT (<https://builds.apache.org/job/CXF-3.1-deploy/ws/rt/rs/security/oauth-parent/pom.xml)> has 1 error
[ERROR]     Unresolveable build extension: Plugin org.apache.felix:maven-bundle-plugin:2.4.0 or one of its dependencies could not be resolved: Failed to read artifact descriptor for org.apache.felix:maven-bundle-plugin:jar:2.4.0: Could not transfer artifact org.apache:apache:pom:9 from/to central (https://repo.maven.apache.org/maven2): <https://builds.apache.org/job/CXF-3.1-deploy/ws/.repository/org/apache/apache/9/apache-9.pom.part.lock> (No such file or directory) -> [Help 2]
[ERROR]   
[ERROR]   The project org.apache.cxf:cxf-rt-rs-security-sso-saml:3.1.9-SNAPSHOT (<https://builds.apache.org/job/CXF-3.1-deploy/ws/rt/rs/security/sso/saml/pom.xml)> has 2 errors
[ERROR]     Unresolveable build extension: Plugin org.apache.felix:maven-bundle-plugin:2.4.0 or one of its dependencies could not be resolved: Failed to read artifact descriptor for org.apache.felix:maven-bundle-plugin:jar:2.4.0: Could not transfer artifact org.apache:apache:pom:9 from/to central (https://repo.maven.apache.org/maven2): <https://builds.apache.org/job/CXF-3.1-deploy/ws/.repository/org/apache/apache/9/apache-9.pom.part.lock> (No such file or directory) -> [Help 2]
[ERROR]     Unknown packaging: bundle @ org.apache.cxf:cxf-rt-rs-security-sso-saml:[unknown-version], <https://builds.apache.org/job/CXF-3.1-deploy/ws/rt/rs/security/sso/saml/pom.xml,> line 23, column 16
[ERROR]   
[ERROR]   The project org.apache.cxf:cxf-rt-rs-security-sso-oidc:3.1.9-SNAPSHOT (<https://builds.apache.org/job/CXF-3.1-deploy/ws/rt/rs/security/sso/oidc/pom.xml)> has 2 errors
[ERROR]     Unresolveable build extension: Plugin org.apache.felix:maven-bundle-plugin:2.4.0 or one of its dependencies could not be resolved: Failed to read artifact descriptor for org.apache.felix:maven-bundle-plugin:jar:2.4.0: Could not transfer artifact org.apache:apache:pom:9 from/to central (https://repo.maven.apache.org/maven2): <https://builds.apache.org/job/CXF-3.1-deploy/ws/.repository/org/apache/apache/9/apache-9.pom.part.lock> (No such file or directory) -> [Help 2]
[ERROR]     Unknown packaging: bundle @ org.apache.cxf:cxf-rt-rs-security-sso-oidc:[unknown-version], <https://builds.apache.org/job/CXF-3.1-deploy/ws/rt/rs/security/sso/oidc/pom.xml,> line 23, column 14
[ERROR]   
[ERROR]   The project org.apache.cxf:cxf-rt-rs-security-cors:3.1.9-SNAPSHOT (<https://builds.apache.org/job/CXF-3.1-deploy/ws/rt/rs/security/cors/pom.xml)> has 2 errors
[ERROR]     Unresolveable build extension: Plugin org.apache.felix:maven-bundle-plugin:2.4.0 or one of its dependencies could not be resolved: Failed to read artifact descriptor for org.apache.felix:maven-bundle-plugin:jar:2.4.0: Could not transfer artifact org.apache:apache:pom:9 from/to central (https://repo.maven.apache.org/maven2): <https://builds.apache.org/job/CXF-3.1-deploy/ws/.repository/org/apache/apache/9/apache-9.pom.part.lock> (No such file or directory) -> [Help 2]
[ERROR]     Unknown packaging: bundle @ org.apache.cxf:cxf-rt-rs-security-cors:[unknown-version], <https://builds.apache.org/job/CXF-3.1-deploy/ws/rt/rs/security/cors/pom.xml,> line 23, column 16
[ERROR]   
[ERROR]   The project org.apache.cxf:cxf-rt-management:3.1.9-SNAPSHOT (<https://builds.apache.org/job/CXF-3.1-deploy/ws/rt/management/pom.xml)> has 2 errors
[ERROR]     Unresolveable build extension: Plugin org.apache.felix:maven-bundle-plugin:2.4.0 or one of its dependencies could not be resolved: Failed to read artifact descriptor for org.apache.felix:maven-bundle-plugin:jar:2.4.0: Could not transfer artifact org.apache:apache:pom:9 from/to central (https://repo.maven.apache.org/maven2): <https://builds.apache.org/job/CXF-3.1-deploy/ws/.repository/org/apache/apache/9/apache-9.pom.part.lock> (No such file or directory) -> [Help 2]
[ERROR]     Unknown packaging: bundle @ org.apache.cxf:cxf-rt-management:[unknown-version], <https://builds.apache.org/job/CXF-3.1-deploy/ws/rt/management/pom.xml,> line 23, column 16
[ERROR]   
[ERROR]   The project org.apache.cxf:cxf-rt-management-web:3.1.9-SNAPSHOT (<https://builds.apache.org/job/CXF-3.1-deploy/ws/rt/management-web/pom.xml)> has 2 errors
[ERROR]     Unresolveable build extension: Plugin org.apache.felix:maven-bundle-plugin:2.4.0 or one of its dependencies could not be resolved: Failed to read artifact descriptor for org.apache.felix:maven-bundle-plugin:jar:2.4.0: Could not transfer artifact org.apache:apache:pom:9 from/to central (https://repo.maven.apache.org/maven2): <https://builds.apache.org/job/CXF-3.1-deploy/ws/.repository/org/apache/apache/9/apache-9.pom.part.lock> (No such file or directory) -> [Help 2]
[ERROR]     Unknown packaging: bundle @ org.apache.cxf:cxf-rt-management-web:[unknown-version], <https://builds.apache.org/job/CXF-3.1-deploy/ws/rt/management-web/pom.xml,> line 23, column 16
[ERROR]   
[ERROR]   The project org.apache.cxf:cxf-runtime-javascript:3.1.9-SNAPSHOT (<https://builds.apache.org/job/CXF-3.1-deploy/ws/rt/javascript/pom.xml)> has 1 error
[ERROR]     Unresolveable build extension: Plugin org.apache.felix:maven-bundle-plugin:2.4.0 or one of its dependencies could not be resolved: Failed to read artifact descriptor for org.apache.felix:maven-bundle-plugin:jar:2.4.0: Could not transfer artifact org.apache:apache:pom:9 from/to central (https://repo.maven.apache.org/maven2): <https://builds.apache.org/job/CXF-3.1-deploy/ws/.repository/org/apache/apache/9/apache-9.pom.part.lock> (No such file or directory) -> [Help 2]
[ERROR]   
[ERROR]   The project org.apache.cxf:cxf-rt-security:3.1.9-SNAPSHOT (<https://builds.apache.org/job/CXF-3.1-deploy/ws/rt/security/pom.xml)> has 2 errors
[ERROR]     Unresolveable build extension: Plugin org.apache.felix:maven-bundle-plugin:2.4.0 or one of its dependencies could not be resolved: Failed to read artifact descriptor for org.apache.felix:maven-bundle-plugin:jar:2.4.0: Could not transfer artifact org.apache:apache:pom:9 from/to central (https://repo.maven.apache.org/maven2): <https://builds.apache.org/job/CXF-3.1-deploy/ws/.repository/org/apache/apache/9/apache-9.pom.part.lock> (No such file or directory) -> [Help 2]
[ERROR]     Unknown packaging: bundle @ org.apache.cxf:cxf-rt-security:[unknown-version], <https://builds.apache.org/job/CXF-3.1-deploy/ws/rt/security/pom.xml,> line 23, column 16
[ERROR]   
[ERROR]   The project org.apache.cxf:cxf-rt-security-saml:3.1.9-SNAPSHOT (<https://builds.apache.org/job/CXF-3.1-deploy/ws/rt/security-saml/pom.xml)> has 2 errors
[ERROR]     Unresolveable build extension: Plugin org.apache.felix:maven-bundle-plugin:2.4.0 or one of its dependencies could not be resolved: Failed to read artifact descriptor for org.apache.felix:maven-bundle-plugin:jar:2.4.0: Could not transfer artifact org.apache:apache:pom:9 from/to central (https://repo.maven.apache.org/maven2): <https://builds.apache.org/job/CXF-3.1-deploy/ws/.repository/org/apache/apache/9/apache-9.pom.part.lock> (No such file or directory) -> [Help 2]
[ERROR]     Unknown packaging: bundle @ org.apache.cxf:cxf-rt-security-saml:[unknown-version], <https://builds.apache.org/job/CXF-3.1-deploy/ws/rt/security-saml/pom.xml,> line 23, column 16
[ERROR]   
[ERROR]   The project org.apache.cxf:cxf-integration-jca:3.1.9-SNAPSHOT (<https://builds.apache.org/job/CXF-3.1-deploy/ws/integration/jca/pom.xml)> has 1 error
[ERROR]     Unresolveable build extension: Plugin org.apache.felix:maven-bundle-plugin:2.4.0 or one of its dependencies could not be resolved: Failed to read artifact descriptor for org.apache.felix:maven-bundle-plugin:jar:2.4.0: Could not transfer artifact org.apache:apache:pom:9 from/to central (https://repo.maven.apache.org/maven2): <https://builds.apache.org/job/CXF-3.1-deploy/ws/.repository/org/apache/apache/9/apache-9.pom.part.lock> (No such file or directory) -> [Help 2]
[ERROR]   
[ERROR]   The project org.apache.cxf:cxf-integration-cdi:3.1.9-SNAPSHOT (<https://builds.apache.org/job/CXF-3.1-deploy/ws/integration/cdi/pom.xml)> has 2 errors
[ERROR]     Unresolveable build extension: Plugin org.apache.felix:maven-bundle-plugin:2.4.0 or one of its dependencies could not be resolved: Failed to read artifact descriptor for org.apache.felix:maven-bundle-plugin:jar:2.4.0: Could not transfer artifact org.apache:apache:pom:9 from/to central (https://repo.maven.apache.org/maven2): <https://builds.apache.org/job/CXF-3.1-deploy/ws/.repository/org/apache/apache/9/apache-9.pom.part.lock> (No such file or directory) -> [Help 2]
[ERROR]     Unknown packaging: bundle @ org.apache.cxf:cxf-integration-cdi:[unknown-version], <https://builds.apache.org/job/CXF-3.1-deploy/ws/integration/cdi/pom.xml,> line 23, column 16
[ERROR]   
[ERROR]   The project org.apache.cxf:cxf-integration-tracing-htrace:3.1.9-SNAPSHOT (<https://builds.apache.org/job/CXF-3.1-deploy/ws/integration/tracing/tracing-htrace/pom.xml)> has 1 error
[ERROR]     Unresolveable build extension: Plugin org.apache.felix:maven-bundle-plugin:2.4.0 or one of its dependencies could not be resolved: Failed to read artifact descriptor for org.apache.felix:maven-bundle-plugin:jar:2.4.0: Could not transfer artifact org.apache:apache:pom:9 from/to central (https://repo.maven.apache.org/maven2): <https://builds.apache.org/job/CXF-3.1-deploy/ws/.repository/org/apache/apache/9/apache-9.pom.part.lock> (No such file or directory) -> [Help 2]
[ERROR]   
[ERROR]   The project org.apache.cxf:cxf-spring-boot-autoconfigure:3.1.9-SNAPSHOT (<https://builds.apache.org/job/CXF-3.1-deploy/ws/integration/spring-boot/autoconfigure/pom.xml)> has 2 errors
[ERROR]     Unresolveable build extension: Plugin org.apache.felix:maven-bundle-plugin:2.4.0 or one of its dependencies could not be resolved: Failed to read artifact descriptor for org.apache.felix:maven-bundle-plugin:jar:2.4.0: Could not transfer artifact org.apache:apache:pom:9 from/to central (https://repo.maven.apache.org/maven2): <https://builds.apache.org/job/CXF-3.1-deploy/ws/.repository/org/apache/apache/9/apache-9.pom.part.lock> (No such file or directory) -> [Help 2]
[ERROR]     Unknown packaging: bundle @ org.apache.cxf:cxf-spring-boot-autoconfigure:[unknown-version], <https://builds.apache.org/job/CXF-3.1-deploy/ws/integration/spring-boot/autoconfigure/pom.xml,> line 23, column 16
[ERROR]   
[ERROR]   The project org.apache.cxf:cxf-spring-boot-starter-jaxws:3.1.9-SNAPSHOT (<https://builds.apache.org/job/CXF-3.1-deploy/ws/integration/spring-boot/starter-jaxws/pom.xml)> has 2 errors
[ERROR]     Unresolveable build extension: Plugin org.apache.felix:maven-bundle-plugin:2.4.0 or one of its dependencies could not be resolved: Failed to read artifact descriptor for org.apache.felix:maven-bundle-plugin:jar:2.4.0: Could not transfer artifact org.apache:apache:pom:9 from/to central (https://repo.maven.apache.org/maven2): <https://builds.apache.org/job/CXF-3.1-deploy/ws/.repository/org/apache/apache/9/apache-9.pom.part.lock> (No such file or directory) -> [Help 2]
[ERROR]     Unknown packaging: bundle @ org.apache.cxf:cxf-spring-boot-starter-jaxws:[unknown-version], <https://builds.apache.org/job/CXF-3.1-deploy/ws/integration/spring-boot/starter-jaxws/pom.xml,> line 23, column 16
[ERROR]   
[ERROR]   The project org.apache.cxf:cxf-spring-boot-starter-jaxrs:3.1.9-SNAPSHOT (<https://builds.apache.org/job/CXF-3.1-deploy/ws/integration/spring-boot/starter-jaxrs/pom.xml)> has 2 errors
[ERROR]     Unresolveable build extension: Plugin org.apache.felix:maven-bundle-plugin:2.4.0 or one of its dependencies could not be resolved: Failed to read artifact descriptor for org.apache.felix:maven-bundle-plugin:jar:2.4.0: Could not transfer artifact org.apache:apache:pom:9 from/to central (https://repo.maven.apache.org/maven2): <https://builds.apache.org/job/CXF-3.1-deploy/ws/.repository/org/apache/apache/9/apache-9.pom.part.lock> (No such file or directory) -> [Help 2]
[ERROR]     Unknown packaging: bundle @ org.apache.cxf:cxf-spring-boot-starter-jaxrs:[unknown-version], <https://builds.apache.org/job/CXF-3.1-deploy/ws/integration/spring-boot/starter-jaxrs/pom.xml,> line 23, column 16
[ERROR]   
[ERROR]   The project org.apache.cxf:cxf-maven-plugins:3.1.9-SNAPSHOT (<https://builds.apache.org/job/CXF-3.1-deploy/ws/maven-plugins/pom.xml)> has 1 error
[ERROR]     Unresolveable build extension: Plugin org.apache.felix:maven-bundle-plugin:2.4.0 or one of its dependencies could not be resolved: Failed to read artifact descriptor for org.apache.felix:maven-bundle-plugin:jar:2.4.0: Could not transfer artifact org.apache:apache:pom:9 from/to central (https://repo.maven.apache.org/maven2): <https://builds.apache.org/job/CXF-3.1-deploy/ws/.repository/org/apache/apache/9/apache-9.pom.part.lock> (No such file or directory) -> [Help 2]
[ERROR]   
[ERROR]   The project org.apache.cxf.services.sts:cxf-services-sts-core:3.1.9-SNAPSHOT (<https://builds.apache.org/job/CXF-3.1-deploy/ws/services/sts/sts-core/pom.xml)> has 2 errors
[ERROR]     Unresolveable build extension: Plugin org.apache.felix:maven-bundle-plugin:2.4.0 or one of its dependencies could not be resolved: Failed to read artifact descriptor for org.apache.felix:maven-bundle-plugin:jar:2.4.0: Could not transfer artifact org.apache:apache:pom:9 from/to central (https://repo.maven.apache.org/maven2): <https://builds.apache.org/job/CXF-3.1-deploy/ws/.repository/org/apache/apache/9/apache-9.pom.part.lock> (No such file or directory) -> [Help 2]
[ERROR]     Unknown packaging: bundle @ org.apache.cxf.services.sts:cxf-services-sts-core:[unknown-version], <https://builds.apache.org/job/CXF-3.1-deploy/ws/services/sts/sts-core/pom.xml,> line 24, column 16
[ERROR]   
[ERROR]   The project org.apache.cxf.services.sts:cxf-services-sts-war:3.1.9-SNAPSHOT (<https://builds.apache.org/job/CXF-3.1-deploy/ws/services/sts/sts-war/pom.xml)> has 1 error
[ERROR]     Unresolveable build extension: Plugin org.apache.felix:maven-bundle-plugin:2.4.0 or one of its dependencies could not be resolved: Failed to read artifact descriptor for org.apache.felix:maven-bundle-plugin:jar:2.4.0: Could not transfer artifact org.apache:apache:pom:9 from/to central (https://repo.maven.apache.org/maven2): <https://builds.apache.org/job/CXF-3.1-deploy/ws/.repository/org/apache/apache/9/apache-9.pom.part.lock> (No such file or directory) -> [Help 2]
[ERROR]   
[ERROR]   The project org.apache.cxf.services.sts.systests:cxf-services-sts-systests-basic:3.1.9-SNAPSHOT (<https://builds.apache.org/job/CXF-3.1-deploy/ws/services/sts/systests/basic/pom.xml)> has 1 error
[ERROR]     Unresolveable build extension: Plugin org.apache.felix:maven-bundle-plugin:2.4.0 or one of its dependencies could not be resolved: Failed to read artifact descriptor for org.apache.felix:maven-bundle-plugin:jar:2.4.0: Could not transfer artifact org.apache:apache:pom:9 from/to central (https://repo.maven.apache.org/maven2): <https://builds.apache.org/job/CXF-3.1-deploy/ws/.repository/org/apache/apache/9/apache-9.pom.part.lock> (No such file or directory) -> [Help 2]
[ERROR]   
[ERROR]   The project org.apache.cxf.services.sts.systests:cxf-services-sts-systests-advanced:3.1.9-SNAPSHOT (<https://builds.apache.org/job/CXF-3.1-deploy/ws/services/sts/systests/advanced/pom.xml)> has 1 error
[ERROR]     Unresolveable build extension: Plugin org.apache.felix:maven-bundle-plugin:2.4.0 or one of its dependencies could not be resolved: Failed to read artifact descriptor for org.apache.felix:maven-bundle-plugin:jar:2.4.0: Could not transfer artifact org.apache:apache:pom:9 from/to central (https://repo.maven.apache.org/maven2): <https://builds.apache.org/job/CXF-3.1-deploy/ws/.repository/org/apache/apache/9/apache-9.pom.part.lock> (No such file or directory) -> [Help 2]
[ERROR]   
[ERROR]   The project org.apache.cxf.services.sts.systests:cxf-services-sts-systests-osgi:3.1.9-SNAPSHOT (<https://builds.apache.org/job/CXF-3.1-deploy/ws/services/sts/systests/sts-osgi/pom.xml)> has 2 errors
[ERROR]     Unresolveable build extension: Plugin org.apache.felix:maven-bundle-plugin:2.4.0 or one of its dependencies could not be resolved: Failed to read artifact descriptor for org.apache.felix:maven-bundle-plugin:jar:2.4.0: Could not transfer artifact org.apache:apache:pom:9 from/to central (https://repo.maven.apache.org/maven2): <https://builds.apache.org/job/CXF-3.1-deploy/ws/.repository/org/apache/apache/9/apache-9.pom.part.lock> (No such file or directory) -> [Help 2]
[ERROR]     Unknown packaging: bundle @ org.apache.cxf.services.sts.systests:cxf-services-sts-systests-osgi:[unknown-version], <https://builds.apache.org/job/CXF-3.1-deploy/ws/services/sts/systests/sts-osgi/pom.xml,> line 24, column 16
[ERROR]   
[ERROR]   The project org.apache.cxf.services.sts.systests:cxf-services-sts-systests-features:3.1.9-SNAPSHOT (<https://builds.apache.org/job/CXF-3.1-deploy/ws/services/sts/systests/sts-features/pom.xml)> has 1 error
[ERROR]     Unresolveable build extension: Plugin org.apache.felix:maven-bundle-plugin:2.4.0 or one of its dependencies could not be resolved: Failed to read artifact descriptor for org.apache.felix:maven-bundle-plugin:jar:2.4.0: Could not transfer artifact org.apache:apache:pom:9 from/to central (https://repo.maven.apache.org/maven2): <https://builds.apache.org/job/CXF-3.1-deploy/ws/.repository/org/apache/apache/9/apache-9.pom.part.lock> (No such file or directory) -> [Help 2]
[ERROR]   
[ERROR]   The project org.apache.cxf.services.sts.systests:cxf-services-sts-systests-itests:3.1.9-SNAPSHOT (<https://builds.apache.org/job/CXF-3.1-deploy/ws/services/sts/systests/sts-itests/pom.xml)> has 1 error
[ERROR]     Unresolveable build extension: Plugin org.apache.felix:maven-bundle-plugin:2.4.0 or one of its dependencies could not be resolved: Failed to read artifact descriptor for org.apache.felix:maven-bundle-plugin:jar:2.4.0: Could not transfer artifact org.apache:apache:pom:9 from/to central (https://repo.maven.apache.org/maven2): <https://builds.apache.org/job/CXF-3.1-deploy/ws/.repository/org/apache/apache/9/apache-9.pom.part.lock> (No such file or directory) -> [Help 2]
[ERROR]   
[ERROR]   The project org.apache.cxf.services.wsn:cxf-services-wsn-api:3.1.9-SNAPSHOT (<https://builds.apache.org/job/CXF-3.1-deploy/ws/services/wsn/wsn-api/pom.xml)> has 2 errors
[ERROR]     Unresolveable build extension: Plugin org.apache.felix:maven-bundle-plugin:2.4.0 or one of its dependencies could not be resolved: Failed to read artifact descriptor for org.apache.felix:maven-bundle-plugin:jar:2.4.0: Could not transfer artifact org.apache:apache:pom:9 from/to central (https://repo.maven.apache.org/maven2): <https://builds.apache.org/job/CXF-3.1-deploy/ws/.repository/org/apache/apache/9/apache-9.pom.part.lock> (No such file or directory) -> [Help 2]
[ERROR]     Unknown packaging: bundle @ org.apache.cxf.services.wsn:cxf-services-wsn-api:[unknown-version], <https://builds.apache.org/job/CXF-3.1-deploy/ws/services/wsn/wsn-api/pom.xml,> line 24, column 16
[ERROR]   
[ERROR]   The project org.apache.cxf.services.wsn:cxf-services-wsn-core:3.1.9-SNAPSHOT (<https://builds.apache.org/job/CXF-3.1-deploy/ws/services/wsn/wsn-core/pom.xml)> has 2 errors
[ERROR]     Unresolveable build extension: Plugin org.apache.felix:maven-bundle-plugin:2.4.0 or one of its dependencies could not be resolved: Failed to read artifact descriptor for org.apache.felix:maven-bundle-plugin:jar:2.4.0: Could not transfer artifact org.apache:apache:pom:9 from/to central (https://repo.maven.apache.org/maven2): <https://builds.apache.org/job/CXF-3.1-deploy/ws/.repository/org/apache/apache/9/apache-9.pom.part.lock> (No such file or directory) -> [Help 2]
[ERROR]     Unknown packaging: bundle @ org.apache.cxf.services.wsn:cxf-services-wsn-core:[unknown-version], <https://builds.apache.org/job/CXF-3.1-deploy/ws/services/wsn/wsn-core/pom.xml,> line 24, column 16
[ERROR]   
[ERROR]   The project org.apache.cxf.services.wsn:cxf-services-wsn-osgi:3.1.9-SNAPSHOT (<https://builds.apache.org/job/CXF-3.1-deploy/ws/services/wsn/wsn-osgi/pom.xml)> has 2 errors
[ERROR]     Unresolveable build extension: Plugin org.apache.felix:maven-bundle-plugin:2.4.0 or one of its dependencies could not be resolved: Failed to read artifact descriptor for org.apache.felix:maven-bundle-plugin:jar:2.4.0: Could not transfer artifact org.apache:apache:pom:9 from/to central (https://repo.maven.apache.org/maven2): <https://builds.apache.org/job/CXF-3.1-deploy/ws/.repository/org/apache/apache/9/apache-9.pom.part.lock> (No such file or directory) -> [Help 2]
[ERROR]     Unknown packaging: bundle @ org.apache.cxf.services.wsn:cxf-services-wsn-osgi:[unknown-version], <https://builds.apache.org/job/CXF-3.1-deploy/ws/services/wsn/wsn-osgi/pom.xml,> line 24, column 16
[ERROR]   
[ERROR]   The project org.apache.cxf.services.ws-discovery:cxf-services-ws-discovery-api:3.1.9-SNAPSHOT (<https://builds.apache.org/job/CXF-3.1-deploy/ws/services/ws-discovery/ws-discovery-api/pom.xml)> has 2 errors
[ERROR]     Unresolveable build extension: Plugin org.apache.felix:maven-bundle-plugin:2.4.0 or one of its dependencies could not be resolved: Failed to read artifact descriptor for org.apache.felix:maven-bundle-plugin:jar:2.4.0: Could not transfer artifact org.apache:apache:pom:9 from/to central (https://repo.maven.apache.org/maven2): <https://builds.apache.org/job/CXF-3.1-deploy/ws/.repository/org/apache/apache/9/apache-9.pom.part.lock> (No such file or directory) -> [Help 2]
[ERROR]     Unknown packaging: bundle @ org.apache.cxf.services.ws-discovery:cxf-services-ws-discovery-api:[unknown-version], <https://builds.apache.org/job/CXF-3.1-deploy/ws/services/ws-discovery/ws-discovery-api/pom.xml,> line 24, column 16
[ERROR]   
[ERROR]   The project org.apache.cxf.services.ws-discovery:cxf-services-ws-discovery-service:3.1.9-SNAPSHOT (<https://builds.apache.org/job/CXF-3.1-deploy/ws/services/ws-discovery/ws-discovery-service/pom.xml)> has 2 errors
[ERROR]     Unresolveable build extension: Plugin org.apache.felix:maven-bundle-plugin:2.4.0 or one of its dependencies could not be resolved: Failed to read artifact descriptor for org.apache.felix:maven-bundle-plugin:jar:2.4.0: Could not transfer artifact org.apache:apache:pom:9 from/to central (https://repo.maven.apache.org/maven2): <https://builds.apache.org/job/CXF-3.1-deploy/ws/.repository/org/apache/apache/9/apache-9.pom.part.lock> (No such file or directory) -> [Help 2]
[ERROR]     Unknown packaging: bundle @ org.apache.cxf.services.ws-discovery:cxf-services-ws-discovery-service:[unknown-version], <https://builds.apache.org/job/CXF-3.1-deploy/ws/services/ws-discovery/ws-discovery-service/pom.xml,> line 24, column 16
[ERROR]   
[ERROR]   The project org.apache.cxf.services.xkms:cxf-services-xkms-common:3.1.9-SNAPSHOT (<https://builds.apache.org/job/CXF-3.1-deploy/ws/services/xkms/xkms-common/pom.xml)> has 2 errors
[ERROR]     Unresolveable build extension: Plugin org.apache.felix:maven-bundle-plugin:2.4.0 or one of its dependencies could not be resolved: Failed to read artifact descriptor for org.apache.felix:maven-bundle-plugin:jar:2.4.0: Could not transfer artifact org.apache:apache:pom:9 from/to central (https://repo.maven.apache.org/maven2): <https://builds.apache.org/job/CXF-3.1-deploy/ws/.repository/org/apache/apache/9/apache-9.pom.part.lock> (No such file or directory) -> [Help 2]
[ERROR]     Unknown packaging: bundle @ org.apache.cxf.services.xkms:cxf-services-xkms-common:[unknown-version], <https://builds.apache.org/job/CXF-3.1-deploy/ws/services/xkms/xkms-common/pom.xml,> line 24, column 16
[ERROR]   
[ERROR]   The project org.apache.cxf.services.xkms:cxf-services-xkms-x509-handlers:3.1.9-SNAPSHOT (<https://builds.apache.org/job/CXF-3.1-deploy/ws/services/xkms/xkms-x509-handlers/pom.xml)> has 2 errors
[ERROR]     Unresolveable build extension: Plugin org.apache.felix:maven-bundle-plugin:2.4.0 or one of its dependencies could not be resolved: Failed to read artifact descriptor for org.apache.felix:maven-bundle-plugin:jar:2.4.0: Could not transfer artifact org.apache:apache:pom:9 from/to central (https://repo.maven.apache.org/maven2): <https://builds.apache.org/job/CXF-3.1-deploy/ws/.repository/org/apache/apache/9/apache-9.pom.part.lock> (No such file or directory) -> [Help 2]
[ERROR]     Unknown packaging: bundle @ org.apache.cxf.services.xkms:cxf-services-xkms-x509-handlers:[unknown-version], <https://builds.apache.org/job/CXF-3.1-deploy/ws/services/xkms/xkms-x509-handlers/pom.xml,> line 24, column 16
[ERROR]   
[ERROR]   The project org.apache.cxf.services.xkms:cxf-services-xkms-service:3.1.9-SNAPSHOT (<https://builds.apache.org/job/CXF-3.1-deploy/ws/services/xkms/xkms-service/pom.xml)> has 2 errors
[ERROR]     Unresolveable build extension: Plugin org.apache.felix:maven-bundle-plugin:2.4.0 or one of its dependencies could not be resolved: Failed to read artifact descriptor for org.apache.felix:maven-bundle-plugin:jar:2.4.0: Could not transfer artifact org.apache:apache:pom:9 from/to central (https://repo.maven.apache.org/maven2): <https://builds.apache.org/job/CXF-3.1-deploy/ws/.repository/org/apache/apache/9/apache-9.pom.part.lock> (No such file or directory) -> [Help 2]
[ERROR]     Unknown packaging: bundle @ org.apache.cxf.services.xkms:cxf-services-xkms-service:[unknown-version], <https://builds.apache.org/job/CXF-3.1-deploy/ws/services/xkms/xkms-service/pom.xml,> line 24, column 16
[ERROR]   
[ERROR]   The project org.apache.cxf.services.xkms:cxf-services-xkms-client:3.1.9-SNAPSHOT (<https://builds.apache.org/job/CXF-3.1-deploy/ws/services/xkms/xkms-client/pom.xml)> has 2 errors
[ERROR]     Unresolveable build extension: Plugin org.apache.felix:maven-bundle-plugin:2.4.0 or one of its dependencies could not be resolved: Failed to read artifact descriptor for org.apache.felix:maven-bundle-plugin:jar:2.4.0: Could not transfer artifact org.apache:apache:pom:9 from/to central (https://repo.maven.apache.org/maven2): <https://builds.apache.org/job/CXF-3.1-deploy/ws/.repository/org/apache/apache/9/apache-9.pom.part.lock> (No such file or directory) -> [Help 2]
[ERROR]     Unknown packaging: bundle @ org.apache.cxf.services.xkms:cxf-services-xkms-client:[unknown-version], <https://builds.apache.org/job/CXF-3.1-deploy/ws/services/xkms/xkms-client/pom.xml,> line 24, column 16
[ERROR]   
[ERROR]   The project org.apache.cxf.services.xkms:cxf-services-xkms-features:3.1.9-SNAPSHOT (<https://builds.apache.org/job/CXF-3.1-deploy/ws/services/xkms/xkms-features/pom.xml)> has 1 error
[ERROR]     Unresolveable build extension: Plugin org.apache.felix:maven-bundle-plugin:2.4.0 or one of its dependencies could not be resolved: Failed to read artifact descriptor for org.apache.felix:maven-bundle-plugin:jar:2.4.0: Could not transfer artifact org.apache:apache:pom:9 from/to central (https://repo.maven.apache.org/maven2): <https://builds.apache.org/job/CXF-3.1-deploy/ws/.repository/org/apache/apache/9/apache-9.pom.part.lock> (No such file or directory) -> [Help 2]
[ERROR]   
[ERROR]   The project org.apache.cxf.services.xkms:cxf-services-xkms-osgi:3.1.9-SNAPSHOT (<https://builds.apache.org/job/CXF-3.1-deploy/ws/services/xkms/xkms-osgi/pom.xml)> has 2 errors
[ERROR]     Unresolveable build extension: Plugin org.apache.felix:maven-bundle-plugin:2.4.0 or one of its dependencies could not be resolved: Failed to read artifact descriptor for org.apache.felix:maven-bundle-plugin:jar:2.4.0: Could not transfer artifact org.apache:apache:pom:9 from/to central (https://repo.maven.apache.org/maven2): <https://builds.apache.org/job/CXF-3.1-deploy/ws/.repository/org/apache/apache/9/apache-9.pom.part.lock> (No such file or directory) -> [Help 2]
[ERROR]     Unknown packaging: bundle @ org.apache.cxf.services.xkms:cxf-services-xkms-osgi:[unknown-version], <https://builds.apache.org/job/CXF-3.1-deploy/ws/services/xkms/xkms-osgi/pom.xml,> line 24, column 16
[ERROR]   
[ERROR]   The project org.apache.cxf.services.xkms:cxf-services-xkms-war:3.1.9-SNAPSHOT (<https://builds.apache.org/job/CXF-3.1-deploy/ws/services/xkms/xkms-war/pom.xml)> has 1 error
[ERROR]     Unresolveable build extension: Plugin org.apache.felix:maven-bundle-plugin:2.4.0 or one of its dependencies could not be resolved: Failed to read artifact descriptor for org.apache.felix:maven-bundle-plugin:jar:2.4.0: Could not transfer artifact org.apache:apache:pom:9 from/to central (https://repo.maven.apache.org/maven2): <https://builds.apache.org/job/CXF-3.1-deploy/ws/.repository/org/apache/apache/9/apache-9.pom.part.lock> (No such file or directory) -> [Help 2]
[ERROR]   
[ERROR]   The project org.apache.cxf.services.xkms:cxf-services-xkms-itests:3.1.9-SNAPSHOT (<https://builds.apache.org/job/CXF-3.1-deploy/ws/services/xkms/xkms-itests/pom.xml)> has 1 error
[ERROR]     Unresolveable build extension: Plugin org.apache.felix:maven-bundle-plugin:2.4.0 or one of its dependencies could not be resolved: Failed to read artifact descriptor for org.apache.felix:maven-bundle-plugin:jar:2.4.0: Could not transfer artifact org.apache:apache:pom:9 from/to central (https://repo.maven.apache.org/maven2): <https://builds.apache.org/job/CXF-3.1-deploy/ws/.repository/org/apache/apache/9/apache-9.pom.part.lock> (No such file or directory) -> [Help 2]
[ERROR]   
[ERROR]   The project org.apache.cxf.services.xkms:cxf-services-xkms-x509-repo-ldap:3.1.9-SNAPSHOT (<https://builds.apache.org/job/CXF-3.1-deploy/ws/services/xkms/xkms-x509-repo-ldap/pom.xml)> has 2 errors
[ERROR]     Unresolveable build extension: Plugin org.apache.felix:maven-bundle-plugin:2.4.0 or one of its dependencies could not be resolved: Failed to read artifact descriptor for org.apache.felix:maven-bundle-plugin:jar:2.4.0: Could not transfer artifact org.apache:apache:pom:9 from/to central (https://repo.maven.apache.org/maven2): <https://builds.apache.org/job/CXF-3.1-deploy/ws/.repository/org/apache/apache/9/apache-9.pom.part.lock> (No such file or directory) -> [Help 2]
[ERROR]     Unknown packaging: bundle @ org.apache.cxf.services.xkms:cxf-services-xkms-x509-repo-ldap:[unknown-version], <https://builds.apache.org/job/CXF-3.1-deploy/ws/services/xkms/xkms-x509-repo-ldap/pom.xml,> line 11, column 16
[ERROR]   
[ERROR]   The project org.apache.cxf:cxf-bundle-parent:3.1.9-SNAPSHOT (<https://builds.apache.org/job/CXF-3.1-deploy/ws/osgi/bundle/pom.xml)> has 1 error
[ERROR]     Unresolveable build extension: Plugin org.apache.felix:maven-bundle-plugin:2.4.0 or one of its dependencies could not be resolved: Failed to read artifact descriptor for org.apache.felix:maven-bundle-plugin:jar:2.4.0: Could not transfer artifact org.apache:apache:pom:9 from/to central (https://repo.maven.apache.org/maven2): <https://builds.apache.org/job/CXF-3.1-deploy/ws/.repository/org/apache/apache/9/apache-9.pom.part.lock> (No such file or directory) -> [Help 2]
[ERROR]   
[ERROR]   The project org.apache.cxf.osgi.itests:org.apache.cxf.osgi.itests:3.1.9-SNAPSHOT (<https://builds.apache.org/job/CXF-3.1-deploy/ws/osgi/itests/pom.xml)> has 1 error
[ERROR]     Unresolveable build extension: Plugin org.apache.felix:maven-bundle-plugin:2.4.0 or one of its dependencies could not be resolved: Failed to read artifact descriptor for org.apache.felix:maven-bundle-plugin:jar:2.4.0: Could not transfer artifact org.apache:apache:pom:9 from/to central (https://repo.maven.apache.org/maven2): <https://builds.apache.org/job/CXF-3.1-deploy/ws/.repository/org/apache/apache/9/apache-9.pom.part.lock> (No such file or directory) -> [Help 2]
[ERROR]   
[ERROR]   The project org.apache.cxf.osgi.itests:org.apache.cxf.osgi.itests-felix:3.1.9-SNAPSHOT (<https://builds.apache.org/job/CXF-3.1-deploy/ws/osgi/itests-felix/pom.xml)> has 1 error
[ERROR]     Unresolveable build extension: Plugin org.apache.felix:maven-bundle-plugin:2.4.0 or one of its dependencies could not be resolved: Failed to read artifact descriptor for org.apache.felix:maven-bundle-plugin:jar:2.4.0: Could not transfer artifact org.apache:apache:pom:9 from/to central (https://repo.maven.apache.org/maven2): <https://builds.apache.org/job/CXF-3.1-deploy/ws/.repository/org/apache/apache/9/apache-9.pom.part.lock> (No such file or directory) -> [Help 2]
[ERROR]   
[ERROR]   The project org.apache.cxf.karaf:karaf-parent:3.1.9-SNAPSHOT (<https://builds.apache.org/job/CXF-3.1-deploy/ws/osgi/karaf/pom.xml)> has 1 error
[ERROR]     Unresolveable build extension: Plugin org.apache.felix:maven-bundle-plugin:2.4.0 or one of its dependencies could not be resolved: Failed to read artifact descriptor for org.apache.felix:maven-bundle-plugin:jar:2.4.0: Could not transfer artifact org.apache:apache:pom:9 from/to central (https://repo.maven.apache.org/maven2): <https://builds.apache.org/job/CXF-3.1-deploy/ws/.repository/org/apache/apache/9/apache-9.pom.part.lock> (No such file or directory) -> [Help 2]
[ERROR]   
[ERROR]   The project org.apache.cxf.systests:cxf-systests-container-integration:3.1.9-SNAPSHOT (<https://builds.apache.org/job/CXF-3.1-deploy/ws/systests/container-integration/pom.xml)> has 1 error
[ERROR]     Unresolveable build extension: Plugin org.apache.felix:maven-bundle-plugin:2.4.0 or one of its dependencies could not be resolved: Failed to read artifact descriptor for org.apache.felix:maven-bundle-plugin:jar:2.4.0: Could not transfer artifact org.apache:apache:pom:9 from/to central (https://repo.maven.apache.org/maven2): <https://builds.apache.org/job/CXF-3.1-deploy/ws/.repository/org/apache/apache/9/apache-9.pom.part.lock> (No such file or directory) -> [Help 2]
[ERROR]   
[ERROR]   The project org.apache.cxf.systests:cxf-systests-uncategorized:3.1.9-SNAPSHOT (<https://builds.apache.org/job/CXF-3.1-deploy/ws/systests/uncategorized/pom.xml)> has 1 error
[ERROR]     Unresolveable build extension: Plugin org.apache.felix:maven-bundle-plugin:2.4.0 or one of its dependencies could not be resolved: Failed to read artifact descriptor for org.apache.felix:maven-bundle-plugin:jar:2.4.0: Could not transfer artifact org.apache:apache:pom:9 from/to central (https://repo.maven.apache.org/maven2): <https://builds.apache.org/job/CXF-3.1-deploy/ws/.repository/org/apache/apache/9/apache-9.pom.part.lock> (No such file or directory) -> [Help 2]
[ERROR]   
[ERROR]   The project org.apache.cxf.systests:cxf-systests-transports:3.1.9-SNAPSHOT (<https://builds.apache.org/job/CXF-3.1-deploy/ws/systests/transports/pom.xml)> has 1 error
[ERROR]     Unresolveable build extension: Plugin org.apache.felix:maven-bundle-plugin:2.4.0 or one of its dependencies could not be resolved: Failed to read artifact descriptor for org.apache.felix:maven-bundle-plugin:jar:2.4.0: Could not transfer artifact org.apache:apache:pom:9 from/to central (https://repo.maven.apache.org/maven2): <https://builds.apache.org/job/CXF-3.1-deploy/ws/.repository/org/apache/apache/9/apache-9.pom.part.lock> (No such file or directory) -> [Help 2]
[ERROR]   
[ERROR]   The project org.apache.cxf.systests:cxf-systests-transports-ssl3:3.1.9-SNAPSHOT (<https://builds.apache.org/job/CXF-3.1-deploy/ws/systests/transports-ssl3/pom.xml)> has 1 error
[ERROR]     Unresolveable build extension: Plugin org.apache.felix:maven-bundle-plugin:2.4.0 or one of its dependencies could not be resolved: Failed to read artifact descriptor for org.apache.felix:maven-bundle-plugin:jar:2.4.0: Could not transfer artifact org.apache:apache:pom:9 from/to central (https://repo.maven.apache.org/maven2): <https://builds.apache.org/job/CXF-3.1-deploy/ws/.repository/org/apache/apache/9/apache-9.pom.part.lock> (No such file or directory) -> [Help 2]
[ERROR]   
[ERROR]   The project org.apache.cxf.systests:cxf-systests-transport-jms:3.1.9-SNAPSHOT (<https://builds.apache.org/job/CXF-3.1-deploy/ws/systests/transport-jms/pom.xml)> has 1 error
[ERROR]     Unresolveable build extension: Plugin org.apache.felix:maven-bundle-plugin:2.4.0 or one of its dependencies could not be resolved: Failed to read artifact descriptor for org.apache.felix:maven-bundle-plugin:jar:2.4.0: Could not transfer artifact org.apache:apache:pom:9 from/to central (https://repo.maven.apache.org/maven2): <https://builds.apache.org/job/CXF-3.1-deploy/ws/.repository/org/apache/apache/9/apache-9.pom.part.lock> (No such file or directory) -> [Help 2]
[ERROR]   
[ERROR]   The project org.apache.cxf.systests:cxf-systests-jaxws:3.1.9-SNAPSHOT (<https://builds.apache.org/job/CXF-3.1-deploy/ws/systests/jaxws/pom.xml)> has 1 error
[ERROR]     Unresolveable build extension: Plugin org.apache.felix:maven-bundle-plugin:2.4.0 or one of its dependencies could not be resolved: Failed to read artifact descriptor for org.apache.felix:maven-bundle-plugin:jar:2.4.0: Could not transfer artifact org.apache:apache:pom:9 from/to central (https://repo.maven.apache.org/maven2): <https://builds.apache.org/job/CXF-3.1-deploy/ws/.repository/org/apache/apache/9/apache-9.pom.part.lock> (No such file or directory) -> [Help 2]
[ERROR]   
[ERROR]   The project org.apache.cxf.systests:cxf-systests-databinding:3.1.9-SNAPSHOT (<https://builds.apache.org/job/CXF-3.1-deploy/ws/systests/databinding/pom.xml)> has 1 error
[ERROR]     Unresolveable build extension: Plugin org.apache.felix:maven-bundle-plugin:2.4.0 or one of its dependencies could not be resolved: Failed to read artifact descriptor for org.apache.felix:maven-bundle-plugin:jar:2.4.0: Could not transfer artifact org.apache:apache:pom:9 from/to central (https://repo.maven.apache.org/maven2): <https://builds.apache.org/job/CXF-3.1-deploy/ws/.repository/org/apache/apache/9/apache-9.pom.part.lock> (No such file or directory) -> [Help 2]
[ERROR]   
[ERROR]   The project org.apache.cxf.systests:cxf-systests-jaxrs:3.1.9-SNAPSHOT (<https://builds.apache.org/job/CXF-3.1-deploy/ws/systests/jaxrs/pom.xml)> has 1 error
[ERROR]     Unresolveable build extension: Plugin org.apache.felix:maven-bundle-plugin:2.4.0 or one of its dependencies could not be resolved: Failed to read artifact descriptor for org.apache.felix:maven-bundle-plugin:jar:2.4.0: Could not transfer artifact org.apache:apache:pom:9 from/to central (https://repo.maven.apache.org/maven2): <https://builds.apache.org/job/CXF-3.1-deploy/ws/.repository/org/apache/apache/9/apache-9.pom.part.lock> (No such file or directory) -> [Help 2]
[ERROR]   
[ERROR]   The project org.apache.cxf.systests:cxf-systests-ws-specs:3.1.9-SNAPSHOT (<https://builds.apache.org/job/CXF-3.1-deploy/ws/systests/ws-specs/pom.xml)> has 1 error
[ERROR]     Unresolveable build extension: Plugin org.apache.felix:maven-bundle-plugin:2.4.0 or one of its dependencies could not be resolved: Failed to read artifact descriptor for org.apache.felix:maven-bundle-plugin:jar:2.4.0: Could not transfer artifact org.apache:apache:pom:9 from/to central (https://repo.maven.apache.org/maven2): <https://builds.apache.org/job/CXF-3.1-deploy/ws/.repository/org/apache/apache/9/apache-9.pom.part.lock> (No such file or directory) -> [Help 2]
[ERROR]   
[ERROR]   The project org.apache.cxf.systests:cxf-systests-ws-rm:3.1.9-SNAPSHOT (<https://builds.apache.org/job/CXF-3.1-deploy/ws/systests/ws-rm/pom.xml)> has 1 error
[ERROR]     Unresolveable build extension: Plugin org.apache.felix:maven-bundle-plugin:2.4.0 or one of its dependencies could not be resolved: Failed to read artifact descriptor for org.apache.felix:maven-bundle-plugin:jar:2.4.0: Could not transfer artifact org.apache:apache:pom:9 from/to central (https://repo.maven.apache.org/maven2): <https://builds.apache.org/job/CXF-3.1-deploy/ws/.repository/org/apache/apache/9/apache-9.pom.part.lock> (No such file or directory) -> [Help 2]
[ERROR]   
[ERROR]   The project org.apache.cxf.systests:cxf-systests-ws-security:3.1.9-SNAPSHOT (<https://builds.apache.org/job/CXF-3.1-deploy/ws/systests/ws-security/pom.xml)> has 1 error
[ERROR]     Unresolveable build extension: Plugin org.apache.felix:maven-bundle-plugin:2.4.0 or one of its dependencies could not be resolved: Failed to read artifact descriptor for org.apache.felix:maven-bundle-plugin:jar:2.4.0: Could not transfer artifact org.apache:apache:pom:9 from/to central (https://repo.maven.apache.org/maven2): <https://builds.apache.org/job/CXF-3.1-deploy/ws/.repository/org/apache/apache/9/apache-9.pom.part.lock> (No such file or directory) -> [Help 2]
[ERROR]   
[ERROR]   The project org.apache.cxf.systests:cxf-systests-ws-security-examples:3.1.9-SNAPSHOT (<https://builds.apache.org/job/CXF-3.1-deploy/ws/systests/ws-security-examples/pom.xml)> has 1 error
[ERROR]     Unresolveable build extension: Plugin org.apache.felix:maven-bundle-plugin:2.4.0 or one of its dependencies could not be resolved: Failed to read artifact descriptor for org.apache.felix:maven-bundle-plugin:jar:2.4.0: Could not transfer artifact org.apache:apache:pom:9 from/to central (https://repo.maven.apache.org/maven2): <https://builds.apache.org/job/CXF-3.1-deploy/ws/.repository/org/apache/apache/9/apache-9.pom.part.lock> (No such file or directory) -> [Help 2]
[ERROR]   
[ERROR]   The project org.apache.cxf.systests:cxf-systests-kerberos:3.1.9-SNAPSHOT (<https://builds.apache.org/job/CXF-3.1-deploy/ws/systests/kerberos/pom.xml)> has 1 error
[ERROR]     Unresolveable build extension: Plugin org.apache.felix:maven-bundle-plugin:2.4.0 or one of its dependencies could not be resolved: Failed to read artifact descriptor for org.apache.felix:maven-bundle-plugin:jar:2.4.0: Could not transfer artifact org.apache:apache:pom:9 from/to central (https://repo.maven.apache.org/maven2): <https://builds.apache.org/job/CXF-3.1-deploy/ws/.repository/org/apache/apache/9/apache-9.pom.part.lock> (No such file or directory) -> [Help 2]
[ERROR]   
[ERROR]   The project org.apache.cxf.systests:cxf-systests-rs-security:3.1.9-SNAPSHOT (<https://builds.apache.org/job/CXF-3.1-deploy/ws/systests/rs-security/pom.xml)> has 1 error
[ERROR]     Unresolveable build extension: Plugin org.apache.felix:maven-bundle-plugin:2.4.0 or one of its dependencies could not be resolved: Failed to read artifact descriptor for org.apache.felix:maven-bundle-plugin:jar:2.4.0: Could not transfer artifact org.apache:apache:pom:9 from/to central (https://repo.maven.apache.org/maven2): <https://builds.apache.org/job/CXF-3.1-deploy/ws/.repository/org/apache/apache/9/apache-9.pom.part.lock> (No such file or directory) -> [Help 2]
[ERROR]   
[ERROR]   The project org.apache.cxf.systests.wsdl_maven:cxf-systests-codegen:3.1.9-SNAPSHOT (<https://builds.apache.org/job/CXF-3.1-deploy/ws/systests/wsdl_maven/codegen/pom.xml)> has 1 error
[ERROR]     Unresolveable build extension: Plugin org.apache.felix:maven-bundle-plugin:2.4.0 or one of its dependencies could not be resolved: Failed to read artifact descriptor for org.apache.felix:maven-bundle-plugin:jar:2.4.0: Could not transfer artifact org.apache:apache:pom:9 from/to central (https://repo.maven.apache.org/maven2): <https://builds.apache.org/job/CXF-3.1-deploy/ws/.repository/org/apache/apache/9/apache-9.pom.part.lock> (No such file or directory) -> [Help 2]
[ERROR]   
[ERROR]   The project org.apache.cxf.systests.wsdl_maven:cxf-systests-java2ws:3.1.9-SNAPSHOT (<https://builds.apache.org/job/CXF-3.1-deploy/ws/systests/wsdl_maven/java2ws/pom.xml)> has 1 error
[ERROR]     Unresolveable build extension: Plugin org.apache.felix:maven-bundle-plugin:2.4.0 or one of its dependencies could not be resolved: Failed to read artifact descriptor for org.apache.felix:maven-bundle-plugin:jar:2.4.0: Could not transfer artifact org.apache:apache:pom:9 from/to central (https://repo.maven.apache.org/maven2): <https://builds.apache.org/job/CXF-3.1-deploy/ws/.repository/org/apache/apache/9/apache-9.pom.part.lock> (No such file or directory) -> [Help 2]
[ERROR]   
[ERROR]   The project org.apache.cxf.systests:cxf-systests-cdi:3.1.9-SNAPSHOT (<https://builds.apache.org/job/CXF-3.1-deploy/ws/systests/cdi/pom.xml)> has 1 error
[ERROR]     Unresolveable build extension: Plugin org.apache.felix:maven-bundle-plugin:2.4.0 or one of its dependencies could not be resolved: Failed to read artifact descriptor for org.apache.felix:maven-bundle-plugin:jar:2.4.0: Could not transfer artifact org.apache:apache:pom:9 from/to central (https://repo.maven.apache.org/maven2): <https://builds.apache.org/job/CXF-3.1-deploy/ws/.repository/org/apache/apache/9/apache-9.pom.part.lock> (No such file or directory) -> [Help 2]
[ERROR]   
[ERROR]   The project org.apache.cxf.systests:cxf-systests-http-sci:3.1.9-SNAPSHOT (<https://builds.apache.org/job/CXF-3.1-deploy/ws/systests/rs-http-sci/pom.xml)> has 1 error
[ERROR]     Unresolveable build extension: Plugin org.apache.felix:maven-bundle-plugin:2.4.0 or one of its dependencies could not be resolved: Failed to read artifact descriptor for org.apache.felix:maven-bundle-plugin:jar:2.4.0: Could not transfer artifact org.apache:apache:pom:9 from/to central (https://repo.maven.apache.org/maven2): <https://builds.apache.org/job/CXF-3.1-deploy/ws/.repository/org/apache/apache/9/apache-9.pom.part.lock> (No such file or directory) -> [Help 2]
[ERROR]   
[ERROR]   The project org.apache.cxf.systests:cxf-systests-tracing:3.1.9-SNAPSHOT (<https://builds.apache.org/job/CXF-3.1-deploy/ws/systests/tracing/pom.xml)> has 1 error
[ERROR]     Unresolveable build extension: Plugin org.apache.felix:maven-bundle-plugin:2.4.0 or one of its dependencies could not be resolved: Failed to read artifact descriptor for org.apache.felix:maven-bundle-plugin:jar:2.4.0: Could not transfer artifact org.apache:apache:pom:9 from/to central (https://repo.maven.apache.org/maven2): <https://builds.apache.org/job/CXF-3.1-deploy/ws/.repository/org/apache/apache/9/apache-9.pom.part.lock> (No such file or directory) -> [Help 2]
[ERROR]   
[ERROR]   The project org.apache.cxf.systests:cxf-systests-jibx:3.1.9-SNAPSHOT (<https://builds.apache.org/job/CXF-3.1-deploy/ws/systests/jibx/pom.xml)> has 1 error
[ERROR]     Unresolveable build extension: Plugin org.apache.felix:maven-bundle-plugin:2.4.0 or one of its dependencies could not be resolved: Failed to read artifact descriptor for org.apache.felix:maven-bundle-plugin:jar:2.4.0: Could not transfer artifact org.apache:apache:pom:9 from/to central (https://repo.maven.apache.org/maven2): <https://builds.apache.org/job/CXF-3.1-deploy/ws/.repository/org/apache/apache/9/apache-9.pom.part.lock> (No such file or directory) -> [Help 2]
[ERROR]   
[ERROR]   The project org.apache.cxf:apache-cxf:3.1.9-SNAPSHOT (<https://builds.apache.org/job/CXF-3.1-deploy/ws/distribution/pom.xml)> has 1 error
[ERROR]     Unresolveable build extension: Plugin org.apache.felix:maven-bundle-plugin:2.4.0 or one of its dependencies could not be resolved: Failed to read artifact descriptor for org.apache.felix:maven-bundle-plugin:jar:2.4.0: Could not transfer artifact org.apache:apache:pom:9 from/to central (https://repo.maven.apache.org/maven2): <https://builds.apache.org/job/CXF-3.1-deploy/ws/.repository/org/apache/apache/9/apache-9.pom.part.lock> (No such file or directory) -> [Help 2]
[ERROR] 
[ERROR] To see the full stack trace of the errors, re-run Maven with the -e switch.
[ERROR] Re-run Maven using the -X switch to enable full debug logging.
[ERROR] 
[ERROR] For more information about the errors and possible solutions, please read the following articles:
[ERROR] [Help 1] http://cwiki.apache.org/confluence/display/MAVEN/ProjectBuildingException
[ERROR] [Help 2] http://cwiki.apache.org/confluence/display/MAVEN/PluginResolutionException
Build step 'Invoke top-level Maven targets' marked build as failure

Mime
View raw message