cxf-notifications mailing list archives

Site index · List index
Message view « Date » · « Thread »
Top « Date » · « Thread »
From Apache Jenkins Server <jenk...@builds.apache.org>
Subject Build failed in Jenkins: CXF-trunk-deploy #2032
Date Wed, 19 Oct 2016 06:52:21 GMT
See <https://builds.apache.org/job/CXF-trunk-deploy/2032/changes>

Changes:

[sberyozkin] [CXF-6216] Stripping away the matrix parameters if any from the base URL

[coheigea] Updating Joda Time

[coheigea] Updating OpenSAML

[sberyozkin] [CXF-6216] Better stripping of matrix params

[sberyozkin] Resoring the demo endpoint address

[coheigea] Some fixes for latest WSS4J SNAPSHOT code

[reta] CXF-7095: CDI integration doesn't use the right bus to create the server

[reta] Enriched Spring Boot Scan demo: added CXF metrics support.

------------------------------------------
Started by an SCM change
[EnvInject] - Loading node environment variables.
Building remotely on ubuntu-6 (Ubuntu yahoo-not-h2 ubuntu docker) in workspace <https://builds.apache.org/job/CXF-trunk-deploy/ws/>
 > git rev-parse --is-inside-work-tree # timeout=10
Fetching changes from the remote Git repository
 > git config remote.origin.url https://git-wip-us.apache.org/repos/asf/cxf.git # timeout=10
Fetching upstream changes from https://git-wip-us.apache.org/repos/asf/cxf.git
 > git --version # timeout=10
 > git -c core.askpass=true fetch --tags --progress https://git-wip-us.apache.org/repos/asf/cxf.git
+refs/heads/*:refs/remotes/origin/*
 > git rev-parse refs/remotes/origin/master^{commit} # timeout=10
 > git rev-parse refs/remotes/origin/origin/master^{commit} # timeout=10
Checking out Revision 80ca2370616c28b036c54c95af84ca62f1725a30 (refs/remotes/origin/master)
 > git config core.sparsecheckout # timeout=10
 > git checkout -f 80ca2370616c28b036c54c95af84ca62f1725a30
 > git rev-list c212240f696e3387df19bbcf22d1851aff320078 # timeout=10
Parsing POMs
ERROR: Failed to parse POMs
java.io.IOException: remote file operation failed: <https://builds.apache.org/job/CXF-trunk-deploy/ws/>
at hudson.remoting.Channel@35b031cd:ubuntu-6: hudson.remoting.ProxyException: hudson.maven.MavenModuleSetBuild$MavenExecutionException:
org.apache.maven.project.ProjectBuildingException: Some problems were encountered while processing
the POMs:
[ERROR] 'dependencies.dependency.version' for org.apache.geronimo.specs:geronimo-servlet_3.0_spec:jar
is missing. @ line 86, column 21

	at hudson.FilePath.act(FilePath.java:1014)
	at hudson.FilePath.act(FilePath.java:996)
	at hudson.maven.MavenModuleSetBuild$MavenModuleSetBuildExecution.parsePoms(MavenModuleSetBuild.java:960)
	at hudson.maven.MavenModuleSetBuild$MavenModuleSetBuildExecution.doRun(MavenModuleSetBuild.java:679)
	at hudson.model.AbstractBuild$AbstractBuildExecution.run(AbstractBuild.java:534)
	at hudson.model.Run.execute(Run.java:1741)
	at hudson.maven.MavenModuleSetBuild.run(MavenModuleSetBuild.java:531)
	at hudson.model.ResourceController.execute(ResourceController.java:98)
	at hudson.model.Executor.run(Executor.java:410)
Caused by: hudson.remoting.ProxyException: hudson.maven.MavenModuleSetBuild$MavenExecutionException:
org.apache.maven.project.ProjectBuildingException: Some problems were encountered while processing
the POMs:
[ERROR] 'dependencies.dependency.version' for org.apache.geronimo.specs:geronimo-servlet_3.0_spec:jar
is missing. @ line 86, column 21

	at hudson.maven.MavenModuleSetBuild$PomParser.invoke(MavenModuleSetBuild.java:1364)
	at hudson.maven.MavenModuleSetBuild$PomParser.invoke(MavenModuleSetBuild.java:1098)
	at hudson.FilePath$FileCallableWrapper.call(FilePath.java:2772)
	at hudson.remoting.UserRequest.perform(UserRequest.java:153)
	at hudson.remoting.UserRequest.perform(UserRequest.java:50)
	at hudson.remoting.Request$2.run(Request.java:332)
	at hudson.remoting.InterceptingExecutorService$1.call(InterceptingExecutorService.java:68)
	at java.util.concurrent.FutureTask.run(FutureTask.java:262)
	at java.util.concurrent.ThreadPoolExecutor.runWorker(ThreadPoolExecutor.java:1145)
	at java.util.concurrent.ThreadPoolExecutor$Worker.run(ThreadPoolExecutor.java:615)
	at java.lang.Thread.run(Thread.java:745)
	at ......remote call to ubuntu-6(Native Method)
	at hudson.remoting.Channel.attachCallSiteStackTrace(Channel.java:1416)
	at hudson.remoting.UserResponse.retrieve(UserRequest.java:253)
	at hudson.remoting.Channel.call(Channel.java:781)
	at hudson.FilePath.act(FilePath.java:1007)
	... 8 more
Caused by: hudson.remoting.ProxyException: org.apache.maven.project.ProjectBuildingException:
Some problems were encountered while processing the POMs:
[ERROR] 'dependencies.dependency.version' for org.apache.geronimo.specs:geronimo-servlet_3.0_spec:jar
is missing. @ line 86, column 21

	at org.apache.maven.project.DefaultProjectBuilder.build(DefaultProjectBuilder.java:364)
	at hudson.maven.MavenEmbedder.buildProjects(MavenEmbedder.java:361)
	at hudson.maven.MavenEmbedder.readProjects(MavenEmbedder.java:331)
	at hudson.maven.MavenModuleSetBuild$PomParser.invoke(MavenModuleSetBuild.java:1301)
	at hudson.maven.MavenModuleSetBuild$PomParser.invoke(MavenModuleSetBuild.java:1098)
	at hudson.FilePath$FileCallableWrapper.call(FilePath.java:2772)
	at hudson.remoting.UserRequest.perform(UserRequest.java:153)
	at hudson.remoting.UserRequest.perform(UserRequest.java:50)
	at hudson.remoting.Request$2.run(Request.java:332)
	at hudson.remoting.InterceptingExecutorService$1.call(InterceptingExecutorService.java:68)
	at java.util.concurrent.FutureTask.run(FutureTask.java:262)
	at java.util.concurrent.ThreadPoolExecutor.runWorker(ThreadPoolExecutor.java:1145)
	at java.util.concurrent.ThreadPoolExecutor$Worker.run(ThreadPoolExecutor.java:615)
	at java.lang.Thread.run(Thread.java:745)

Mime
View raw message