cxf-notifications mailing list archives

Site index · List index
Message view « Date » · « Thread »
Top « Date » · « Thread »
From Apache Jenkins Server <jenk...@builds.apache.org>
Subject Build failed in Jenkins: CXF-DOSGi #1108
Date Mon, 25 Jul 2016 12:50:56 GMT
See <https://builds.apache.org/job/CXF-DOSGi/1108/changes>

Changes:

[chris] [CXF-5107] SSL example and support for Conduit features

------------------------------------------
[...truncated 1292 lines...]
[INFO] Downloading: https://repo.maven.apache.org/maven2/org/apache/maven/maven-monitor/2.0.9/maven-monitor-2.0.9.pom
[INFO] Downloaded: https://repo.maven.apache.org/maven2/org/apache/maven/maven-monitor/2.0.9/maven-monitor-2.0.9.pom
(2 KB at 69.7 KB/sec)
[INFO] Downloading: https://repo.maven.apache.org/maven2/org/apache/maven/maven-toolchain/2.0.9/maven-toolchain-2.0.9.pom
[INFO] Downloaded: https://repo.maven.apache.org/maven2/org/apache/maven/maven-toolchain/2.0.9/maven-toolchain-2.0.9.pom
(4 KB at 178.7 KB/sec)
[INFO] Downloading: https://repo.maven.apache.org/maven2/org/apache/maven/shared/maven-common-artifact-filters/1.3/maven-common-artifact-filters-1.3.pom
[INFO] Downloaded: https://repo.maven.apache.org/maven2/org/apache/maven/shared/maven-common-artifact-filters/1.3/maven-common-artifact-filters-1.3.pom
(4 KB at 190.3 KB/sec)
[INFO] Downloading: https://repo.maven.apache.org/maven2/org/apache/maven/surefire/surefire-booter/2.8.1/surefire-booter-2.8.1.jar
[INFO] Downloading: https://repo.maven.apache.org/maven2/org/apache/maven/surefire/surefire-api/2.8.1/surefire-api-2.8.1.jar
[INFO] Downloading: https://repo.maven.apache.org/maven2/org/apache/maven/surefire/maven-surefire-common/2.8.1/maven-surefire-common-2.8.1.jar
[INFO] Downloading: https://repo.maven.apache.org/maven2/org/apache/maven/shared/maven-common-artifact-filters/1.3/maven-common-artifact-filters-1.3.jar
[INFO] Downloading: https://repo.maven.apache.org/maven2/org/codehaus/plexus/plexus-utils/2.0.7/plexus-utils-2.0.7.jar
[INFO] Downloaded: https://repo.maven.apache.org/maven2/org/apache/maven/surefire/surefire-booter/2.8.1/surefire-booter-2.8.1.jar
(34 KB at 1075.5 KB/sec)
[INFO] Downloading: https://repo.maven.apache.org/maven2/org/apache/maven/reporting/maven-reporting-api/2.0.9/maven-reporting-api-2.0.9.jar
[INFO] Downloaded: https://repo.maven.apache.org/maven2/org/apache/maven/surefire/maven-surefire-common/2.8.1/maven-surefire-common-2.8.1.jar
(60 KB at 1869.4 KB/sec)
[INFO] Downloaded: https://repo.maven.apache.org/maven2/org/apache/maven/surefire/surefire-api/2.8.1/surefire-api-2.8.1.jar
(129 KB at 4005.6 KB/sec)
[INFO] Downloaded: https://repo.maven.apache.org/maven2/org/apache/maven/shared/maven-common-artifact-filters/1.3/maven-common-artifact-filters-1.3.jar
(31 KB at 919.1 KB/sec)
[INFO] Downloaded: https://repo.maven.apache.org/maven2/org/codehaus/plexus/plexus-utils/2.0.7/plexus-utils-2.0.7.jar
(219 KB at 6074.8 KB/sec)
[INFO] Downloaded: https://repo.maven.apache.org/maven2/org/apache/maven/reporting/maven-reporting-api/2.0.9/maven-reporting-api-2.0.9.jar
(10 KB at 247.5 KB/sec)
[INFO] Surefire report directory: <https://builds.apache.org/job/CXF-DOSGi/ws/decorator/target/surefire-reports>
[INFO] Downloading: https://repo.maven.apache.org/maven2/org/apache/maven/surefire/surefire-junit4/2.8.1/surefire-junit4-2.8.1.pom
[INFO] Downloaded: https://repo.maven.apache.org/maven2/org/apache/maven/surefire/surefire-junit4/2.8.1/surefire-junit4-2.8.1.pom
(3 KB at 134.3 KB/sec)
[INFO] Downloading: https://repo.maven.apache.org/maven2/org/apache/maven/surefire/surefire-providers/2.8.1/surefire-providers-2.8.1.pom
[INFO] Downloaded: https://repo.maven.apache.org/maven2/org/apache/maven/surefire/surefire-providers/2.8.1/surefire-providers-2.8.1.pom
(3 KB at 116.5 KB/sec)
[INFO] Downloading: https://repo.maven.apache.org/maven2/org/apache/maven/surefire/surefire-junit4/2.8.1/surefire-junit4-2.8.1.jar
[INFO] Downloaded: https://repo.maven.apache.org/maven2/org/apache/maven/surefire/surefire-junit4/2.8.1/surefire-junit4-2.8.1.jar
(33 KB at 1394.8 KB/sec)

-------------------------------------------------------
 T E S T S
-------------------------------------------------------
Running org.apache.cxf.dosgi.dsw.decorator.InterfaceRuleTest
SLF4J: Failed to load class "org.slf4j.impl.StaticLoggerBinder".
SLF4J: Defaulting to no-operation (NOP) logger implementation
SLF4J: See http://www.slf4j.org/codes.html#StaticLoggerBinder for further details.
Tests run: 8, Failures: 0, Errors: 0, Skipped: 0, Time elapsed: 0.145 sec
Running org.apache.cxf.dosgi.dsw.decorator.ServiceDecoratorImplTest
Tests run: 9, Failures: 0, Errors: 0, Skipped: 0, Time elapsed: 0.447 sec
Running org.apache.cxf.dosgi.dsw.decorator.ServiceDecoratorBundleListenerTest
Tests run: 1, Failures: 0, Errors: 0, Skipped: 0, Time elapsed: 0.072 sec
Running org.apache.cxf.dosgi.dsw.decorator.DecorationParserTest
Tests run: 2, Failures: 0, Errors: 0, Skipped: 0, Time elapsed: 0.053 sec

Results :

Tests run: 20, Failures: 0, Errors: 0, Skipped: 0

[JENKINS] Recording test results
[INFO] 
[INFO] --- maven-bundle-plugin:3.2.0:bundle (default-bundle) @ cxf-dosgi-ri-decorator ---
[INFO] 
[INFO] --- maven-bundle-plugin:3.2.0:baseline (baseline) @ cxf-dosgi-ri-decorator ---
[INFO] Skipping Baseline execution
[INFO] 
[INFO] --- maven-install-plugin:2.5.2:install (default-install) @ cxf-dosgi-ri-decorator ---
[INFO] Downloading: https://repo.maven.apache.org/maven2/commons-codec/commons-codec/1.6/commons-codec-1.6.pom
[INFO] Downloaded: https://repo.maven.apache.org/maven2/commons-codec/commons-codec/1.6/commons-codec-1.6.pom
(11 KB at 518.8 KB/sec)
[INFO] Downloading: https://repo.maven.apache.org/maven2/org/apache/commons/commons-parent/22/commons-parent-22.pom
[INFO] Downloaded: https://repo.maven.apache.org/maven2/org/apache/commons/commons-parent/22/commons-parent-22.pom
(41 KB at 1860.7 KB/sec)
[INFO] Downloading: https://repo.maven.apache.org/maven2/org/apache/maven/shared/maven-shared-utils/0.4/maven-shared-utils-0.4.pom
[INFO] Downloaded: https://repo.maven.apache.org/maven2/org/apache/maven/shared/maven-shared-utils/0.4/maven-shared-utils-0.4.pom
(4 KB at 208.0 KB/sec)
[INFO] Downloading: https://repo.maven.apache.org/maven2/org/codehaus/plexus/plexus-interpolation/1.11/plexus-interpolation-1.11.jar
[INFO] Downloading: https://repo.maven.apache.org/maven2/commons-codec/commons-codec/1.6/commons-codec-1.6.jar
[INFO] Downloading: https://repo.maven.apache.org/maven2/org/apache/maven/shared/maven-shared-utils/0.4/maven-shared-utils-0.4.jar
[INFO] Downloading: https://repo.maven.apache.org/maven2/org/codehaus/plexus/plexus-utils/3.0.15/plexus-utils-3.0.15.jar
[INFO] Downloaded: https://repo.maven.apache.org/maven2/org/codehaus/plexus/plexus-interpolation/1.11/plexus-interpolation-1.11.jar
(50 KB at 1842.3 KB/sec)
[INFO] Downloaded: https://repo.maven.apache.org/maven2/org/apache/maven/shared/maven-shared-utils/0.4/maven-shared-utils-0.4.jar
(152 KB at 5421.7 KB/sec)
[INFO] Downloaded: https://repo.maven.apache.org/maven2/org/codehaus/plexus/plexus-utils/3.0.15/plexus-utils-3.0.15.jar
(234 KB at 7071.3 KB/sec)
[INFO] Downloaded: https://repo.maven.apache.org/maven2/commons-codec/commons-codec/1.6/commons-codec-1.6.jar
(228 KB at 6685.7 KB/sec)
[INFO] Installing <https://builds.apache.org/job/CXF-DOSGi/ws/decorator/target/cxf-dosgi-ri-decorator-2.0-SNAPSHOT.jar>
to /home/jenkins/.m2/repository/org/apache/cxf/dosgi/cxf-dosgi-ri-decorator/2.0-SNAPSHOT/cxf-dosgi-ri-decorator-2.0-SNAPSHOT.jar
[INFO] Installing <https://builds.apache.org/job/CXF-DOSGi/ws/decorator/pom.xml> to
/home/jenkins/.m2/repository/org/apache/cxf/dosgi/cxf-dosgi-ri-decorator/2.0-SNAPSHOT/cxf-dosgi-ri-decorator-2.0-SNAPSHOT.pom
[INFO] 
[INFO] --- maven-bundle-plugin:3.2.0:install (default-install) @ cxf-dosgi-ri-decorator ---
[INFO] Local OBR update disabled (enable with -DobrRepository)
[INFO]                                                                         
[INFO] ------------------------------------------------------------------------
[INFO] Building CXF dOSGi Common 2.0-SNAPSHOT
[INFO] ------------------------------------------------------------------------
[WARNING] Failure to transfer org.apache.maven.plugins:maven-install-plugin/maven-metadata.xml
from http://repository.apache.org/snapshots was cached in the local repository, resolution
will not be reattempted until the update interval of Nexus has elapsed or updates are forced.
Original error: Could not transfer metadata org.apache.maven.plugins:maven-install-plugin/maven-metadata.xml
from/to Nexus (http://repository.apache.org/snapshots): Failed to transfer file: http://repository.apache.org/snapshots/org/apache/maven/plugins/maven-install-plugin/maven-metadata.xml.
Return code is: 502 , ReasonPhrase:Proxy Error.
[WARNING] Failure to transfer org.apache.maven.plugins:maven-deploy-plugin/maven-metadata.xml
from http://repository.apache.org/snapshots was cached in the local repository, resolution
will not be reattempted until the update interval of Nexus has elapsed or updates are forced.
Original error: Could not transfer metadata org.apache.maven.plugins:maven-deploy-plugin/maven-metadata.xml
from/to Nexus (http://repository.apache.org/snapshots): Failed to transfer file: http://repository.apache.org/snapshots/org/apache/maven/plugins/maven-deploy-plugin/maven-metadata.xml.
Return code is: 502 , ReasonPhrase:Proxy Error.
[INFO] Downloading: http://repository.apache.org/snapshots/org/apache/cxf/cxf-core/3.1.7-SNAPSHOT/maven-metadata.xml
[INFO] Downloaded: http://repository.apache.org/snapshots/org/apache/cxf/cxf-core/3.1.7-SNAPSHOT/maven-metadata.xml
(2 KB at 0.5 KB/sec)
[INFO] Downloading: http://repository.apache.org/snapshots/org/apache/cxf/cxf-core/3.1.7-SNAPSHOT/cxf-core-3.1.7-20160725.062452-327.pom
[INFO] Downloaded: http://repository.apache.org/snapshots/org/apache/cxf/cxf-core/3.1.7-SNAPSHOT/cxf-core-3.1.7-20160725.062452-327.pom
(19 KB at 8.6 KB/sec)
[INFO] Downloading: http://repository.apache.org/snapshots/org/apache/cxf/cxf-parent/3.1.7-SNAPSHOT/maven-metadata.xml
[WARNING] Could not transfer metadata org.apache.cxf:cxf-parent:3.1.7-SNAPSHOT/maven-metadata.xml
from/to Nexus (http://repository.apache.org/snapshots): Failed to transfer file: http://repository.apache.org/snapshots/org/apache/cxf/cxf-parent/3.1.7-SNAPSHOT/maven-metadata.xml.
Return code is: 502 , ReasonPhrase:Proxy Error.
[INFO] Downloading: http://repository.apache.org/snapshots/org/apache/cxf/cxf-parent/3.1.7-SNAPSHOT/cxf-parent-3.1.7-SNAPSHOT.pom
[INFO] Downloading: http://repository.apache.org/snapshots/org/apache/cxf/cxf-rt-transports-http/3.1.7-SNAPSHOT/maven-metadata.xml
[INFO] Downloaded: http://repository.apache.org/snapshots/org/apache/cxf/cxf-rt-transports-http/3.1.7-SNAPSHOT/maven-metadata.xml
(2 KB at 10.2 KB/sec)
[INFO] Downloading: http://repository.apache.org/snapshots/org/apache/cxf/cxf-rt-transports-http/3.1.7-SNAPSHOT/cxf-rt-transports-http-3.1.7-20160725.063006-305.pom
[INFO] Downloaded: http://repository.apache.org/snapshots/org/apache/cxf/cxf-rt-transports-http/3.1.7-SNAPSHOT/cxf-rt-transports-http-3.1.7-20160725.063006-305.pom
(12 KB at 1.1 KB/sec)
[INFO] Downloading: https://repo.maven.apache.org/maven2/org/apache/geronimo/specs/geronimo-servlet_3.0_spec/1.0/geronimo-servlet_3.0_spec-1.0.pom
[INFO] Downloaded: https://repo.maven.apache.org/maven2/org/apache/geronimo/specs/geronimo-servlet_3.0_spec/1.0/geronimo-servlet_3.0_spec-1.0.pom
(7 KB at 304.8 KB/sec)
[INFO] Downloading: https://repo.maven.apache.org/maven2/org/apache/geronimo/genesis/genesis-java5-flava/2.0/genesis-java5-flava-2.0.pom
[INFO] Downloaded: https://repo.maven.apache.org/maven2/org/apache/geronimo/genesis/genesis-java5-flava/2.0/genesis-java5-flava-2.0.pom
(6 KB at 267.7 KB/sec)
[INFO] Downloading: https://repo.maven.apache.org/maven2/org/apache/geronimo/genesis/genesis-default-flava/2.0/genesis-default-flava-2.0.pom
[INFO] Downloaded: https://repo.maven.apache.org/maven2/org/apache/geronimo/genesis/genesis-default-flava/2.0/genesis-default-flava-2.0.pom
(18 KB at 869.6 KB/sec)
[INFO] Downloading: https://repo.maven.apache.org/maven2/org/apache/geronimo/genesis/genesis/2.0/genesis-2.0.pom
[INFO] Downloaded: https://repo.maven.apache.org/maven2/org/apache/geronimo/genesis/genesis/2.0/genesis-2.0.pom
(18 KB at 856.5 KB/sec)
[INFO] ------------------------------------------------------------------------
[INFO] Reactor Summary:
[INFO] 
[INFO] Distributed OSGI Reference Implementation .......... SUCCESS [  2.201 s]
[INFO] Distributed OSGI Reference Implementation Parent ... SUCCESS [  7.407 s]
[INFO] CXF dOSGi Service decorator support ................ SUCCESS [ 55.746 s]
[INFO] CXF dOSGi Common ................................... FAILURE [ 22.315 s]
[INFO] CXF dOSGi provider ws .............................. SKIPPED
[INFO] CXF dOSGi provider rs .............................. SKIPPED
[INFO] Distributed OSGI Greeter Bundles ................... SKIPPED
[INFO] Distributed OSGI Greeter Interface Bundle .......... SKIPPED
[INFO] Distributed OSGI Greeter Implementation Bundle ..... SKIPPED
[INFO] Distributed OSGI Greeter Bundle Client ............. SKIPPED
[INFO] Distributed OSGI Greeter REST Interface ............ SKIPPED
[INFO] Distributed OSGI Greeter REST ...................... SKIPPED
[INFO] Distributed OSGI Greeter REST Impl ................. SKIPPED
[INFO] Distributed OSGI Greeter REST Client ............... SKIPPED
[INFO] Distributed OSGI DS Sample ......................... SKIPPED
[INFO] Distributed OSGI DS Sample Interface ............... SKIPPED
[INFO] Distributed OSGI DS Sample Impl .................... SKIPPED
[INFO] Distributed OSGI DS Client ......................... SKIPPED
[INFO] Distributed OSGI Security Sample Bundle ............ SKIPPED
[INFO] Distributed OSGI RI Sample Bundles ................. SKIPPED
[INFO] Distributed OSGI Distribution Parent ............... SKIPPED
[INFO] CXF DOSGI Karaf Features ........................... SKIPPED
[INFO] Distributed OSGI Multi-Bundle Distribution ......... SKIPPED
[INFO] cxf-dosgi-ri-repository ............................ SKIPPED
[INFO] Distributed OSGI Source Distribution ............... SKIPPED
[INFO] Distributed OSGi System Tests Multi-Bundle ......... SKIPPED
[INFO] Distributed OSGi System Tests ...................... SKIPPED
[INFO] ------------------------------------------------------------------------
[INFO] BUILD FAILURE
[INFO] ------------------------------------------------------------------------
[INFO] Total time: 01:47 min
[INFO] Finished at: 2016-07-25T12:50:40+00:00
[INFO] Final Memory: 37M/111M
[INFO] ------------------------------------------------------------------------
[ERROR] Failed to execute goal on project cxf-dosgi-ri-common: Could not resolve dependencies
for project org.apache.cxf.dosgi:cxf-dosgi-ri-common:bundle:2.0-SNAPSHOT: Failed to collect
dependencies at org.apache.cxf:cxf-core:jar:3.1.7-SNAPSHOT: Failed to read artifact descriptor
for org.apache.cxf:cxf-core:jar:3.1.7-SNAPSHOT: Could not find artifact org.apache.cxf:cxf-parent:pom:3.1.7-SNAPSHOT
in Nexus (http://repository.apache.org/snapshots) -> [Help 1]
org.apache.maven.lifecycle.LifecycleExecutionException: Failed to execute goal on project
cxf-dosgi-ri-common: Could not resolve dependencies for project org.apache.cxf.dosgi:cxf-dosgi-ri-common:bundle:2.0-SNAPSHOT:
Failed to collect dependencies at org.apache.cxf:cxf-core:jar:3.1.7-SNAPSHOT
	at org.apache.maven.lifecycle.internal.LifecycleDependencyResolver.getDependencies(LifecycleDependencyResolver.java:220)
	at org.apache.maven.lifecycle.internal.LifecycleDependencyResolver.resolveProjectDependencies(LifecycleDependencyResolver.java:127)
	at org.apache.maven.lifecycle.internal.MojoExecutor.ensureDependenciesAreResolved(MojoExecutor.java:257)
	at org.apache.maven.lifecycle.internal.MojoExecutor.execute(MojoExecutor.java:200)
	at org.apache.maven.lifecycle.internal.MojoExecutor.execute(MojoExecutor.java:153)
	at org.apache.maven.lifecycle.internal.MojoExecutor.execute(MojoExecutor.java:145)
	at org.apache.maven.lifecycle.internal.LifecycleModuleBuilder.buildProject(LifecycleModuleBuilder.java:116)
	at org.apache.maven.lifecycle.internal.LifecycleModuleBuilder.buildProject(LifecycleModuleBuilder.java:80)
	at org.apache.maven.lifecycle.internal.builder.singlethreaded.SingleThreadedBuilder.build(SingleThreadedBuilder.java:51)
	at org.apache.maven.lifecycle.internal.LifecycleStarter.execute(LifecycleStarter.java:120)
	at org.apache.maven.DefaultMaven.doExecute(DefaultMaven.java:355)
	at org.apache.maven.DefaultMaven.execute(DefaultMaven.java:155)
	at org.jvnet.hudson.maven3.launcher.Maven32Launcher.main(Maven32Launcher.java:132)
	at sun.reflect.NativeMethodAccessorImpl.invoke0(Native Method)
	at sun.reflect.NativeMethodAccessorImpl.invoke(NativeMethodAccessorImpl.java:57)
	at sun.reflect.DelegatingMethodAccessorImpl.invoke(DelegatingMethodAccessorImpl.java:43)
	at java.lang.reflect.Method.invoke(Method.java:606)
	at org.codehaus.plexus.classworlds.launcher.Launcher.launchStandard(Launcher.java:330)
	at org.codehaus.plexus.classworlds.launcher.Launcher.launch(Launcher.java:238)
	at jenkins.maven3.agent.Maven32Main.launch(Maven32Main.java:186)
	at sun.reflect.NativeMethodAccessorImpl.invoke0(Native Method)
	at sun.reflect.NativeMethodAccessorImpl.invoke(NativeMethodAccessorImpl.java:57)
	at sun.reflect.DelegatingMethodAccessorImpl.invoke(DelegatingMethodAccessorImpl.java:43)
	at java.lang.reflect.Method.invoke(Method.java:606)
	at hudson.maven.Maven3Builder.call(Maven3Builder.java:136)
	at hudson.maven.Maven3Builder.call(Maven3Builder.java:71)
	at hudson.remoting.UserRequest.perform(UserRequest.java:120)
	at hudson.remoting.UserRequest.perform(UserRequest.java:48)
	at hudson.remoting.Request$2.run(Request.java:326)
	at hudson.remoting.InterceptingExecutorService$1.call(InterceptingExecutorService.java:68)
	at java.util.concurrent.FutureTask.run(FutureTask.java:262)
	at java.util.concurrent.ThreadPoolExecutor.runWorker(ThreadPoolExecutor.java:1145)
	at java.util.concurrent.ThreadPoolExecutor$Worker.run(ThreadPoolExecutor.java:615)
	at java.lang.Thread.run(Thread.java:745)
Caused by: org.apache.maven.project.DependencyResolutionException: Could not resolve dependencies
for project org.apache.cxf.dosgi:cxf-dosgi-ri-common:bundle:2.0-SNAPSHOT: Failed to collect
dependencies at org.apache.cxf:cxf-core:jar:3.1.7-SNAPSHOT
	at org.apache.maven.project.DefaultProjectDependenciesResolver.resolve(DefaultProjectDependenciesResolver.java:180)
	at org.apache.maven.lifecycle.internal.LifecycleDependencyResolver.getDependencies(LifecycleDependencyResolver.java:195)
	... 33 more
Caused by: org.eclipse.aether.collection.DependencyCollectionException: Failed to collect
dependencies at org.apache.cxf:cxf-core:jar:3.1.7-SNAPSHOT
	at org.eclipse.aether.internal.impl.DefaultDependencyCollector.collectDependencies(DefaultDependencyCollector.java:291)
	at org.eclipse.aether.internal.impl.DefaultRepositorySystem.collectDependencies(DefaultRepositorySystem.java:316)
	at org.apache.maven.project.DefaultProjectDependenciesResolver.resolve(DefaultProjectDependenciesResolver.java:172)
	... 34 more
Caused by: org.eclipse.aether.resolution.ArtifactDescriptorException: Failed to read artifact
descriptor for org.apache.cxf:cxf-core:jar:3.1.7-SNAPSHOT
	at org.apache.maven.repository.internal.DefaultArtifactDescriptorReader.loadPom(DefaultArtifactDescriptorReader.java:337)
	at org.apache.maven.repository.internal.DefaultArtifactDescriptorReader.readArtifactDescriptor(DefaultArtifactDescriptorReader.java:217)
	at org.eclipse.aether.internal.impl.DefaultDependencyCollector.resolveCachedArtifactDescriptor(DefaultDependencyCollector.java:525)
	at org.eclipse.aether.internal.impl.DefaultDependencyCollector.getArtifactDescriptorResult(DefaultDependencyCollector.java:509)
	at org.eclipse.aether.internal.impl.DefaultDependencyCollector.processDependency(DefaultDependencyCollector.java:409)
	at org.eclipse.aether.internal.impl.DefaultDependencyCollector.processDependency(DefaultDependencyCollector.java:363)
	at org.eclipse.aether.internal.impl.DefaultDependencyCollector.process(DefaultDependencyCollector.java:351)
	at org.eclipse.aether.internal.impl.DefaultDependencyCollector.collectDependencies(DefaultDependencyCollector.java:254)
	... 36 more
Caused by: org.apache.maven.model.resolution.UnresolvableModelException: Could not find artifact
org.apache.cxf:cxf-parent:pom:3.1.7-SNAPSHOT in Nexus (http://repository.apache.org/snapshots)
	at org.apache.maven.repository.internal.DefaultModelResolver.resolveModel(DefaultModelResolver.java:177)
	at org.apache.maven.repository.internal.DefaultModelResolver.resolveModel(DefaultModelResolver.java:226)
	at org.apache.maven.model.building.DefaultModelBuilder.readParentExternally(DefaultModelBuilder.java:899)
	at org.apache.maven.model.building.DefaultModelBuilder.readParent(DefaultModelBuilder.java:751)
	at org.apache.maven.model.building.DefaultModelBuilder.build(DefaultModelBuilder.java:309)
	at org.apache.maven.repository.internal.DefaultArtifactDescriptorReader.loadPom(DefaultArtifactDescriptorReader.java:328)
	... 43 more
Caused by: org.eclipse.aether.resolution.ArtifactResolutionException: Could not find artifact
org.apache.cxf:cxf-parent:pom:3.1.7-SNAPSHOT in Nexus (http://repository.apache.org/snapshots)
	at org.eclipse.aether.internal.impl.DefaultArtifactResolver.resolve(DefaultArtifactResolver.java:444)
	at org.eclipse.aether.internal.impl.DefaultArtifactResolver.resolveArtifacts(DefaultArtifactResolver.java:246)
	at org.eclipse.aether.internal.impl.DefaultArtifactResolver.resolveArtifact(DefaultArtifactResolver.java:223)
	at org.apache.maven.repository.internal.DefaultModelResolver.resolveModel(DefaultModelResolver.java:173)
	... 48 more
Caused by: org.eclipse.aether.transfer.ArtifactNotFoundException: Could not find artifact
org.apache.cxf:cxf-parent:pom:3.1.7-SNAPSHOT in Nexus (http://repository.apache.org/snapshots)
	at org.eclipse.aether.connector.basic.ArtifactTransportListener.transferFailed(ArtifactTransportListener.java:39)
	at org.eclipse.aether.connector.basic.BasicRepositoryConnector$TaskRunner.run(BasicRepositoryConnector.java:355)
	at org.eclipse.aether.util.concurrency.RunnableErrorForwarder$1.run(RunnableErrorForwarder.java:67)
	at org.eclipse.aether.connector.basic.BasicRepositoryConnector$DirectExecutor.execute(BasicRepositoryConnector.java:581)
	at org.eclipse.aether.connector.basic.BasicRepositoryConnector.get(BasicRepositoryConnector.java:249)
	at org.eclipse.aether.internal.impl.DefaultArtifactResolver.performDownloads(DefaultArtifactResolver.java:520)
	at org.eclipse.aether.internal.impl.DefaultArtifactResolver.resolve(DefaultArtifactResolver.java:421)
	... 51 more
[ERROR] 
[ERROR] Re-run Maven using the -X switch to enable full debug logging.
[ERROR] 
[ERROR] For more information about the errors and possible solutions, please read the following
articles:
[ERROR] [Help 1] http://cwiki.apache.org/confluence/display/MAVEN/DependencyResolutionException
[ERROR] 
[ERROR] After correcting the problems, you can resume the build with the command
[ERROR]   mvn <goals> -rf :cxf-dosgi-ri-common
[JENKINS] Archiving <https://builds.apache.org/job/CXF-DOSGi/ws/samples/greeter/client/pom.xml>
to org.apache.cxf.dosgi.samples/cxf-dosgi-ri-samples-greeter-client/2.0-SNAPSHOT/cxf-dosgi-ri-samples-greeter-client-2.0-SNAPSHOT.pom
[JENKINS] Archiving <https://builds.apache.org/job/CXF-DOSGi/ws/parent/pom.xml> to org.apache.cxf.dosgi/cxf-dosgi-ri-parent/2.0-SNAPSHOT/cxf-dosgi-ri-parent-2.0-SNAPSHOT.pom
[JENKINS] Archiving <https://builds.apache.org/job/CXF-DOSGi/ws/samples/ds/impl/pom.xml>
to org.apache.cxf.dosgi.samples/cxf-dosgi-ri-samples-ds-impl/2.0-SNAPSHOT/cxf-dosgi-ri-samples-ds-impl-2.0-SNAPSHOT.pom
[JENKINS] Archiving <https://builds.apache.org/job/CXF-DOSGi/ws/pom.xml> to org.apache.cxf.dosgi/cxf-dosgi-ri/2.0-SNAPSHOT/cxf-dosgi-ri-2.0-SNAPSHOT.pom
[JENKINS] Archiving <https://builds.apache.org/job/CXF-DOSGi/ws/distribution/multi-bundle/pom.xml>
to org.apache.cxf.dosgi/cxf-dosgi-ri-multibundle-distribution/2.0-SNAPSHOT/cxf-dosgi-ri-multibundle-distribution-2.0-SNAPSHOT.pom
[JENKINS] Archiving <https://builds.apache.org/job/CXF-DOSGi/ws/samples/greeter_rest/impl/pom.xml>
to org.apache.cxf.dosgi.samples/cxf-dosgi-ri-samples-greeter-rest-impl/2.0-SNAPSHOT/cxf-dosgi-ri-samples-greeter-rest-impl-2.0-SNAPSHOT.pom
[JENKINS] Archiving <https://builds.apache.org/job/CXF-DOSGi/ws/provider-rs/pom.xml>
to org.apache.cxf.dosgi/cxf-dosgi-ri-provider-rs/2.0-SNAPSHOT/cxf-dosgi-ri-provider-rs-2.0-SNAPSHOT.pom
[JENKINS] Archiving <https://builds.apache.org/job/CXF-DOSGi/ws/samples/greeter_rest/pom.xml>
to org.apache.cxf.dosgi.samples/cxf-dosgi-ri-samples-greeter-rest-parent/2.0-SNAPSHOT/cxf-dosgi-ri-samples-greeter-rest-parent-2.0-SNAPSHOT.pom
[JENKINS] Archiving <https://builds.apache.org/job/CXF-DOSGi/ws/samples/pom.xml> to
org.apache.cxf.dosgi.samples/cxf-dosgi-ri-samples/2.0-SNAPSHOT/cxf-dosgi-ri-samples-2.0-SNAPSHOT.pom
[JENKINS] Archiving <https://builds.apache.org/job/CXF-DOSGi/ws/samples/ds/pom.xml>
to org.apache.cxf.dosgi.samples/cxf-dosgi-ri-samples-ds-parent/2.0-SNAPSHOT/cxf-dosgi-ri-samples-ds-parent-2.0-SNAPSHOT.pom
[JENKINS] Archiving <https://builds.apache.org/job/CXF-DOSGi/ws/provider-ws/pom.xml>
to org.apache.cxf.dosgi/cxf-dosgi-ri-provider-ws/2.0-SNAPSHOT/cxf-dosgi-ri-provider-ws-2.0-SNAPSHOT.pom
[JENKINS] Archiving <https://builds.apache.org/job/CXF-DOSGi/ws/itests/pom.xml> to org.apache.cxf.dosgi.systests/cxf-dosgi-ri-itests/2.0-SNAPSHOT/cxf-dosgi-ri-itests-2.0-SNAPSHOT.pom
[JENKINS] Archiving <https://builds.apache.org/job/CXF-DOSGi/ws/itests/multi-bundle/pom.xml>
to org.apache.cxf.dosgi.systests/cxf-dosgi-ri-itests-multibundle/2.0-SNAPSHOT/cxf-dosgi-ri-itests-multibundle-2.0-SNAPSHOT.pom
[JENKINS] Archiving <https://builds.apache.org/job/CXF-DOSGi/ws/samples/security_filter/pom.xml>
to org.apache.cxf.dosgi.samples/cxf-dosgi-ri-samples-security/2.0-SNAPSHOT/cxf-dosgi-ri-samples-security-2.0-SNAPSHOT.pom
[JENKINS] Archiving <https://builds.apache.org/job/CXF-DOSGi/ws/distribution/sources/pom.xml>
to org.apache.cxf.dosgi/cxf-dosgi-ri-source-distribution/2.0-SNAPSHOT/cxf-dosgi-ri-source-distribution-2.0-SNAPSHOT.pom
[JENKINS] Archiving <https://builds.apache.org/job/CXF-DOSGi/ws/samples/greeter/interface/pom.xml>
to org.apache.cxf.dosgi.samples/cxf-dosgi-ri-samples-greeter-interface/2.0-SNAPSHOT/cxf-dosgi-ri-samples-greeter-interface-2.0-SNAPSHOT.pom
[JENKINS] Archiving <https://builds.apache.org/job/CXF-DOSGi/ws/samples/greeter/pom.xml>
to org.apache.cxf.dosgi.samples/cxf-dosgi-ri-samples-greeter-parent/2.0-SNAPSHOT/cxf-dosgi-ri-samples-greeter-parent-2.0-SNAPSHOT.pom
[JENKINS] Archiving <https://builds.apache.org/job/CXF-DOSGi/ws/decorator/pom.xml> to
org.apache.cxf.dosgi/cxf-dosgi-ri-decorator/2.0-SNAPSHOT/cxf-dosgi-ri-decorator-2.0-SNAPSHOT.pom
[JENKINS] Archiving <https://builds.apache.org/job/CXF-DOSGi/ws/decorator/target/cxf-dosgi-ri-decorator-2.0-SNAPSHOT.jar>
to org.apache.cxf.dosgi/cxf-dosgi-ri-decorator/2.0-SNAPSHOT/cxf-dosgi-ri-decorator-2.0-SNAPSHOT.jar
[JENKINS] Archiving <https://builds.apache.org/job/CXF-DOSGi/ws/samples/greeter_rest/client/pom.xml>
to org.apache.cxf.dosgi.samples/cxf-dosgi-ri-samples-greeter-rest-client/2.0-SNAPSHOT/cxf-dosgi-ri-samples-greeter-rest-client-2.0-SNAPSHOT.pom
[JENKINS] Archiving <https://builds.apache.org/job/CXF-DOSGi/ws/distribution/repository/pom.xml>
to org.apache.cxf.dosgi/cxf-dosgi-ri-repository/2.0-SNAPSHOT/cxf-dosgi-ri-repository-2.0-SNAPSHOT.pom
[JENKINS] Archiving <https://builds.apache.org/job/CXF-DOSGi/ws/distribution/pom.xml>
to org.apache.cxf.dosgi/cxf-dosgi-ri-distribution-parent/2.0-SNAPSHOT/cxf-dosgi-ri-distribution-parent-2.0-SNAPSHOT.pom
[JENKINS] Archiving <https://builds.apache.org/job/CXF-DOSGi/ws/common/pom.xml> to org.apache.cxf.dosgi/cxf-dosgi-ri-common/2.0-SNAPSHOT/cxf-dosgi-ri-common-2.0-SNAPSHOT.pom
[JENKINS] Archiving <https://builds.apache.org/job/CXF-DOSGi/ws/samples/ds/interface/pom.xml>
to org.apache.cxf.dosgi.samples/cxf-dosgi-ri-samples-ds-interface/2.0-SNAPSHOT/cxf-dosgi-ri-samples-ds-interface-2.0-SNAPSHOT.pom
[JENKINS] Archiving <https://builds.apache.org/job/CXF-DOSGi/ws/samples/greeter/impl/pom.xml>
to org.apache.cxf.dosgi.samples/cxf-dosgi-ri-samples-greeter-impl/2.0-SNAPSHOT/cxf-dosgi-ri-samples-greeter-impl-2.0-SNAPSHOT.pom
[JENKINS] Archiving <https://builds.apache.org/job/CXF-DOSGi/ws/samples/greeter_rest/interface/pom.xml>
to org.apache.cxf.dosgi.samples/cxf-dosgi-ri-samples-greeter-rest-interface/2.0-SNAPSHOT/cxf-dosgi-ri-samples-greeter-rest-interface-2.0-SNAPSHOT.pom
[JENKINS] Archiving <https://builds.apache.org/job/CXF-DOSGi/ws/samples/ds/client/pom.xml>
to org.apache.cxf.dosgi.samples/cxf-dosgi-ri-samples-ds-client/2.0-SNAPSHOT/cxf-dosgi-ri-samples-ds-client-2.0-SNAPSHOT.pom
[JENKINS] Archiving <https://builds.apache.org/job/CXF-DOSGi/ws/distribution/features/pom.xml>
to org.apache.cxf.dosgi/cxf-dosgi/2.0-SNAPSHOT/cxf-dosgi-2.0-SNAPSHOT.pom
channel stopped

Mime
View raw message